{"text_format":"1","workbook":"xlsx","n_sheets":5,"sheets":["Dateneingabe","Berechnungen","Korrektur","Hilfe","Bewertung"],"not_rendered":{"charts":0,"images":2,"macros":1,"external_links":0,"defined_names":16,"comments":2,"pivot_tables":0},"unopened":[],"bounds":{"document_bytes":16777216,"sheet_cells":100000,"rows_first":2000,"rows_last":500,"rows_between":2000,"halvings":0,"cell_chars":16384,"cell_head_chars":4096},"cells_cut":0,"cells_raw":0,"read":"whole","date_system":"1900"}

{"sheet":"Dateneingabe","index":0,"n_rows":84,"n_cols":52,"rows_kept":84,"cut":false,"hidden":false,"merged":[[61,4,61,8],[61,10,61,14],[47,4,47,8],[47,10,47,14],[2,3,2,5],[4,3,4,5],[6,3,6,5],[11,3,11,5],[13,3,13,10],[15,4,15,8],[15,10,15,14],[31,3,31,10],[33,4,33,8],[33,10,33,14],[45,3,45,10],[59,3,59,10]]}
["Verzeichnis des Umlaufvermögens und der Finanzbestände"]
[]
[null,null,"Eingabefelder:","xxx",null,null,null,"In diese Felder musst du betriebliche Daten eingeben!"]
[]
[null,null,null,"xxx",null,null,null,"Die hier enthaltenen Daten kannst du in betriebliche Werte verändern!",null,null,null,null,null,null,null,null,null,null,"Gruppe",{"$f":"IF(O9=\"\",\"\",O9)","v":20}]
[]
[null,null,null,"xxx",null,null,null,"Hier kannst du die Kalkulation um betriebsspezifische Werte ergänzen!",null,null,null,null,null,null,null,null,null,null,"Spalte","Spalte"]
[]
[null,null,null,null,null,null,null,null,null,null,null,null,null,"Gruppe ",20,null,null,null,"E","O"]
[]
[]
[null,"Aktuelles Jahr",null,{"$f":"YEAR(TODAY())","v":2024}]
[]
[null,"Viehart",null,"RINDER"]
[]
[null,null,null,null,"Bestand am 01. 01.",null,null,null,null,null,"Bestand am 31. 12.",null,null,null,null,null,null,null,null,null,null,"Gruppe",1,2,3,4,5,6,7,8,9,10,11,12,13,14,15,16,17,18,19,20,21,22,23,24,25,26,27,28,29,30]
[null,null,null,null,"Menge",null,null,null,"€/Einheit",null,"Menge",null,null,null,"€/Einheit",null,null,null,null,null,null,"%","AV",0.14000000000000001,0.08,0.11,-0.02,-0.09,-0.16,-0.05,0.06,0.05,0.24,-0.03,-0.12,-0.21,-0.08,7.0000000000000007E-2,0.17,0.09,-0.04,-0.11,0.22,-0.09,0.14000000000000001,0.16,-0.13,0.11,-0.12,-0.17,0.06,-0.15]
[null,1,"Kühe",null,9,"Stk",null,null,1145," €",10,"Stk",null,null,1146," €",null,null,{"$f":"IF(OR($I18=\"\",$E18=\"\"),\"\",VLOOKUP($C18,$V$16:$AZ$73,1+$O$9,0))","v":1019},{"$f":"IF(OR(S18=\"\",K18=\"\"),\"\",ROUND(S18+S18*U18,0))","v":1020},1E-3,{"$f":"C18","v":"Kühe"},{"$f":"IF(I18=\"\",\"\",I18)","v":1145},{"$f":"IF($W18=\"\",\"\",ROUND($W18*(1+X$17),0))","v":1305},{"$f":"IF($W18=\"\",\"\",ROUND($W18*(1+Y$17),0))","v":1237},1271,1122,1042,962,1088,1214,1202,1420,1111,1008,905,1053,1225,1340,1248,{"$f":"IF($W18=\"\",\"\",ROUND($W18*(1+AO$17),0))","v":1099},1019,1397,1042,1305,1328,996,1271,1008,950,1214,973]
[]
[null,2,"Kalbinnen",null,6,"Stk",null,null,1253," €",4,"Stk",null,null,1249," €",null,null,{"$f":"IF(OR($I20=\"\",$E20=\"\"),\"\",VLOOKUP($C20,$V$16:$AZ$73,1+$O$9,0))","v":1115},{"$f":"IF(OR(S20=\"\",K20=\"\"),\"\",ROUND(S20+S20*U20,0))","v":1112},-3.0000000000000001E-3,{"$f":"C20","v":"Kalbinnen"},{"$f":"IF(I20=\"\",\"\",I20)","v":1253},{"$f":"IF($W20=\"\",\"\",ROUND($W20*(1+X$17),0))","v":1428},1353,1391,1228,1140,1053,1190,1328,1316,1554,1215,{"$f":"IF($W20=\"\",\"\",ROUND($W20*(1+AI$17),0))","v":1103},990,1153,1341,1466,1366,1203,1115,1529,1140,1428,1453,1090,1391,1103,1040,1328,1065]
[]
[null,3,"Jungvieh 1 - 2 J.",null,4,"Stk",null,null,800," €",5,"Stk",null,null,798," €",null,null,{"$f":"IF(OR($I22=\"\",$E22=\"\"),\"\",VLOOKUP($C22,$V$16:$AZ$73,1+$O$9,0))","v":712},{"$f":"IF(OR(S22=\"\",K22=\"\"),\"\",ROUND(S22+S22*U22,0))","v":711},-2E-3,{"$f":"C22","v":"Jungvieh 1 - 2 J."},{"$f":"IF(I22=\"\",\"\",I22)","v":800},{"$f":"IF($W22=\"\",\"\",ROUND($W22*(1+X$17),0))","v":912},864,888,784,728,672,760,848,840,992,776,704,632,736,856,936,872,768,712,976,728,912,928,696,888,704,664,848,680]
[]
[null,4,"Jungvieh bis 1 J.",null,5,"Stk",null,null,591," €",6,"Stk",null,null,590," €",null,null,{"$f":"IF(OR($I24=\"\",$E24=\"\"),\"\",VLOOKUP($C24,$V$16:$AZ$73,1+$O$9,0))","v":526},{"$f":"IF(OR(S24=\"\",K24=\"\"),\"\",ROUND(S24+S24*U24,0))","v":525},-1E-3,{"$f":"C24","v":"Jungvieh bis 1 J."},{"$f":"IF(I24=\"\",\"\",I24)","v":591},{"$f":"IF($W24=\"\",\"\",ROUND($W24*(1+X$17),0))","v":674},638,656,579,538,496,561,626,621,733,573,520,467,544,632,691,644,567,526,721,538,674,686,514,656,520,491,626,502]
[]
[null,5,"Kälber weib.",null,4,"Stk",null,null,331," €",4,"Stk",null,null,332," €",null,null,{"$f":"IF(OR($I26=\"\",$E26=\"\"),\"\",VLOOKUP($C26,$V$16:$AZ$73,1+$O$9,0))","v":295},{"$f":"IF(OR(S26=\"\",K26=\"\"),\"\",ROUND(S26+S26*U26,0))","v":296},4.0000000000000001E-3,{"$f":"C26","v":"Kälber weib."},{"$f":"IF(I26=\"\",\"\",I26)","v":331},{"$f":"IF($W26=\"\",\"\",ROUND($W26*(1+X$17),0))","v":377},357,367,324,301,278,314,351,348,410,321,291,261,305,354,387,361,318,295,404,301,377,384,288,367,291,275,351,281]
[]
[null,6,"Kälber männ.",null,3,"Stk",null,null,201," €",2,"Stk",null,null,201," €",null,null,{"$f":"IF(OR($I28=\"\",$E28=\"\"),\"\",VLOOKUP($C28,$V$16:$AZ$73,1+$O$9,0))","v":179},{"$f":"IF(OR(S28=\"\",K28=\"\"),\"\",ROUND(S28+S28*U28,0))","v":179},1E-3,{"$f":"C28","v":"Kälber männ."},{"$f":"IF(I28=\"\",\"\",I28)","v":201},{"$f":"IF($W28=\"\",\"\",ROUND($W28*(1+X$17),0))","v":229},217,223,197,183,169,191,213,211,249,195,{"$f":"IF($W28=\"\",\"\",ROUND($W28*(1+AI$17),0))","v":177},159,185,215,235,219,193,179,245,183,229,233,175,223,177,167,213,171]
[]
[null,7,null,null,null,"Stk",null,null,null," €",null,"Stk",null,null,null," €",null,null,{"$f":"IF(OR($I30=\"\",$E30=\"\"),\"\",VLOOKUP($C30,$V$16:$AZ$73,1+$O$9,0))","v":""},{"$f":"IF(OR(S30=\"\",K30=\"\"),\"\",ROUND(S30+S30*U30,0))","v":""},0,{"$f":"C30","v":0},{"$f":"IF(I30=\"\",\"\",I30)","v":""},{"$f":"IF($W30=\"\",\"\",ROUND($W30*(1+X$17),0))","v":""},"","","","","","","","","","","","","","","","","","","","","","","","","","","",""]
[]
[null,"Viehart",null,"Schweine"]
[]
[null,null,null,null,"Bestand am 01. 01.",null,null,null,null,null,"Bestand am 31. 12."]
[null,null,null,null,"Menge",null,null,null,"€/Einheit",null,"Menge",null,null,null,"€/Einheit"]
[null,1,"Mastsauen",null,2,"Stk",null,null,167," €",7,"Stk",null,null,167," €",null,null,{"$f":"IF(OR($I36=\"\",$E36=\"\"),\"\",VLOOKUP($C36,$V$16:$AZ$73,1+$O$9,0))","v":148.63},{"$f":"IF(OR(S36=\"\",K36=\"\"),\"\",ROUND(S36+S36*U36,0))","v":149},0,{"$f":"C36","v":"Mastsauen"},{"$f":"IF(I36=\"\",\"\",I36)","v":167},{"$f":"IF($W36=\"\",\"\",ROUND($W36*(1+X$17),2))","v":190.38},180.36,185.37,163.66,151.97,140.28,158.65,177.02,175.35,207.08,161.99,{"$f":"IF($W36=\"\",\"\",ROUND($W36*(1+AI$17),2))","v":146.96},131.93,153.63999999999999,178.69,195.39,182.03,160.32,148.63,203.74,151.97,190.38,193.72,145.29,185.37,146.96,138.61000000000001,177.02,141.94999999999999]
[]
[null,2,"Ferkel",null,2,"Stk",null,null,62," €",4,"Stk",null,null,62," €",null,null,{"$f":"IF(OR($I38=\"\",$E38=\"\"),\"\",VLOOKUP($C38,$V$16:$AZ$73,1+$O$9,0))","v":55.18},{"$f":"IF(OR(S38=\"\",K38=\"\"),\"\",ROUND(S38+S38*U38,0))","v":55},0,{"$f":"C38","v":"Ferkel"},{"$f":"IF(I38=\"\",\"\",I38)","v":62},{"$f":"IF($W38=\"\",\"\",ROUND($W38*(1+X$17),2))","v":70.680000000000007},66.959999999999994,68.819999999999993,60.76,56.42,52.08,58.9,65.72,65.099999999999994,76.88,60.14,54.56,48.98,57.04,66.34,72.540000000000006,67.58,59.52,55.18,75.64,56.42,70.680000000000007,71.92,53.94,68.819999999999993,54.56,51.46,65.72,52.7]
[]
[null,3,null,null,null,"Stk",null,null,null," €",null,"Stk",null,null,null," €",null,null,{"$f":"IF(OR($I40=\"\",$E40=\"\"),\"\",VLOOKUP($C40,$V$16:$AZ$73,1+$O$9,0))","v":""},{"$f":"IF(OR(S40=\"\",K40=\"\"),\"\",ROUND(S40+S40*U40,0))","v":""},2E-3,{"$f":"C40","v":0},{"$f":"IF(I40=\"\",\"\",I40)","v":""},{"$f":"IF($W40=\"\",\"\",ROUND($W40*(1+X$17),0))","v":""},"","","","","","","","","","","","","","","","","","","","","","","","","","","",""]
[]
[null,4,null,null,null,"Stk",null,null,null," €",null,"Stk",null,null,null," €",null,null,{"$f":"IF(OR($I42=\"\",$E42=\"\"),\"\",VLOOKUP($C42,$V$16:$AZ$73,1+$O$9,0))","v":""},{"$f":"IF(OR(S42=\"\",K42=\"\"),\"\",ROUND(S42+S42*U42,0))","v":""},8.0000000000000002E-3,{"$f":"C42","v":0},{"$f":"IF(I42=\"\",\"\",I42)","v":""},{"$f":"IF($W42=\"\",\"\",ROUND($W42*(1+X$17),0))","v":""},"","","","","","","","","","","","","","","","","","","","","","","","","","","",""]
[]
[null,5,null,null,null,"Stk",null,null,null," €",null,"Stk",null,null,null," €",null,null,{"$f":"IF(OR($I44=\"\",$E44=\"\"),\"\",VLOOKUP($C44,$V$16:$AZ$73,1+$O$9,0))","v":""},{"$f":"IF(OR(S44=\"\",K44=\"\"),\"\",ROUND(S44+S44*U44,0))","v":""},-3.0000000000000001E-3,{"$f":"C44","v":0},{"$f":"IF(I44=\"\",\"\",I44)","v":""},{"$f":"IF($W44=\"\",\"\",ROUND($W44*(1+X$17),0))","v":""},"","","","","","","","","","","","","","","","","","","","","","","","","","","",""]
[]
[null,"Vorratsart",null,"Selbst erzeugte Vorräte"]
[]
[null,null,null,null,"Bestand am 01. 01.",null,null,null,null,null,"Bestand am 31. 12."]
[null,null,null,null,"Menge",null,null,null,"€/Einheit",null,"Menge",null,null,null,"€/Einheit"]
[null,1,"Gerste",null,100,null,"kg",null,0.14000000000000001," €",800,null,"kg",null,0.16," €",null,null,{"$f":"IF(OR($I50=\"\",$E50=\"\"),\"\",VLOOKUP($C50,$V$16:$AZ$73,1+$O$9,0))","v":0.12},{"$f":"IF(OR(S50=\"\",K50=\"\"),\"\",ROUND(S50+S50*U50,2))","v":0.13},0.12,{"$f":"C50","v":"Gerste"},{"$f":"IF(I50=\"\",\"\",I50)","v":0.14000000000000001},{"$f":"IF($W50=\"\",\"\",ROUND($W50*(1+X$17),2))","v":0.16},0.15,0.16,0.14000000000000001,0.13,0.12,0.13,0.15,0.15,0.17,0.14000000000000001,0.12,0.11,0.13,0.15,0.16,0.15,0.13,0.12,0.17,0.13,0.16,0.16,0.12,0.16,0.12,0.12,0.15,0.12]
[]
[null,2,"Futterkartoffeln",null,1350,null,"kg",null,0.08," €",1500,null,"kg",null,7.0000000000000007E-2," €",null,null,{"$f":"IF(OR($I52=\"\",$E52=\"\"),\"\",VLOOKUP($C52,$V$16:$AZ$73,1+$O$9,0))","v":7.0000000000000007E-2},{"$f":"IF(OR(S52=\"\",K52=\"\"),\"\",ROUND(S52+S52*U52,2))","v":0.06},-0.13,{"$f":"C52","v":"Futterkartoffeln"},{"$f":"IF(I52=\"\",\"\",I52)","v":0.08},{"$f":"IF($W52=\"\",\"\",ROUND($W52*(1+X$17),2))","v":0.09},0.09,0.09,0.08,7.0000000000000007E-2,7.0000000000000007E-2,0.08,0.08,0.08,0.1,0.08,7.0000000000000007E-2,0.06,7.0000000000000007E-2,0.09,0.09,0.09,0.08,7.0000000000000007E-2,0.1,7.0000000000000007E-2,0.09,0.09,7.0000000000000007E-2,0.09,7.0000000000000007E-2,7.0000000000000007E-2,0.08,7.0000000000000007E-2]
[]
[null,3,"Brennholz",null,30,null,null,null,27.5," €",4,null,null,null,29.7," €",null,null,{"$f":"IF(OR($I54=\"\",$E54=\"\"),\"\",VLOOKUP($C54,$V$16:$AZ$73,1+$O$9,0))","v":24.48},{"$f":"IF(OR(S54=\"\",K54=\"\"),\"\",ROUND(S54+S54*U54,2))","v":26.44},0.08,{"$f":"C54","v":"Brennholz"},{"$f":"IF(I54=\"\",\"\",I54)","v":27.5},{"$f":"IF($W54=\"\",\"\",ROUND($W54*(1+X$17),2))","v":31.35},29.7,30.53,26.95,25.03,23.1,26.13,29.15,28.88,34.1,26.68,24.2,21.73,25.3,29.43,32.18,29.98,26.4,24.48,33.549999999999997,25.03,31.35,31.9,23.93,30.53,24.2,22.83,29.15,23.38]
[]
[null,4,null,null,null,null,null,null,null," €",null,null,null,null,null," €",null,null,{"$f":"IF(OR($I56=\"\",$E56=\"\"),\"\",VLOOKUP($C56,$V$16:$AZ$73,1+$O$9,0))","v":""},{"$f":"IF(OR(S56=\"\",K56=\"\"),\"\",ROUND(S56+S56*U56,2))","v":""},0,{"$f":"C56","v":0},{"$f":"IF(I56=\"\",\"\",I56)","v":""},{"$f":"IF($W56=\"\",\"\",ROUND($W56*(1+X$17),2))","v":""},"","","","","","","","","","","","","","","","","","","","","","","","","","","",""]
[]
[null,5,null,null,null,null,null,null,null," €",null,null,null,null,null," €",null,null,{"$f":"IF(OR($I58=\"\",$E58=\"\"),\"\",VLOOKUP($C58,$V$16:$AZ$73,1+$O$9,0))","v":""},{"$f":"IF(OR(S58=\"\",K58=\"\"),\"\",ROUND(S58+S58*U58,2))","v":""},-0.09,{"$f":"C58","v":0},{"$f":"IF(I58=\"\",\"\",I58)","v":""},{"$f":"IF($W58=\"\",\"\",ROUND($W58*(1+X$17),2))","v":""},"","","","","","","","","","","","","","","","","","","","","","","","","","","",""]
[]
[null,"Vorratsart",null,"Zugekaufte Vorräte"]
[]
[null,null,null,null,"Bestand am 01. 01.",null,null,null,null,null,"Bestand am 31. 12."]
[null,null,null,null,"Menge",null,null,null,"€/Einheit",null,"Menge",null,null,null,"€/Einheit"]
[null,1,"Milchkraftfutter",null,650,null,"kg",null,0.25," €",1500,null,"kg",null,0.26," €",null,null,{"$f":"IF(OR($I64=\"\",$E64=\"\"),\"\",VLOOKUP($C64,$V$16:$AZ$73,1+$O$9,0))","v":0.22},{"$f":"IF(OR(S64=\"\",K64=\"\"),\"\",ROUND(S64+S64*U64,2))","v":0.23},0.04,{"$f":"C64","v":"Milchkraftfutter"},{"$f":"IF(I64=\"\",\"\",I64)","v":0.25},{"$f":"IF($W64=\"\",\"\",ROUND($W64*(1+X$17),2))","v":0.28999999999999998},0.27,0.28000000000000003,0.25,0.23,0.21,0.24,0.27,0.26,0.31,0.24,0.22,0.2,0.23,0.27,0.28999999999999998,0.27,0.24,0.22,0.31,0.23,0.28999999999999998,0.28999999999999998,0.22,0.28000000000000003,0.22,0.21,0.27,0.21]
[]
[null,2,"Weizenschrot",null,350,null,"kg",null,0.23," €",500,null,"kg",null,0.21," €",null,null,{"$f":"IF(OR($I66=\"\",$E66=\"\"),\"\",VLOOKUP($C66,$V$16:$AZ$73,1+$O$9,0))","v":0.2},{"$f":"IF(OR(S66=\"\",K66=\"\"),\"\",ROUND(S66+S66*U66,2))","v":0.19},-7.0000000000000007E-2,{"$f":"C66","v":"Weizenschrot"},{"$f":"IF(I66=\"\",\"\",I66)","v":0.23},{"$f":"IF($W66=\"\",\"\",ROUND($W66*(1+X$17),2))","v":0.26},0.25,0.26,0.23,0.21,0.19,0.22,0.24,0.24,0.28999999999999998,0.22,0.2,0.18,0.21,0.25,0.27,0.25,0.22,0.2,0.28000000000000003,0.21,0.26,0.27,0.2,0.26,0.2,0.19,0.24,0.2]
[]
[null,3,"Erbsenschrot",null,75,null,"kg",null,0.22," €",300,null,"kg",null,0.22," €",null,null,{"$f":"IF(OR($I68=\"\",$E68=\"\"),\"\",VLOOKUP($C68,$V$16:$AZ$73,1+$O$9,0))","v":0.2},{"$f":"IF(OR(S68=\"\",K68=\"\"),\"\",ROUND(S68+S68*U68,2))","v":0.2},0,{"$f":"C68","v":"Erbsenschrot"},{"$f":"IF(I68=\"\",\"\",I68)","v":0.22},{"$f":"IF($W68=\"\",\"\",ROUND($W68*(1+X$17),2))","v":0.25},0.24,0.24,0.22,0.2,0.18,0.21,0.23,0.23,0.27,0.21,0.19,0.17,0.2,0.24,0.26,0.24,0.21,0.2,0.27,0.2,0.25,0.26,0.19,0.24,0.19,0.18,0.23,0.19]
[]
[null,4,null,null,null,null,null,null,null," €",null,null,null,null,null," €",null,null,{"$f":"IF(OR($I70=\"\",$E70=\"\"),\"\",VLOOKUP($C70,$V$16:$AZ$73,1+$O$9,0))","v":""},{"$f":"IF(OR(S70=\"\",K70=\"\"),\"\",ROUND(S70+S70*U70,2))","v":""},0,{"$f":"C70","v":0},{"$f":"IF(I70=\"\",\"\",I70)","v":""},{"$f":"IF($W70=\"\",\"\",ROUND($W70*(1+X$17),2))","v":""},"","","","","","","","","","","","","","","","","","","","","","","","","","","",""]
[]
[null,5,null,null,null,null,null,null,null," €",null,null,null,null,null," €",null,null,{"$f":"IF(OR($I72=\"\",$E72=\"\"),\"\",VLOOKUP($C72,$V$16:$AZ$73,1+$O$9,0))","v":""},{"$f":"IF(OR(S72=\"\",K72=\"\"),\"\",ROUND(S72+S72*U72,2))","v":""},0.09,{"$f":"C72","v":0},{"$f":"IF(I72=\"\",\"\",I72)","v":""},{"$f":"IF($W72=\"\",\"\",ROUND($W72*(1+X$17),2))","v":""},"","","","","","","","","","","","","","","","","","","","","","","","","","","",""]
[]
["© Mag. Wolfgang Harasleben",null,null,null,null,null,null,null,null,null,null,null,null,null,null,null,"Version: 2024.02.26.022"]
[]
[]
["Einheiten",null,"Jahr",null,"Ankreuzen"]
["kg",null,{"$f":"C79-1","v":2021},null,"x"]
["Stk.",null,{"$f":"C80-1","v":2022}]
["Sack",null,{"$f":"C81-1","v":2023}]
[null,null,{"$f":"YEAR(TODAY())","v":2024}]
[null,null,{"$f":"C81+1","v":2025}]
[null,null,{"$f":"C82+1","v":2026}]
[null,null,{"$f":"C83+1","v":2027}]

{"sheet":"Berechnungen","index":1,"n_rows":2001,"n_cols":22,"rows_kept":2001,"cut":false,"hidden":false,"merged":[[0,12,1,14],[2,3,2,4],[2,6,2,7],[2,9,3,9],[15,1,17,1],[15,6,15,7],[17,8,19,9],[19,6,19,7]]}
[null,"Modell - Bewertung von Umlaufvermögen",null,null,null,null,null,null,null,null,null,null,"Anzeigen!",null,null,null,{"$f":"Dateneingabe!O9","v":20}]
[]
[null,null,null,"Bestand am 01. 01.",null,{"$f":"IF(Dateneingabe!D12=\"\",\"\",Dateneingabe!D12)","v":2024},"Bestand am 31. 12.",null,{"$f":"IF(Dateneingabe!D12=\"\",\"\",Dateneingabe!D12)","v":2024},"Mehr- Minderwert"]
[null,null,null,"Menge","€/Stück","Gesamt","Menge","€/Stück","Gesamt"]
[null,"V IEHBESTAND",null,null,null,null,null,null,null,null,null,null,"Pkte","/","Ges."]
[null,{"$f":"IF(Dateneingabe!D14=\"\",\"\",Dateneingabe!D14)","v":"RINDER"},null,null,null,null,null,null,null,null,null,null,null,null,null,null,null,null,null,"AB","SB","MW+/-"]
[null,{"$f":"IF(Dateneingabe!C18=\"\",\"\",Dateneingabe!C18)","v":"Kühe"},null,{"$f":"IF(Dateneingabe!E18=\"\",\"\",Dateneingabe!E18)","v":9},{"$f":"IF(Dateneingabe!S18=\"\",\"\",Dateneingabe!S18)","v":1019},null,{"$f":"IF(Dateneingabe!K18=\"\",\"\",Dateneingabe!K18)","v":10},{"$f":"IF(Dateneingabe!T18=\"\",\"\",Dateneingabe!T18)","v":1020},null,null,null,null,{"$f":"IF(AND(F7=\"\",I7=\"\",J7=\"\"),\"\",SUM(T7:V7))","v":""},"/",{"$f":"SUM(COUNTIF(T7:V7,1),COUNTIF(T7:V7,0))","v":3},null,null,null,null,{"$f":"IF(Korrektur!$J10=\"\",\"\",Korrektur!$J10)","v":0},{"$f":"IF(Korrektur!$J42=\"\",\"\",Korrektur!$J42)","v":0},{"$f":"IF(Korrektur!$J74=\"\",\"\",Korrektur!$J74)","v":0}]
[null,{"$f":"IF(Dateneingabe!C20=\"\",\"\",Dateneingabe!C20)","v":"Kalbinnen"},null,{"$f":"IF(Dateneingabe!E20=\"\",\"\",Dateneingabe!E20)","v":6},{"$f":"IF(Dateneingabe!S20=\"\",\"\",Dateneingabe!S20)","v":1115},null,{"$f":"IF(Dateneingabe!K20=\"\",\"\",Dateneingabe!K20)","v":4},{"$f":"IF(Dateneingabe!T20=\"\",\"\",Dateneingabe!T20)","v":1112},null,null,null,null,{"$f":"IF(AND(F8=\"\",I8=\"\",J8=\"\"),\"\",SUM(T8:V8))","v":""},"/",{"$f":"SUM(COUNTIF(T8:V8,1),COUNTIF(T8:V8,0))","v":3},null,null,null,null,{"$f":"IF(Korrektur!$J11=\"\",\"\",Korrektur!$J11)","v":0},{"$f":"IF(Korrektur!$J43=\"\",\"\",Korrektur!$J43)","v":0},{"$f":"IF(Korrektur!$J75=\"\",\"\",Korrektur!$J75)","v":0}]
[null,{"$f":"IF(Dateneingabe!C22=\"\",\"\",Dateneingabe!C22)","v":"Jungvieh 1 - 2 J."},null,{"$f":"IF(Dateneingabe!E22=\"\",\"\",Dateneingabe!E22)","v":4},{"$f":"IF(Dateneingabe!S22=\"\",\"\",Dateneingabe!S22)","v":712},null,{"$f":"IF(Dateneingabe!K22=\"\",\"\",Dateneingabe!K22)","v":5},{"$f":"IF(Dateneingabe!T22=\"\",\"\",Dateneingabe!T22)","v":711},null,null,null,null,"","/",3,null,null,null,null,{"$f":"IF(Korrektur!$J12=\"\",\"\",Korrektur!$J12)","v":0},{"$f":"IF(Korrektur!$J44=\"\",\"\",Korrektur!$J44)","v":0},{"$f":"IF(Korrektur!$J76=\"\",\"\",Korrektur!$J76)","v":0}]
[null,{"$f":"IF(Dateneingabe!C24=\"\",\"\",Dateneingabe!C24)","v":"Jungvieh bis 1 J."},null,{"$f":"IF(Dateneingabe!E24=\"\",\"\",Dateneingabe!E24)","v":5},{"$f":"IF(Dateneingabe!S24=\"\",\"\",Dateneingabe!S24)","v":526},null,{"$f":"IF(Dateneingabe!K24=\"\",\"\",Dateneingabe!K24)","v":6},{"$f":"IF(Dateneingabe!T24=\"\",\"\",Dateneingabe!T24)","v":525},null,null,null,null,"","/",3,null,null,null,null,{"$f":"IF(Korrektur!$J13=\"\",\"\",Korrektur!$J13)","v":0},{"$f":"IF(Korrektur!$J45=\"\",\"\",Korrektur!$J45)","v":0},{"$f":"IF(Korrektur!$J77=\"\",\"\",Korrektur!$J77)","v":0}]
[null,{"$f":"IF(Dateneingabe!C26=\"\",\"\",Dateneingabe!C26)","v":"Kälber weib."},null,{"$f":"IF(Dateneingabe!E26=\"\",\"\",Dateneingabe!E26)","v":4},{"$f":"IF(Dateneingabe!S26=\"\",\"\",Dateneingabe!S26)","v":295},null,{"$f":"IF(Dateneingabe!K26=\"\",\"\",Dateneingabe!K26)","v":4},{"$f":"IF(Dateneingabe!T26=\"\",\"\",Dateneingabe!T26)","v":296},null,null,null,null,"","/",3,null,null,null,null,{"$f":"IF(Korrektur!$J14=\"\",\"\",Korrektur!$J14)","v":0},{"$f":"IF(Korrektur!$J46=\"\",\"\",Korrektur!$J46)","v":0},{"$f":"IF(Korrektur!$J78=\"\",\"\",Korrektur!$J78)","v":0}]
[null,{"$f":"IF(Dateneingabe!C28=\"\",\"\",Dateneingabe!C28)","v":"Kälber männ."},null,{"$f":"IF(Dateneingabe!E28=\"\",\"\",Dateneingabe!E28)","v":3},{"$f":"IF(Dateneingabe!S28=\"\",\"\",Dateneingabe!S28)","v":179},null,{"$f":"IF(Dateneingabe!K28=\"\",\"\",Dateneingabe!K28)","v":2},{"$f":"IF(Dateneingabe!T28=\"\",\"\",Dateneingabe!T28)","v":179},null,null,null,null,"","/",3,null,null,null,null,{"$f":"IF(Korrektur!$J15=\"\",\"\",Korrektur!$J15)","v":0},{"$f":"IF(Korrektur!$J47=\"\",\"\",Korrektur!$J47)","v":0},{"$f":"IF(Korrektur!$J79=\"\",\"\",Korrektur!$J79)","v":0}]
[null,{"$f":"IF(Dateneingabe!C30=\"\",\"\",Dateneingabe!C30)","v":""},null,{"$f":"IF(Dateneingabe!E30=\"\",\"\",Dateneingabe!E30)","v":""},{"$f":"IF(Dateneingabe!S30=\"\",\"\",Dateneingabe!S30)","v":""},null,{"$f":"IF(Dateneingabe!K30=\"\",\"\",Dateneingabe!K30)","v":""},{"$f":"IF(Dateneingabe!T30=\"\",\"\",Dateneingabe!T30)","v":""},null,null,null,null,"","/",0,null,null,null,null,{"$f":"IF(Korrektur!$J16=\"\",\"\",Korrektur!$J16)","v":"-"},{"$f":"IF(Korrektur!$J48=\"\",\"\",Korrektur!$J48)","v":"-"},{"$f":"IF(Korrektur!$J80=\"\",\"\",Korrektur!$J80)","v":"-"}]
[null,{"$f":"\"Summe \"&B6","v":"Summe RINDER"},null,null,null,null,null,null,null,null,null,null,"","/",{"$f":"SUM(COUNTIF(T14:V14,1),COUNTIF(T14:V14,0))","v":3},null,null,null,null,{"$f":"IF(Korrektur!$J17=\"\",\"\",Korrektur!$J17)","v":0},{"$f":"IF(Korrektur!$J49=\"\",\"\",Korrektur!$J49)","v":0},{"$f":"IF(Korrektur!$J81=\"\",\"\",Korrektur!$J81)","v":0}]
[null,null,null,null,null,null,null,null,null,null,null,null,""]
[null,"Kreuze zutreffendes an! (ACHTUNG: Nur eine Antwort ist richtig!!)",null,"Mehrwert",null,{"$f":"IF(U16<>\"\",\"... in Höhe von:\",\"\")","v":""},{"$f":"IF(J14>0,J14,\"\")","v":""},null,null,null,null,null,"","/",{"$f":"SUM(COUNTIF(T16:V16,1),COUNTIF(T16:V16,0))","v":1},null,null,null,null,{"$f":"IF(Korrektur!$J106=\"\",\"\",Korrektur!$J106)","v":0},{"$f":"IF(AND(G16=\"\",Hilfe!G16<>\"\"),0,IF(Hilfe!G16=\"\",\"\",IF(G16=Hilfe!G16,1,0)))","v":""}]
[]
[null,null,null,"gleich geblieben",null,null,null,null,{"$f":"IF(C20<>\"\",\"ACHTUNG: Wert ohne (Minus) '-' übernehemen!\",\"\")","v":""}]
[]
[null,null,null,"Minderwert",null,{"$f":"IF(U20<>\"\",\"... in Höhe von:\",\"\")","v":"... in Höhe von:"},{"$f":"IF(J14<0,-J14,\"\")","v":""},null,null,null,null,null,{"$f":"IF(AND(F20=\"\",I20=\"\",J20=\"\"),\"\",SUM(T20:V20))","v":0},"/",{"$f":"SUM(COUNTIF(R20:T20,1),COUNTIF(R20:T20,0))","v":0},null,null,null,null,null,{"$f":"IF(AND(G20=\"\",Hilfe!G20<>\"\"),0,IF(Hilfe!G20=\"\",\"\",IF(G20=Hilfe!G20,1,0)))","v":0}]
[]
[null,{"$f":"IF(Dateneingabe!D32=\"\",\"\",UPPER(Dateneingabe!D32))","v":"SCHWEINE"}]
[null,{"$f":"IF(Dateneingabe!C36=\"\",\"\",Dateneingabe!C36)","v":"Mastsauen"},null,{"$f":"IF(Dateneingabe!E36=\"\",\"\",Dateneingabe!E36)","v":2},{"$f":"IF(Dateneingabe!S36=\"\",\"\",Dateneingabe!S36)","v":148.63},null,{"$f":"IF(Dateneingabe!K36=\"\",\"\",Dateneingabe!K36)","v":7},{"$f":"IF(Dateneingabe!T36=\"\",\"\",Dateneingabe!T36)","v":149}]
[null,{"$f":"IF(Dateneingabe!C38=\"\",\"\",Dateneingabe!C38)","v":"Ferkel"},null,{"$f":"IF(Dateneingabe!E38=\"\",\"\",Dateneingabe!E38)","v":2},{"$f":"IF(Dateneingabe!S38=\"\",\"\",Dateneingabe!S38)","v":55.18},null,{"$f":"IF(Dateneingabe!K38=\"\",\"\",Dateneingabe!K38)","v":4},{"$f":"IF(Dateneingabe!T38=\"\",\"\",Dateneingabe!T38)","v":55}]
[null,{"$f":"IF(Dateneingabe!C40=\"\",\"\",Dateneingabe!C40)","v":""},null,{"$f":"IF(Dateneingabe!E40=\"\",\"\",Dateneingabe!E40)","v":""},{"$f":"IF(Dateneingabe!S40=\"\",\"\",Dateneingabe!S40)","v":""},null,{"$f":"IF(Dateneingabe!K40=\"\",\"\",Dateneingabe!K40)","v":""},{"$f":"IF(Dateneingabe!T40=\"\",\"\",Dateneingabe!T40)","v":""}]
[null,{"$f":"IF(Dateneingabe!C42=\"\",\"\",Dateneingabe!C42)","v":""},null,{"$f":"IF(Dateneingabe!E42=\"\",\"\",Dateneingabe!E42)","v":""},{"$f":"IF(Dateneingabe!S42=\"\",\"\",Dateneingabe!S42)","v":""},null,{"$f":"IF(Dateneingabe!K42=\"\",\"\",Dateneingabe!K42)","v":""},{"$f":"IF(Dateneingabe!T42=\"\",\"\",Dateneingabe!T42)","v":""}]
[null,{"$f":"IF(Dateneingabe!C44=\"\",\"\",Dateneingabe!C44)","v":""},null,{"$f":"IF(Dateneingabe!E44=\"\",\"\",Dateneingabe!E44)","v":""},{"$f":"IF(Dateneingabe!S44=\"\",\"\",Dateneingabe!S44)","v":""},null,{"$f":"IF(Dateneingabe!K44=\"\",\"\",Dateneingabe!K44)","v":""},{"$f":"IF(Dateneingabe!T44=\"\",\"\",Dateneingabe!T44)","v":""}]
[null,{"$f":"\"Summe \"&B22","v":"Summe SCHWEINE"}]
[]
[null,null,null,"Mehrwert",null,"Kreuze zutreffendes an! (ACHTUNG: Nur eine Antwort ist richtig!!)"]
[]
[null,null,null,"gleich geblieben"]
[]
[null,null,null,"Minderwert"]
[]
[null,"VORRÄTE"]
[null,"Selbst erzeugte Vorräte"]
[null,{"$f":"IF(Dateneingabe!C50=\"\",\"\",Dateneingabe!C50)","v":"Gerste"},null,{"$f":"IF(Dateneingabe!E50=\"\",\"\",Dateneingabe!E50)","v":100},{"$f":"IF(Dateneingabe!S50=\"\",\"\",Dateneingabe!S50)","v":0.12},null,{"$f":"IF(Dateneingabe!K50=\"\",\"\",Dateneingabe!K50)","v":800},{"$f":"IF(Dateneingabe!T50=\"\",\"\",Dateneingabe!T50)","v":0.13}]
[null,{"$f":"IF(Dateneingabe!C52=\"\",\"\",Dateneingabe!C52)","v":"Futterkartoffeln"},null,{"$f":"IF(Dateneingabe!E52=\"\",\"\",Dateneingabe!E52)","v":1350},{"$f":"IF(Dateneingabe!S52=\"\",\"\",Dateneingabe!S52)","v":7.0000000000000007E-2},null,{"$f":"IF(Dateneingabe!K52=\"\",\"\",Dateneingabe!K52)","v":1500},{"$f":"IF(Dateneingabe!T52=\"\",\"\",Dateneingabe!T52)","v":0.06}]
[null,{"$f":"IF(Dateneingabe!C54=\"\",\"\",Dateneingabe!C54)","v":"Brennholz"},null,{"$f":"IF(Dateneingabe!E54=\"\",\"\",Dateneingabe!E54)","v":30},{"$f":"IF(Dateneingabe!S54=\"\",\"\",Dateneingabe!S54)","v":24.48},null,{"$f":"IF(Dateneingabe!K54=\"\",\"\",Dateneingabe!K54)","v":4},{"$f":"IF(Dateneingabe!T54=\"\",\"\",Dateneingabe!T54)","v":26.44}]
[null,{"$f":"IF(Dateneingabe!C56=\"\",\"\",Dateneingabe!C56)","v":""},null,{"$f":"IF(Dateneingabe!E56=\"\",\"\",Dateneingabe!E56)","v":""},{"$f":"IF(Dateneingabe!S56=\"\",\"\",Dateneingabe!S56)","v":""},null,{"$f":"IF(Dateneingabe!K56=\"\",\"\",Dateneingabe!K56)","v":""},{"$f":"IF(Dateneingabe!T56=\"\",\"\",Dateneingabe!T56)","v":""}]
[null,{"$f":"IF(Dateneingabe!C58=\"\",\"\",Dateneingabe!C58)","v":""},null,{"$f":"IF(Dateneingabe!E58=\"\",\"\",Dateneingabe!E58)","v":""},{"$f":"IF(Dateneingabe!S58=\"\",\"\",Dateneingabe!S58)","v":""},null,{"$f":"IF(Dateneingabe!K58=\"\",\"\",Dateneingabe!K58)","v":""},{"$f":"IF(Dateneingabe!T58=\"\",\"\",Dateneingabe!T58)","v":""}]
[null,"Summe selbst erzeugte Vorräte"]
[]
[null,null,null,"Mehrwert",null,"Kreuze zutreffendes an! (ACHTUNG: Nur eine Antwort ist richtig!!)"]
[]
[null,null,null,"gleich geblieben"]
[]
[null,null,null,"Minderwert"]
[]
[null,"Zugekaufte Vorräte"]
[null,{"$f":"IF(Dateneingabe!C64=\"\",\"\",Dateneingabe!C64)","v":"Milchkraftfutter"},null,{"$f":"IF(Dateneingabe!E64=\"\",\"\",Dateneingabe!E64)","v":650},{"$f":"IF(Dateneingabe!S64=\"\",\"\",Dateneingabe!S64)","v":0.22},null,{"$f":"IF(Dateneingabe!K64=\"\",\"\",Dateneingabe!K64)","v":1500},{"$f":"IF(Dateneingabe!T64=\"\",\"\",Dateneingabe!T64)","v":0.23}]
[null,{"$f":"IF(Dateneingabe!C66=\"\",\"\",Dateneingabe!C66)","v":"Weizenschrot"},null,{"$f":"IF(Dateneingabe!E66=\"\",\"\",Dateneingabe!E66)","v":350},{"$f":"IF(Dateneingabe!S66=\"\",\"\",Dateneingabe!S66)","v":0.2},null,{"$f":"IF(Dateneingabe!K66=\"\",\"\",Dateneingabe!K66)","v":500},{"$f":"IF(Dateneingabe!T66=\"\",\"\",Dateneingabe!T66)","v":0.19}]
[null,{"$f":"IF(Dateneingabe!C68=\"\",\"\",Dateneingabe!C68)","v":"Erbsenschrot"},null,{"$f":"IF(Dateneingabe!E68=\"\",\"\",Dateneingabe!E68)","v":75},{"$f":"IF(Dateneingabe!S68=\"\",\"\",Dateneingabe!S68)","v":0.2},null,{"$f":"IF(Dateneingabe!K68=\"\",\"\",Dateneingabe!K68)","v":300},{"$f":"IF(Dateneingabe!T68=\"\",\"\",Dateneingabe!T68)","v":0.2}]
[null,{"$f":"IF(Dateneingabe!C70=\"\",\"\",Dateneingabe!C70)","v":""},null,{"$f":"IF(Dateneingabe!E70=\"\",\"\",Dateneingabe!E70)","v":""},{"$f":"IF(Dateneingabe!S70=\"\",\"\",Dateneingabe!S70)","v":""},null,{"$f":"IF(Dateneingabe!K70=\"\",\"\",Dateneingabe!K70)","v":""},{"$f":"IF(Dateneingabe!T70=\"\",\"\",Dateneingabe!T70)","v":""}]
[null,{"$f":"IF(Dateneingabe!C72=\"\",\"\",Dateneingabe!C72)","v":""},null,{"$f":"IF(Dateneingabe!E72=\"\",\"\",Dateneingabe!E72)","v":""},{"$f":"IF(Dateneingabe!S72=\"\",\"\",Dateneingabe!S72)","v":""},null,{"$f":"IF(Dateneingabe!K72=\"\",\"\",Dateneingabe!K72)","v":""},{"$f":"IF(Dateneingabe!T72=\"\",\"\",Dateneingabe!T72)","v":""}]
[null,"Summe zugekaufte Vorräte"]
[]
[null,null,null,"Mehrwert",null,"Kreuze zutreffendes an! (ACHTUNG: Nur eine Antwort ist richtig!!)"]
[]
[null,null,null,"gleich geblieben"]
[]
[null,null,null,"Minderwert"]
[]
[null,null,null,null,null,null,null,null,null,null,null,"Gesamtpunkte:",{"$f":"SUM(M7:M64)","v":0},"/",{"$f":"SUM(O7:O64)","v":22}]
[]
[{"$f":"$A$1999","v":"NACHNAME Vorname"}]
[{"$f":"\"KNr. \"&TEXT($A$2000,\"00\")","v":"KNr. 01"}]
[]
[]
[]
[]
[]
[]
[]
[]
[]
[]
[]
[]
[]
[]
[]
[]
[]
[]
[]
[]
[]
[]
[]
[]
[]
[]
[]
[]
[]
[]
[]
[]
[]
[]
[]
[]
[]
[]
[]
[]
[]
[]
[]
[]
[]
[]
[]
[]
[]
[]
[]
[]
[]
[]
[]
[]
[]
[]
[]
[]
[]
[]
[]
[]
[]
[]
[]
[]
[]
[]
[]
[]
[]
[]
[]
[]
[]
[]
[]
[]
[]
[]
[]
[]
[]
[]
[]
[]
[]
[]
[]
[]
[]
[]
[]
[]
[]
[]
[]
[]
[]
[]
[]
[]
[]
[]
[]
[]
[]
[]
[]
[]
[]
[]
[]
[]
[]
[]
[]
[]
[]
[]
[]
[]
[]
[]
[]
[]
[]
[]
[]
[]
[]
[]
[]
[]
[]
[]
[]
[]
[]
[]
[]
[]
[]
[]
[]
[]
[]
[]
[]
[]
[]
[]
[]
[]
[]
[]
[]
[]
[]
[]
[]
[]
[]
[]
[]
[]
[]
[]
[]
[]
[]
[]
[]
[]
[]
[]
[]
[]
[]
[]
[]
[]
[]
[]
[]
[]
[]
[]
[]
[]
[]
[]
[]
[]
[]
[]
[]
[]
[]
[]
[]
[]
[]
[]
[]
[]
[]
[]
[]
[]
[]
[]
[]
[]
[]
[]
[]
[]
[]
[]
[]
[]
[]
[]
[]
[]
[]
[]
[]
[]
[]
[]
[]
[]
[]
[]
[]
[]
[]
[]
[]
[]
[]
[]
[]
[]
[]
[]
[]
[]
[]
[]
[]
[]
[]
[]
[]
[]
[]
[]
[]
[]
[]
[]
[]
[]
[]
[]
[]
[]
[]
[]
[]
[]
[]
[]
[]
[]
[]
[]
[]
[]
[]
[]
[]
[]
[]
[]
[]
[]
[]
[]
[]
[]
[]
[]
[]
[]
[]
[]
[]
[]
[]
[]
[]
[]
[]
[]
[]
[]
[]
[]
[]
[]
[]
[]
[]
[]
[]
[]
[]
[]
[]
[]
[]
[]
[]
[]
[]
[]
[]
[]
[]
[]
[]
[]
[]
[]
[]
[]
[]
[]
[]
[]
[]
[]
[]
[]
[]
[]
[]
[]
[]
[]
[]
[]
[]
[]
[]
[]
[]
[]
[]
[]
[]
[]
[]
[]
[]
[]
[]
[]
[]
[]
[]
[]
[]
[]
[]
[]
[]
[]
[]
[]
[]
[]
[]
[]
[]
[]
[]
[]
[]
[]
[]
[]
[]
[]
[]
[]
[]
[]
[]
[]
[]
[]
[]
[]
[]
[]
[]
[]
[]
[]
[]
[]
[]
[]
[]
[]
[]
[]
[]
[]
[]
[]
[]
[]
[]
[]
[]
[]
[]
[]
[]
[]
[]
[]
[]
[]
[]
[]
[]
[]
[]
[]
[]
[]
[]
[]
[]
[]
[]
[]
[]
[]
[]
[]
[]
[]
[]
[]
[]
[]
[]
[]
[]
[]
[]
[]
[]
[]
[]
[]
[]
[]
[]
[]
[]
[]
[]
[]
[]
[]
[]
[]
[]
[]
[]
[]
[]
[]
[]
[]
[]
[]
[]
[]
[]
[]
[]
[]
[]
[]
[]
[]
[]
[]
[]
[]
[]
[]
[]
[]
[]
[]
[]
[]
[]
[]
[]
[]
[]
[]
[]
[]
[]
[]
[]
[]
[]
[]
[]
[]
[]
[]
[]
[]
[]
[]
[]
[]
[]
[]
[]
[]
[]
[]
[]
[]
[]
[]
[]
[]
[]
[]
[]
[]
[]
[]
[]
[]
[]
[]
[]
[]
[]
[]
[]
[]
[]
[]
[]
[]
[]
[]
[]
[]
[]
[]
[]
[]
[]
[]
[]
[]
[]
[]
[]
[]
[]
[]
[]
[]
[]
[]
[]
[]
[]
[]
[]
[]
[]
[]
[]
[]
[]
[]
[]
[]
[]
[]
[]
[]
[]
[]
[]
[]
[]
[]
[]
[]
[]
[]
[]
[]
[]
[]
[]
[]
[]
[]
[]
[]
[]
[]
[]
[]
[]
[]
[]
[]
[]
[]
[]
[]
[]
[]
[]
[]
[]
[]
[]
[]
[]
[]
[]
[]
[]
[]
[]
[]
[]
[]
[]
[]
[]
[]
[]
[]
[]
[]
[]
[]
[]
[]
[]
[]
[]
[]
[]
[]
[]
[]
[]
[]
[]
[]
[]
[]
[]
[]
[]
[]
[]
[]
[]
[]
[]
[]
[]
[]
[]
[]
[]
[]
[]
[]
[]
[]
[]
[]
[]
[]
[]
[]
[]
[]
[]
[]
[]
[]
[]
[]
[]
[]
[]
[]
[]
[]
[]
[]
[]
[]
[]
[]
[]
[]
[]
[]
[]
[]
[]
[]
[]
[]
[]
[]
[]
[]
[]
[]
[]
[]
[]
[]
[]
[]
[]
[]
[]
[]
[]
[]
[]
[]
[]
[]
[]
[]
[]
[]
[]
[]
[]
[]
[]
[]
[]
[]
[]
[]
[]
[]
[]
[]
[]
[]
[]
[]
[]
[]
[]
[]
[]
[]
[]
[]
[]
[]
[]
[]
[]
[]
[]
[]
[]
[]
[]
[]
[]
[]
[]
[]
[]
[]
[]
[]
[]
[]
[]
[]
[]
[]
[]
[]
[]
[]
[]
[]
[]
[]
[]
[]
[]
[]
[]
[]
[]
[]
[]
[]
[]
[]
[]
[]
[]
[]
[]
[]
[]
[]
[]
[]
[]
[]
[]
[]
[]
[]
[]
[]
[]
[]
[]
[]
[]
[]
[]
[]
[]
[]
[]
[]
[]
[]
[]
[]
[]
[]
[]
[]
[]
[]
[]
[]
[]
[]
[]
[]
[]
[]
[]
[]
[]
[]
[]
[]
[]
[]
[]
[]
[]
[]
[]
[]
[]
[]
[]
[]
[]
[]
[]
[]
[]
[]
[]
[]
[]
[]
[]
[]
[]
[]
[]
[]
[]
[]
[]
[]
[]
[]
[]
[]
[]
[]
[]
[]
[]
[]
[]
[]
[]
[]
[]
[]
[]
[]
[]
[]
[]
[]
[]
[]
[]
[]
[]
[]
[]
[]
[]
[]
[]
[]
[]
[]
[]
[]
[]
[]
[]
[]
[]
[]
[]
[]
[]
[]
[]
[]
[]
[]
[]
[]
[]
[]
[]
[]
[]
[]
[]
[]
[]
[]
[]
[]
[]
[]
[]
[]
[]
[]
[]
[]
[]
[]
[]
[]
[]
[]
[]
[]
[]
[]
[]
[]
[]
[]
[]
[]
[]
[]
[]
[]
[]
[]
[]
[]
[]
[]
[]
[]
[]
[]
[]
[]
[]
[]
[]
[]
[]
[]
[]
[]
[]
[]
[]
[]
[]
[]
[]
[]
[]
[]
[]
[]
[]
[]
[]
[]
[]
[]
[]
[]
[]
[]
[]
[]
[]
[]
[]
[]
[]
[]
[]
[]
[]
[]
[]
[]
[]
[]
[]
[]
[]
[]
[]
[]
[]
[]
[]
[]
[]
[]
[]
[]
[]
[]
[]
[]
[]
[]
[]
[]
[]
[]
[]
[]
[]
[]
[]
[]
[]
[]
[]
[]
[]
[]
[]
[]
[]
[]
[]
[]
[]
[]
[]
[]
[]
[]
[]
[]
[]
[]
[]
[]
[]
[]
[]
[]
[]
[]
[]
[]
[]
[]
[]
[]
[]
[]
[]
[]
[]
[]
[]
[]
[]
[]
[]
[]
[]
[]
[]
[]
[]
[]
[]
[]
[]
[]
[]
[]
[]
[]
[]
[]
[]
[]
[]
[]
[]
[]
[]
[]
[]
[]
[]
[]
[]
[]
[]
[]
[]
[]
[]
[]
[]
[]
[]
[]
[]
[]
[]
[]
[]
[]
[]
[]
[]
[]
[]
[]
[]
[]
[]
[]
[]
[]
[]
[]
[]
[]
[]
[]
[]
[]
[]
[]
[]
[]
[]
[]
[]
[]
[]
[]
[]
[]
[]
[]
[]
[]
[]
[]
[]
[]
[]
[]
[]
[]
[]
[]
[]
[]
[]
[]
[]
[]
[]
[]
[]
[]
[]
[]
[]
[]
[]
[]
[]
[]
[]
[]
[]
[]
[]
[]
[]
[]
[]
[]
[]
[]
[]
[]
[]
[]
[]
[]
[]
[]
[]
[]
[]
[]
[]
[]
[]
[]
[]
[]
[]
[]
[]
[]
[]
[]
[]
[]
[]
[]
[]
[]
[]
[]
[]
[]
[]
[]
[]
[]
[]
[]
[]
[]
[]
[]
[]
[]
[]
[]
[]
[]
[]
[]
[]
[]
[]
[]
[]
[]
[]
[]
[]
[]
[]
[]
[]
[]
[]
[]
[]
[]
[]
[]
[]
[]
[]
[]
[]
[]
[]
[]
[]
[]
[]
[]
[]
[]
[]
[]
[]
[]
[]
[]
[]
[]
[]
[]
[]
[]
[]
[]
[]
[]
[]
[]
[]
[]
[]
[]
[]
[]
[]
[]
[]
[]
[]
[]
[]
[]
[]
[]
[]
[]
[]
[]
[]
[]
[]
[]
[]
[]
[]
[]
[]
[]
[]
[]
[]
[]
[]
[]
[]
[]
[]
[]
[]
[]
[]
[]
[]
[]
[]
[]
[]
[]
[]
[]
[]
[]
[]
[]
[]
[]
[]
[]
[]
[]
[]
[]
[]
[]
[]
[]
[]
[]
[]
[]
[]
[]
[]
[]
[]
[]
[]
[]
[]
[]
[]
[]
[]
[]
[]
[]
[]
[]
[]
[]
[]
[]
[]
[]
[]
[]
[]
[]
[]
[]
[]
[]
[]
[]
[]
[]
[]
[]
[]
[]
[]
[]
[]
[]
[]
[]
[]
[]
[]
[]
[]
[]
[]
[]
[]
[]
[]
[]
[]
[]
[]
[]
[]
[]
[]
[]
[]
[]
[]
[]
[]
[]
[]
[]
[]
[]
[]
[]
[]
[]
[]
[]
[]
[]
[]
[]
[]
[]
[]
[]
[]
[]
[]
[]
[]
[]
[]
[]
[]
[]
[]
[]
[]
[]
[]
[]
[]
[]
[]
[]
[]
[]
[]
[]
[]
[]
[]
[]
[]
[]
[]
[]
[]
[]
[]
[]
[]
[]
[]
[]
[]
[]
[]
[]
[]
[]
[]
[]
[]
[]
[]
[]
[]
[]
[]
[]
[]
[]
[]
[]
[]
[]
[]
[]
[]
[]
[]
[]
[]
[]
[]
[]
[]
[]
[]
[]
[]
[]
[]
[]
[]
[]
[]
[]
[]
[]
[]
[]
[]
[]
[]
[]
[]
[]
[]
[]
[]
[]
[]
[]
[]
[]
[]
[]
[]
[]
[]
[]
[]
[]
[]
[]
[]
[]
[]
[]
[]
[]
[]
[]
[]
[]
[]
[]
[]
[]
[]
[]
[]
[]
[]
[]
[]
[]
[]
[]
[]
[]
[]
[]
[]
[]
[]
[]
[]
[]
[]
[]
[]
[]
[]
[]
[]
[]
[]
[]
[]
[]
[]
[]
[]
[]
[]
[]
[]
[]
[]
[]
[]
[]
[]
[]
[]
[]
[]
[]
[]
[]
[]
[]
[]
[]
[]
[]
[]
[]
[]
[]
[]
[]
[]
[]
[]
[]
[]
[]
[]
[]
[]
[]
[]
[]
[]
[]
[]
[]
[]
[]
[]
[]
[]
[]
[]
[]
[]
[]
[]
[]
[]
[]
[]
[]
[]
[]
[]
[]
[]
[]
[]
[]
[]
[]
[]
[]
[]
[]
[]
[]
[]
[]
[]
[]
[]
[]
[]
[]
[]
[]
[]
[]
[]
[]
[]
[]
[]
[]
[]
[]
[]
[]
[]
[]
[]
[]
[]
[]
[]
[]
[]
[]
[]
[]
[]
[]
[]
[]
[]
[]
[]
[]
[]
[]
[]
[]
[]
[]
[]
[]
[]
[]
[]
[]
[]
[]
[]
[]
[]
[]
[]
[]
[]
[]
[]
[]
[]
[]
[]
[]
[]
[]
[]
[]
[]
[]
[]
[]
[]
[]
[]
[]
[]
[]
[]
[]
[]
[]
[]
[]
[]
[]
[]
[]
[]
[]
[]
[]
[]
[]
[]
[]
[]
[]
[]
[]
[]
[]
[]
[]
[]
[]
[]
[]
[]
[]
[]
[]
[]
[]
[]
[]
[]
[]
[]
[]
[]
[]
[]
[]
[]
[]
[]
[]
[]
[]
[]
[]
[]
[]
[]
[]
["NACHNAME Vorname"]
[1]
["BSP - BEWvUV "]

{"sheet":"Korrektur","index":2,"n_rows":183,"n_cols":16,"rows_kept":183,"cut":false,"hidden":false,"merged":[[0,12,0,14],[124,2,124,7],[129,8,129,9],[121,4,121,6],[1,0,1,4],[1,7,1,11]]}
["Korrekturblatt",null,null,null,null,null,null,null,null,"Kalkulation fertig?",null,"x","Berechnen?",null,null,"x"]
[null,null,null,null,null,null,null,null,null,null,null,null,null,{"$f":"N3","v":"x"}]
[null,"unabhängige Ergebnisse",null,null,null,null,null,null,null,null,null,null,null,{"$f":"IF($L$1=\"\",\"\",$L$1)","v":"x"}]
[null,null,null,null,null,null,null,null,null,null,null,null,null,{"$f":"N3","v":"x"}]
[null,"abhängige Ergebnisse (werden wenn die Formel korrekt ist, als Folgefehler mit 0,5 Punkten bewertet)",null,null,null,null,null,null,null,null,null,null,null,{"$f":"IF($L$1=\"\",\"\",$L$1)","v":"x"}]
[null,null,null,null,null,null,null,null,null,null,null,null,null,{"$f":"N5","v":"x"}]
["Umlaufvermögen",null,null,"Ergebnis",null,"Formel-\nprüfung",null,"Deine Be-rechnung",{"$f":"\"Fehler\"","v":"Fehler"},"Punkte",null,null,null,{"$f":"IF($L$1=\"\",\"\",$L$1)","v":"x"}]
["1.","Wert 1. Jänner",null,null,null,null,null,null,null,null,null,null,null,{"$f":"IF($L$1=\"\",\"\",$L$1)","v":"x"}]
[null,{"$f":"IF(Berechnungen!B6=\"\",\"-\",Berechnungen!B6)","v":"RINDER"},null,null,null,null,null,null,null,null,null,null,null,"x"]
[null,{"$f":"IF(Berechnungen!B7=\"\",\"-\",Berechnungen!B7)","v":"Kühe"},{"$f":"MID($B$8,1,11)&\".\"","v":"Wert 1. Jän."},{"$f":"IF(Hilfe!$F7=\"\",\"\",Hilfe!$F7)","v":9171},null,null,null,{"$f":"IF(Berechnungen!$F7=\"\",\"\",Berechnungen!$F7)","v":""},{"$f":"IF(OR(B10=\"-\",AND(D10=\"\",H10=\"\")),\"\",IF(H10=D10,\"Richtig!\",IF(H10=\"\",\"Fehlt\",\"Falsch\")))","v":"Fehlt"},{"$f":"IF(OR(B10=\"-\",N10=\"\",AND(D10=\"\",H10=\"\")),\"-\",IF(I10=\"Richtig!\",1,IF(I10=\"Formel: OK\",0.5,IF(OR(I10=\"Falsch\",I10=\"Fehlt\"),0,\"\"))))","v":0},{"$f":"IF(L10=\"\",\"\",\"│\")","v":"│"},{"$f":"IF(OR(B10=\"-\",N10=\"\",AND(D10=\"\",H10=\"\")),\"\",1)","v":1},null,"x"]
[null,{"$f":"IF(Berechnungen!B8=\"\",\"-\",Berechnungen!B8)","v":"Kalbinnen"},"Wert 1. Jän.",{"$f":"IF(Hilfe!$F8=\"\",\"\",Hilfe!$F8)","v":6690},null,null,null,{"$f":"IF(Berechnungen!$F8=\"\",\"\",Berechnungen!$F8)","v":""},"Fehlt",0,"│",1,null,"x"]
[null,{"$f":"IF(Berechnungen!B9=\"\",\"-\",Berechnungen!B9)","v":"Jungvieh 1 - 2 J."},"Wert 1. Jän.",{"$f":"IF(Hilfe!$F9=\"\",\"\",Hilfe!$F9)","v":2848},null,null,null,{"$f":"IF(Berechnungen!$F9=\"\",\"\",Berechnungen!$F9)","v":""},"Fehlt",0,"│",1,null,"x"]
[null,{"$f":"IF(Berechnungen!B10=\"\",\"-\",Berechnungen!B10)","v":"Jungvieh bis 1 J."},"Wert 1. Jän.",{"$f":"IF(Hilfe!$F10=\"\",\"\",Hilfe!$F10)","v":2630},null,null,null,{"$f":"IF(Berechnungen!$F10=\"\",\"\",Berechnungen!$F10)","v":""},"Fehlt",0,"│",1,null,"x"]
[null,{"$f":"IF(Berechnungen!B11=\"\",\"-\",Berechnungen!B11)","v":"Kälber weib."},"Wert 1. Jän.",{"$f":"IF(Hilfe!$F11=\"\",\"\",Hilfe!$F11)","v":1180},null,null,null,{"$f":"IF(Berechnungen!$F11=\"\",\"\",Berechnungen!$F11)","v":""},"Fehlt",0,"│",1,null,"x"]
[null,{"$f":"IF(Berechnungen!B12=\"\",\"-\",Berechnungen!B12)","v":"Kälber männ."},"Wert 1. Jän.",{"$f":"IF(Hilfe!$F12=\"\",\"\",Hilfe!$F12)","v":537},null,null,null,{"$f":"IF(Berechnungen!$F12=\"\",\"\",Berechnungen!$F12)","v":""},"Fehlt",0,"│",1,null,"x"]
[null,{"$f":"IF(Berechnungen!B13=\"\",\"-\",Berechnungen!B13)","v":"-"},"Wert 1. Jän.",{"$f":"IF(Hilfe!$F13=\"\",\"\",Hilfe!$F13)","v":""},null,null,null,{"$f":"IF(Berechnungen!$F13=\"\",\"\",Berechnungen!$F13)","v":""},"","-","","",null,"x"]
[null,{"$f":"IF(Berechnungen!B14=\"\",\"-\",Berechnungen!B14)","v":"Summe RINDER"},"Wert 1. Jän.",{"$f":"IF(Hilfe!$F14=\"\",\"\",Hilfe!$F14)","v":23056},null,{"$f":"IF(AND(H10=\"\",H11=\"\",H12=\"\",H13=\"\",H14=\"\",H15=\"\",H16=\"\"),\"-\",SUM(H10:H16))","v":"-"},null,{"$f":"IF(Berechnungen!$F14=\"\",\"\",Berechnungen!$F14)","v":""},{"$f":"IF(B17=\"-\",\"\",IF(H17=D17,\"Richtig!\",IF(AND(D17<>H17,F17=H17),\"Formel: OK\",IF(H17=\"\",\"Fehlt\",\"Falsch\"))))","v":"Fehlt"},0,"│",1,null,"x"]
[null,{"$f":"IF(Berechnungen!B22=\"\",\"-\",Berechnungen!B22)","v":"SCHWEINE"},null,null,null,null,null,null,null,null,null,null,null,"x"]
[null,{"$f":"IF(Berechnungen!B23=\"\",\"-\",Berechnungen!B23)","v":"Mastsauen"},{"$f":"MID($B$8,1,11)&\".\"","v":"Wert 1. Jän."},{"$f":"IF(Hilfe!$F23=\"\",\"\",Hilfe!$F23)","v":297.26},null,null,null,{"$f":"IF(Berechnungen!$F23=\"\",\"\",Berechnungen!$F23)","v":""},{"$f":"IF(OR(B19=\"-\",AND(D19=\"\",H19=\"\")),\"\",IF(H19=D19,\"Richtig!\",IF(H19=\"\",\"Fehlt\",\"Falsch\")))","v":"Fehlt"},{"$f":"IF(OR(B19=\"-\",N19=\"\",AND(D19=\"\",H19=\"\")),\"-\",IF(I19=\"Richtig!\",1,IF(I19=\"Formel: OK\",0.5,IF(OR(I19=\"Falsch\",I19=\"Fehlt\"),0,\"\"))))","v":0},{"$f":"IF(L19=\"\",\"\",\"│\")","v":"│"},{"$f":"IF(OR(B19=\"-\",N19=\"\",AND(D19=\"\",H19=\"\")),\"\",1)","v":1},null,"x"]
[null,{"$f":"IF(Berechnungen!B24=\"\",\"-\",Berechnungen!B24)","v":"Ferkel"},"Wert 1. Jän.",{"$f":"IF(Hilfe!$F24=\"\",\"\",Hilfe!$F24)","v":110.36},null,null,null,{"$f":"IF(Berechnungen!$F24=\"\",\"\",Berechnungen!$F24)","v":""},{"$f":"IF(OR(B20=\"-\",AND(D20=\"\",H20=\"\")),\"\",IF(H20=D20,\"Richtig!\",IF(H20=\"\",\"Fehlt\",\"Falsch\")))","v":"Fehlt"},0,"│",{"$f":"IF(OR(B20=\"-\",N20=\"\",AND(D20=\"\",H20=\"\")),\"\",1)","v":1},null,"x"]
[null,{"$f":"IF(Berechnungen!B25=\"\",\"-\",Berechnungen!B25)","v":"-"},"Wert 1. Jän.",{"$f":"IF(Hilfe!$F25=\"\",\"\",Hilfe!$F25)","v":""},null,null,null,{"$f":"IF(Berechnungen!$F25=\"\",\"\",Berechnungen!$F25)","v":""},{"$f":"IF(OR(B21=\"-\",AND(D21=\"\",H21=\"\")),\"\",IF(H21=D21,\"Richtig!\",IF(H21=\"\",\"Fehlt\",\"Falsch\")))","v":""},"-","","",null,"x"]
[null,{"$f":"IF(Berechnungen!B26=\"\",\"-\",Berechnungen!B26)","v":"-"},"Wert 1. Jän.",{"$f":"IF(Hilfe!$F26=\"\",\"\",Hilfe!$F26)","v":""},null,null,null,{"$f":"IF(Berechnungen!$F26=\"\",\"\",Berechnungen!$F26)","v":""},{"$f":"IF(OR(B22=\"-\",AND(D22=\"\",H22=\"\")),\"\",IF(H22=D22,\"Richtig!\",IF(H22=\"\",\"Fehlt\",\"Falsch\")))","v":""},"-","","",null,"x"]
[null,{"$f":"IF(Berechnungen!B27=\"\",\"-\",Berechnungen!B27)","v":"-"},"Wert 1. Jän.",{"$f":"IF(Hilfe!$F27=\"\",\"\",Hilfe!$F27)","v":""},null,null,null,{"$f":"IF(Berechnungen!$F27=\"\",\"\",Berechnungen!$F27)","v":""},{"$f":"IF(OR(B23=\"-\",AND(D23=\"\",H23=\"\")),\"\",IF(H23=D23,\"Richtig!\",IF(H23=\"\",\"Fehlt\",\"Falsch\")))","v":""},"-","","",null,"x"]
[null,{"$f":"IF(Berechnungen!B28=\"\",\"-\",Berechnungen!B28)","v":"Summe SCHWEINE"},"Wert 1. Jän.",{"$f":"IF(Hilfe!$F28=\"\",\"\",Hilfe!$F28)","v":407.62},null,{"$f":"IF(AND(H19=\"\",H20=\"\",H21=\"\",H22=\"\",H23=\"\"),\"-\",SUM(H19:H23))","v":"-"},null,{"$f":"IF(Berechnungen!$F28=\"\",\"\",Berechnungen!$F28)","v":""},{"$f":"IF(B24=\"-\",\"\",IF(H24=D24,\"Richtig!\",IF(AND(D24<>H24,F24=H24),\"Formel: OK\",IF(H24=\"\",\"Fehlt\",\"Falsch\"))))","v":"Fehlt"},0,"│",1,null,"x"]
[null,{"$f":"IF(Berechnungen!B37=\"\",\"-\",Berechnungen!B37)","v":"Selbst erzeugte Vorräte"},null,null,null,null,null,null,null,null,null,null,null,"x"]
[null,{"$f":"IF(Berechnungen!B38=\"\",\"-\",Berechnungen!B38)","v":"Gerste"},{"$f":"MID($B$8,1,11)&\".\"","v":"Wert 1. Jän."},{"$f":"IF(Hilfe!$F38=\"\",\"\",Hilfe!$F38)","v":12},null,null,null,{"$f":"IF(Berechnungen!$F38=\"\",\"\",Berechnungen!$F38)","v":""},{"$f":"IF(OR(B26=\"-\",AND(D26=\"\",H26=\"\")),\"\",IF(H26=D26,\"Richtig!\",IF(H26=\"\",\"Fehlt\",\"Falsch\")))","v":"Fehlt"},{"$f":"IF(OR(B26=\"-\",N26=\"\",AND(D26=\"\",H26=\"\")),\"-\",IF(I26=\"Richtig!\",1,IF(I26=\"Formel: OK\",0.5,IF(OR(I26=\"Falsch\",I26=\"Fehlt\"),0,\"\"))))","v":0},{"$f":"IF(L26=\"\",\"\",\"│\")","v":"│"},{"$f":"IF(OR(B26=\"-\",N26=\"\",AND(D26=\"\",H26=\"\")),\"\",1)","v":1},null,"x"]
[null,{"$f":"IF(Berechnungen!B39=\"\",\"-\",Berechnungen!B39)","v":"Futterkartoffeln"},"Wert 1. Jän.",{"$f":"IF(Hilfe!$F39=\"\",\"\",Hilfe!$F39)","v":94.500000000000014},null,null,null,{"$f":"IF(Berechnungen!$F39=\"\",\"\",Berechnungen!$F39)","v":""},{"$f":"IF(OR(B27=\"-\",AND(D27=\"\",H27=\"\")),\"\",IF(H27=D27,\"Richtig!\",IF(H27=\"\",\"Fehlt\",\"Falsch\")))","v":"Fehlt"},0,"│",1,null,"x"]
[null,{"$f":"IF(Berechnungen!B40=\"\",\"-\",Berechnungen!B40)","v":"Brennholz"},"Wert 1. Jän.",{"$f":"IF(Hilfe!$F40=\"\",\"\",Hilfe!$F40)","v":734.4},null,null,null,{"$f":"IF(Berechnungen!$F40=\"\",\"\",Berechnungen!$F40)","v":""},{"$f":"IF(OR(B28=\"-\",AND(D28=\"\",H28=\"\")),\"\",IF(H28=D28,\"Richtig!\",IF(H28=\"\",\"Fehlt\",\"Falsch\")))","v":"Fehlt"},0,"│",1,null,"x"]
[null,{"$f":"IF(Berechnungen!B41=\"\",\"-\",Berechnungen!B41)","v":"-"},"Wert 1. Jän.",{"$f":"IF(Hilfe!$F41=\"\",\"\",Hilfe!$F41)","v":""},null,null,null,{"$f":"IF(Berechnungen!$F41=\"\",\"\",Berechnungen!$F41)","v":""},{"$f":"IF(OR(B29=\"-\",AND(D29=\"\",H29=\"\")),\"\",IF(H29=D29,\"Richtig!\",IF(H29=\"\",\"Fehlt\",\"Falsch\")))","v":""},"-","","",null,"x"]
[null,{"$f":"IF(Berechnungen!B42=\"\",\"-\",Berechnungen!B42)","v":"-"},"Wert 1. Jän.",{"$f":"IF(Hilfe!$F42=\"\",\"\",Hilfe!$F42)","v":""},null,null,null,{"$f":"IF(Berechnungen!$F42=\"\",\"\",Berechnungen!$F42)","v":""},{"$f":"IF(OR(B30=\"-\",AND(D30=\"\",H30=\"\")),\"\",IF(H30=D30,\"Richtig!\",IF(H30=\"\",\"Fehlt\",\"Falsch\")))","v":""},"-","","",null,"x"]
[null,{"$f":"IF(Berechnungen!B43=\"\",\"-\",Berechnungen!B43)","v":"Summe selbst erzeugte Vorräte"},"Wert 1. Jän.",{"$f":"IF(Hilfe!$F43=\"\",\"\",Hilfe!$F43)","v":840.9},null,{"$f":"IF(AND(H26=\"\",H27=\"\",H28=\"\",H29=\"\",H30=\"\"),\"-\",SUM(H26:H30))","v":"-"},null,{"$f":"IF(Berechnungen!$F43=\"\",\"\",Berechnungen!$F43)","v":""},{"$f":"IF(B31=\"-\",\"\",IF(H31=D31,\"Richtig!\",IF(AND(D31<>H31,F31=H31),\"Formel: OK\",IF(H31=\"\",\"Fehlt\",\"Falsch\"))))","v":"Fehlt"},0,"│",1,null,"x"]
[null,{"$f":"IF(Berechnungen!B51=\"\",\"-\",Berechnungen!B51)","v":"Zugekaufte Vorräte"},null,{"$f":"IF(Hilfe!$F51=\"\",\"\",Hilfe!$F51)","v":""},null,null,null,{"$f":"IF(Berechnungen!$F51=\"\",\"\",Berechnungen!$F51)","v":""},null,null,"","",null,"x"]
[null,{"$f":"IF(Berechnungen!B52=\"\",\"-\",Berechnungen!B52)","v":"Milchkraftfutter"},{"$f":"MID($B$8,1,11)&\".\"","v":"Wert 1. Jän."},{"$f":"IF(Hilfe!$F52=\"\",\"\",Hilfe!$F52)","v":143},null,null,null,{"$f":"IF(Berechnungen!$F52=\"\",\"\",Berechnungen!$F52)","v":""},{"$f":"IF(OR(B33=\"-\",AND(D33=\"\",H33=\"\")),\"\",IF(H33=D33,\"Richtig!\",IF(H33=\"\",\"Fehlt\",\"Falsch\")))","v":"Fehlt"},{"$f":"IF(OR(B33=\"-\",N33=\"\",AND(D33=\"\",H33=\"\")),\"-\",IF(I33=\"Richtig!\",1,IF(I33=\"Formel: OK\",0.5,IF(OR(I33=\"Falsch\",I33=\"Fehlt\"),0,\"\"))))","v":0},"│",1,null,"x"]
[null,{"$f":"IF(Berechnungen!B53=\"\",\"-\",Berechnungen!B53)","v":"Weizenschrot"},"Wert 1. Jän.",{"$f":"IF(Hilfe!$F53=\"\",\"\",Hilfe!$F53)","v":70},null,null,null,{"$f":"IF(Berechnungen!$F53=\"\",\"\",Berechnungen!$F53)","v":""},{"$f":"IF(OR(B34=\"-\",AND(D34=\"\",H34=\"\")),\"\",IF(H34=D34,\"Richtig!\",IF(H34=\"\",\"Fehlt\",\"Falsch\")))","v":"Fehlt"},0,"│",1,null,"x"]
[null,{"$f":"IF(Berechnungen!B54=\"\",\"-\",Berechnungen!B54)","v":"Erbsenschrot"},"Wert 1. Jän.",{"$f":"IF(Hilfe!$F54=\"\",\"\",Hilfe!$F54)","v":15},null,null,null,{"$f":"IF(Berechnungen!$F54=\"\",\"\",Berechnungen!$F54)","v":""},{"$f":"IF(OR(B35=\"-\",AND(D35=\"\",H35=\"\")),\"\",IF(H35=D35,\"Richtig!\",IF(H35=\"\",\"Fehlt\",\"Falsch\")))","v":"Fehlt"},0,"│",1,null,"x"]
[null,{"$f":"IF(Berechnungen!B55=\"\",\"-\",Berechnungen!B55)","v":"-"},"Wert 1. Jän.",{"$f":"IF(Hilfe!$F55=\"\",\"\",Hilfe!$F55)","v":""},null,null,null,{"$f":"IF(Berechnungen!$F55=\"\",\"\",Berechnungen!$F55)","v":""},{"$f":"IF(OR(B36=\"-\",AND(D36=\"\",H36=\"\")),\"\",IF(H36=D36,\"Richtig!\",IF(H36=\"\",\"Fehlt\",\"Falsch\")))","v":""},"-","","",null,"x"]
[null,{"$f":"IF(Berechnungen!B56=\"\",\"-\",Berechnungen!B56)","v":"-"},"Wert 1. Jän.",{"$f":"IF(Hilfe!$F56=\"\",\"\",Hilfe!$F56)","v":""},null,null,null,{"$f":"IF(Berechnungen!$F56=\"\",\"\",Berechnungen!$F56)","v":""},{"$f":"IF(OR(B37=\"-\",AND(D37=\"\",H37=\"\")),\"\",IF(H37=D37,\"Richtig!\",IF(H37=\"\",\"Fehlt\",\"Falsch\")))","v":""},"-","","",null,"x"]
[null,{"$f":"IF(Berechnungen!B57=\"\",\"-\",Berechnungen!B57)","v":"Summe zugekaufte Vorräte"},"Wert 1. Jän.",{"$f":"IF(Hilfe!$F57=\"\",\"\",Hilfe!$F57)","v":228},null,{"$f":"IF(AND(H33=\"\",H34=\"\",H35=\"\",H36=\"\",H37=\"\"),\"-\",SUM(H33:H37))","v":"-"},null,{"$f":"IF(Berechnungen!$F57=\"\",\"\",Berechnungen!$F57)","v":""},{"$f":"IF(B38=\"-\",\"\",IF(H38=D38,\"Richtig!\",IF(AND(D38<>H38,F38=H38),\"Formel: OK\",IF(H38=\"\",\"Fehlt\",\"Falsch\"))))","v":"Fehlt"},0,"│",1,null,"x"]
[null,null,null,null,null,null,null,null,null,null,null,null,null,"x"]
["2.","Wert 31. Dezember",null,null,null,null,null,null,null,null,null,null,null,"x"]
[null,{"$f":"IF(Berechnungen!B6=\"\",\"-\",Berechnungen!B6)","v":"RINDER"},null,null,null,null,null,null,null,null,null,null,null,"x"]
[null,{"$f":"IF(Berechnungen!B7=\"\",\"-\",Berechnungen!B7)","v":"Kühe"},{"$f":"MID($B$40,1,12)&\".\"","v":"Wert 31. Dez."},{"$f":"IF(Hilfe!$I7=\"\",\"\",Hilfe!$I7)","v":10200},null,null,null,{"$f":"IF(Berechnungen!$I7=\"\",\"\",Berechnungen!$I7)","v":""},{"$f":"IF(OR(B42=\"-\",AND(D42=\"\",H42=\"\")),\"\",IF(H42=D42,\"Richtig!\",IF(H42=\"\",\"Fehlt\",\"Falsch\")))","v":"Fehlt"},{"$f":"IF(OR(B42=\"-\",N42=\"\",AND(D42=\"\",H42=\"\")),\"-\",IF(I42=\"Richtig!\",1,IF(I42=\"Formel: OK\",0.5,IF(OR(I42=\"Falsch\",I42=\"Fehlt\"),0,\"\"))))","v":0},{"$f":"IF(L42=\"\",\"\",\"│\")","v":"│"},{"$f":"IF(OR(B42=\"-\",N42=\"\",AND(D42=\"\",H42=\"\")),\"\",1)","v":1},null,"x"]
[null,{"$f":"IF(Berechnungen!B8=\"\",\"-\",Berechnungen!B8)","v":"Kalbinnen"},"Wert 31. Dez.",{"$f":"IF(Hilfe!$I8=\"\",\"\",Hilfe!$I8)","v":4448},null,null,null,{"$f":"IF(Berechnungen!$I8=\"\",\"\",Berechnungen!$I8)","v":""},"Fehlt",0,"│",1,null,"x"]
[null,{"$f":"IF(Berechnungen!B9=\"\",\"-\",Berechnungen!B9)","v":"Jungvieh 1 - 2 J."},"Wert 31. Dez.",{"$f":"IF(Hilfe!$I9=\"\",\"\",Hilfe!$I9)","v":3555},null,null,null,{"$f":"IF(Berechnungen!$I9=\"\",\"\",Berechnungen!$I9)","v":""},"Fehlt",0,"│",1,null,"x"]
[null,{"$f":"IF(Berechnungen!B10=\"\",\"-\",Berechnungen!B10)","v":"Jungvieh bis 1 J."},"Wert 31. Dez.",{"$f":"IF(Hilfe!$I10=\"\",\"\",Hilfe!$I10)","v":3150},null,null,null,{"$f":"IF(Berechnungen!$I10=\"\",\"\",Berechnungen!$I10)","v":""},"Fehlt",0,"│",1,null,"x"]
[null,{"$f":"IF(Berechnungen!B11=\"\",\"-\",Berechnungen!B11)","v":"Kälber weib."},"Wert 31. Dez.",{"$f":"IF(Hilfe!$I11=\"\",\"\",Hilfe!$I11)","v":1184},null,null,null,{"$f":"IF(Berechnungen!$I11=\"\",\"\",Berechnungen!$I11)","v":""},"Fehlt",0,"│",1,null,"x"]
[null,{"$f":"IF(Berechnungen!B12=\"\",\"-\",Berechnungen!B12)","v":"Kälber männ."},"Wert 31. Dez.",{"$f":"IF(Hilfe!$I12=\"\",\"\",Hilfe!$I12)","v":358},null,null,null,{"$f":"IF(Berechnungen!$I12=\"\",\"\",Berechnungen!$I12)","v":""},"Fehlt",0,"│",1,null,"x"]
[null,{"$f":"IF(Berechnungen!B13=\"\",\"-\",Berechnungen!B13)","v":"-"},"Wert 31. Dez.",{"$f":"IF(Hilfe!$I13=\"\",\"\",Hilfe!$I13)","v":""},null,null,null,{"$f":"IF(Berechnungen!$I13=\"\",\"\",Berechnungen!$I13)","v":""},"","-","","",null,"x"]
[null,{"$f":"IF(Berechnungen!B14=\"\",\"-\",Berechnungen!B14)","v":"Summe RINDER"},"Wert 31. Dez.",{"$f":"IF(Hilfe!$I14=\"\",\"\",Hilfe!$I14)","v":22895},null,{"$f":"IF(AND(H42=\"\",H43=\"\",H44=\"\",H45=\"\",H46=\"\",H47=\"\",H48=\"\"),\"-\",SUM(H42:H48))","v":"-"},null,{"$f":"IF(Berechnungen!$I14=\"\",\"\",Berechnungen!$I14)","v":""},{"$f":"IF(B49=\"-\",\"\",IF(H49=D49,\"Richtig!\",IF(AND(D49<>H49,F49=H49),\"Formel: OK\",IF(H49=\"\",\"Fehlt\",\"Falsch\"))))","v":"Fehlt"},0,"│",1,null,"x"]
[null,{"$f":"IF(Berechnungen!B22=\"\",\"-\",Berechnungen!B22)","v":"SCHWEINE"},null,null,null,null,null,null,null,null,null,null,null,"x"]
[null,{"$f":"IF(Berechnungen!B23=\"\",\"-\",Berechnungen!B23)","v":"Mastsauen"},{"$f":"MID($B$40,1,12)&\".\"","v":"Wert 31. Dez."},{"$f":"IF(Hilfe!$I23=\"\",\"\",Hilfe!$I23)","v":1043},null,null,null,{"$f":"IF(Berechnungen!$I23=\"\",\"\",Berechnungen!$I23)","v":""},{"$f":"IF(OR(B51=\"-\",AND(D51=\"\",H51=\"\")),\"\",IF(H51=D51,\"Richtig!\",IF(H51=\"\",\"Fehlt\",\"Falsch\")))","v":"Fehlt"},{"$f":"IF(OR(B51=\"-\",N51=\"\",AND(D51=\"\",H51=\"\")),\"-\",IF(I51=\"Richtig!\",1,IF(I51=\"Formel: OK\",0.5,IF(OR(I51=\"Falsch\",I51=\"Fehlt\"),0,\"\"))))","v":0},{"$f":"IF(L51=\"\",\"\",\"│\")","v":"│"},{"$f":"IF(OR(B51=\"-\",N51=\"\",AND(D51=\"\",H51=\"\")),\"\",1)","v":1},null,"x"]
[null,{"$f":"IF(Berechnungen!B24=\"\",\"-\",Berechnungen!B24)","v":"Ferkel"},"Wert 31. Dez.",{"$f":"IF(Hilfe!$I24=\"\",\"\",Hilfe!$I24)","v":220},null,null,null,{"$f":"IF(Berechnungen!$I24=\"\",\"\",Berechnungen!$I24)","v":""},{"$f":"IF(OR(B52=\"-\",AND(D52=\"\",H52=\"\")),\"\",IF(H52=D52,\"Richtig!\",IF(H52=\"\",\"Fehlt\",\"Falsch\")))","v":"Fehlt"},0,"│",1,null,"x"]
[null,{"$f":"IF(Berechnungen!B25=\"\",\"-\",Berechnungen!B25)","v":"-"},"Wert 31. Dez.",{"$f":"IF(Hilfe!$I25=\"\",\"\",Hilfe!$I25)","v":""},null,null,null,{"$f":"IF(Berechnungen!$I25=\"\",\"\",Berechnungen!$I25)","v":""},{"$f":"IF(OR(B53=\"-\",AND(D53=\"\",H53=\"\")),\"\",IF(H53=D53,\"Richtig!\",IF(H53=\"\",\"Fehlt\",\"Falsch\")))","v":""},"-","","",null,"x"]
[null,{"$f":"IF(Berechnungen!B26=\"\",\"-\",Berechnungen!B26)","v":"-"},"Wert 31. Dez.",{"$f":"IF(Hilfe!$I26=\"\",\"\",Hilfe!$I26)","v":""},null,null,null,{"$f":"IF(Berechnungen!$I26=\"\",\"\",Berechnungen!$I26)","v":""},{"$f":"IF(OR(B54=\"-\",AND(D54=\"\",H54=\"\")),\"\",IF(H54=D54,\"Richtig!\",IF(H54=\"\",\"Fehlt\",\"Falsch\")))","v":""},"-","","",null,"x"]
[null,{"$f":"IF(Berechnungen!B27=\"\",\"-\",Berechnungen!B27)","v":"-"},"Wert 31. Dez.",{"$f":"IF(Hilfe!$I27=\"\",\"\",Hilfe!$I27)","v":""},null,null,null,{"$f":"IF(Berechnungen!$I27=\"\",\"\",Berechnungen!$I27)","v":""},{"$f":"IF(OR(B55=\"-\",AND(D55=\"\",H55=\"\")),\"\",IF(H55=D55,\"Richtig!\",IF(H55=\"\",\"Fehlt\",\"Falsch\")))","v":""},"-","","",null,"x"]
[null,{"$f":"IF(Berechnungen!B28=\"\",\"-\",Berechnungen!B28)","v":"Summe SCHWEINE"},"Wert 31. Dez.",{"$f":"IF(Hilfe!$I28=\"\",\"\",Hilfe!$I28)","v":1263},null,{"$f":"IF(AND(H51=\"\",H52=\"\",H53=\"\",H54=\"\",H55=\"\"),\"-\",SUM(H51:H55))","v":"-"},null,{"$f":"IF(Berechnungen!$I28=\"\",\"\",Berechnungen!$I28)","v":""},{"$f":"IF(B56=\"-\",\"\",IF(H56=D56,\"Richtig!\",IF(AND(D56<>H56,F56=H56),\"Formel: OK\",IF(H56=\"\",\"Fehlt\",\"Falsch\"))))","v":"Fehlt"},0,"│",1,null,"x"]
[null,{"$f":"IF(Berechnungen!B37=\"\",\"-\",Berechnungen!B37)","v":"Selbst erzeugte Vorräte"},null,null,null,null,null,null,null,null,null,null,null,"x"]
[null,{"$f":"IF(Berechnungen!B38=\"\",\"-\",Berechnungen!B38)","v":"Gerste"},{"$f":"MID($B$40,1,12)&\".\"","v":"Wert 31. Dez."},{"$f":"IF(Hilfe!$I38=\"\",\"\",Hilfe!$I38)","v":104},null,null,null,{"$f":"IF(Berechnungen!$I38=\"\",\"\",Berechnungen!$I38)","v":""},{"$f":"IF(OR(B58=\"-\",AND(D58=\"\",H58=\"\")),\"\",IF(H58=D58,\"Richtig!\",IF(H58=\"\",\"Fehlt\",\"Falsch\")))","v":"Fehlt"},{"$f":"IF(OR(B58=\"-\",N58=\"\",AND(D58=\"\",H58=\"\")),\"-\",IF(I58=\"Richtig!\",1,IF(I58=\"Formel: OK\",0.5,IF(OR(I58=\"Falsch\",I58=\"Fehlt\"),0,\"\"))))","v":0},{"$f":"IF(L58=\"\",\"\",\"│\")","v":"│"},{"$f":"IF(OR(B58=\"-\",N58=\"\",AND(D58=\"\",H58=\"\")),\"\",1)","v":1},null,"x"]
[null,{"$f":"IF(Berechnungen!B39=\"\",\"-\",Berechnungen!B39)","v":"Futterkartoffeln"},"Wert 31. Dez.",{"$f":"IF(Hilfe!$I39=\"\",\"\",Hilfe!$I39)","v":90},null,null,null,{"$f":"IF(Berechnungen!$I39=\"\",\"\",Berechnungen!$I39)","v":""},{"$f":"IF(OR(B59=\"-\",AND(D59=\"\",H59=\"\")),\"\",IF(H59=D59,\"Richtig!\",IF(H59=\"\",\"Fehlt\",\"Falsch\")))","v":"Fehlt"},0,"│",1,null,"x"]
[null,{"$f":"IF(Berechnungen!B40=\"\",\"-\",Berechnungen!B40)","v":"Brennholz"},"Wert 31. Dez.",{"$f":"IF(Hilfe!$I40=\"\",\"\",Hilfe!$I40)","v":105.76},null,null,null,{"$f":"IF(Berechnungen!$I40=\"\",\"\",Berechnungen!$I40)","v":""},{"$f":"IF(OR(B60=\"-\",AND(D60=\"\",H60=\"\")),\"\",IF(H60=D60,\"Richtig!\",IF(H60=\"\",\"Fehlt\",\"Falsch\")))","v":"Fehlt"},0,"│",1,null,"x"]
[null,{"$f":"IF(Berechnungen!B41=\"\",\"-\",Berechnungen!B41)","v":"-"},"Wert 31. Dez.",{"$f":"IF(Hilfe!$I41=\"\",\"\",Hilfe!$I41)","v":""},null,null,null,{"$f":"IF(Berechnungen!$I41=\"\",\"\",Berechnungen!$I41)","v":""},{"$f":"IF(OR(B61=\"-\",AND(D61=\"\",H61=\"\")),\"\",IF(H61=D61,\"Richtig!\",IF(H61=\"\",\"Fehlt\",\"Falsch\")))","v":""},"-","","",null,"x"]
[null,{"$f":"IF(Berechnungen!B42=\"\",\"-\",Berechnungen!B42)","v":"-"},"Wert 31. Dez.",{"$f":"IF(Hilfe!$I42=\"\",\"\",Hilfe!$I42)","v":""},null,null,null,{"$f":"IF(Berechnungen!$I42=\"\",\"\",Berechnungen!$I42)","v":""},{"$f":"IF(OR(B62=\"-\",AND(D62=\"\",H62=\"\")),\"\",IF(H62=D62,\"Richtig!\",IF(H62=\"\",\"Fehlt\",\"Falsch\")))","v":""},"-","","",null,"x"]
[null,{"$f":"IF(Berechnungen!B43=\"\",\"-\",Berechnungen!B43)","v":"Summe selbst erzeugte Vorräte"},"Wert 31. Dez.",{"$f":"IF(Hilfe!$I43=\"\",\"\",Hilfe!$I43)","v":299.76},null,{"$f":"IF(AND(H58=\"\",H59=\"\",H60=\"\",H61=\"\",H62=\"\"),\"-\",SUM(H58:H62))","v":"-"},null,{"$f":"IF(Berechnungen!$I43=\"\",\"\",Berechnungen!$I43)","v":""},{"$f":"IF(B63=\"-\",\"\",IF(H63=D63,\"Richtig!\",IF(AND(D63<>H63,F63=H63),\"Formel: OK\",IF(H63=\"\",\"Fehlt\",\"Falsch\"))))","v":"Fehlt"},0,"│",1,null,"x"]
[null,{"$f":"IF(Berechnungen!B51=\"\",\"-\",Berechnungen!B51)","v":"Zugekaufte Vorräte"},null,{"$f":"IF(Hilfe!$I51=\"\",\"\",Hilfe!$I51)","v":""},null,null,null,{"$f":"IF(Berechnungen!$I51=\"\",\"\",Berechnungen!$I51)","v":""},null,null,"","",null,"x"]
[null,{"$f":"IF(Berechnungen!B52=\"\",\"-\",Berechnungen!B52)","v":"Milchkraftfutter"},{"$f":"MID($B$40,1,12)&\".\"","v":"Wert 31. Dez."},{"$f":"IF(Hilfe!$I52=\"\",\"\",Hilfe!$I52)","v":345},null,null,null,{"$f":"IF(Berechnungen!$I52=\"\",\"\",Berechnungen!$I52)","v":""},{"$f":"IF(OR(B65=\"-\",AND(D65=\"\",H65=\"\")),\"\",IF(H65=D65,\"Richtig!\",IF(H65=\"\",\"Fehlt\",\"Falsch\")))","v":"Fehlt"},{"$f":"IF(OR(B65=\"-\",N65=\"\",AND(D65=\"\",H65=\"\")),\"-\",IF(I65=\"Richtig!\",1,IF(I65=\"Formel: OK\",0.5,IF(OR(I65=\"Falsch\",I65=\"Fehlt\"),0,\"\"))))","v":0},"│",1,null,"x"]
[null,{"$f":"IF(Berechnungen!B53=\"\",\"-\",Berechnungen!B53)","v":"Weizenschrot"},"Wert 31. Dez.",{"$f":"IF(Hilfe!$I53=\"\",\"\",Hilfe!$I53)","v":95},null,null,null,{"$f":"IF(Berechnungen!$I53=\"\",\"\",Berechnungen!$I53)","v":""},{"$f":"IF(OR(B66=\"-\",AND(D66=\"\",H66=\"\")),\"\",IF(H66=D66,\"Richtig!\",IF(H66=\"\",\"Fehlt\",\"Falsch\")))","v":"Fehlt"},0,"│",1,null,"x"]
[null,{"$f":"IF(Berechnungen!B54=\"\",\"-\",Berechnungen!B54)","v":"Erbsenschrot"},"Wert 31. Dez.",{"$f":"IF(Hilfe!$I54=\"\",\"\",Hilfe!$I54)","v":60},null,null,null,{"$f":"IF(Berechnungen!$I54=\"\",\"\",Berechnungen!$I54)","v":""},{"$f":"IF(OR(B67=\"-\",AND(D67=\"\",H67=\"\")),\"\",IF(H67=D67,\"Richtig!\",IF(H67=\"\",\"Fehlt\",\"Falsch\")))","v":"Fehlt"},0,"│",1,null,"x"]
[null,{"$f":"IF(Berechnungen!B55=\"\",\"-\",Berechnungen!B55)","v":"-"},"Wert 31. Dez.",{"$f":"IF(Hilfe!$I55=\"\",\"\",Hilfe!$I55)","v":""},null,null,null,{"$f":"IF(Berechnungen!$I55=\"\",\"\",Berechnungen!$I55)","v":""},{"$f":"IF(OR(B68=\"-\",AND(D68=\"\",H68=\"\")),\"\",IF(H68=D68,\"Richtig!\",IF(H68=\"\",\"Fehlt\",\"Falsch\")))","v":""},"-","","",null,"x"]
[null,{"$f":"IF(Berechnungen!B56=\"\",\"-\",Berechnungen!B56)","v":"-"},"Wert 31. Dez.",{"$f":"IF(Hilfe!$I56=\"\",\"\",Hilfe!$I56)","v":""},null,null,null,{"$f":"IF(Berechnungen!$I56=\"\",\"\",Berechnungen!$I56)","v":""},{"$f":"IF(OR(B69=\"-\",AND(D69=\"\",H69=\"\")),\"\",IF(H69=D69,\"Richtig!\",IF(H69=\"\",\"Fehlt\",\"Falsch\")))","v":""},"-","","",null,"x"]
[null,{"$f":"IF(Berechnungen!B57=\"\",\"-\",Berechnungen!B57)","v":"Summe zugekaufte Vorräte"},"Wert 31. Dez.",{"$f":"IF(Hilfe!$I57=\"\",\"\",Hilfe!$I57)","v":500},null,{"$f":"IF(AND(H65=\"\",H66=\"\",H67=\"\",H68=\"\",H69=\"\"),\"-\",SUM(H65:H69))","v":"-"},null,{"$f":"IF(Berechnungen!$I57=\"\",\"\",Berechnungen!$I57)","v":""},{"$f":"IF(B70=\"-\",\"\",IF(H70=D70,\"Richtig!\",IF(AND(D70<>H70,F70=H70),\"Formel: OK\",IF(H70=\"\",\"Fehlt\",\"Falsch\"))))","v":"Fehlt"},0,"│",1,null,"x"]
[null,null,null,null,null,null,null,null,null,null,null,null,null,"x"]
["3.","Mehrwert/Minderwert",null,null,null,null,null,null,null,null,null,null,null,{"$f":"IF($L$1=\"\",\"\",$L$1)","v":"x"}]
[null,{"$f":"IF(Berechnungen!B6=\"\",\"-\",Berechnungen!B6)","v":"RINDER"},null,null,null,null,null,null,null,null,null,null,null,"x"]
[null,{"$f":"IF(Berechnungen!B7=\"\",\"-\",Berechnungen!B7)","v":"Kühe"},{"$f":"MID($B$72,1,5)&\"./\"&MID($B$72,10,7)&\".\"","v":"Mehrw./Minderw."},{"$f":"IF(Hilfe!$J7=\"\",\"\",Hilfe!$J7)","v":1029},null,{"$f":"IF(OR(H42=\"\",H10=\"\"),\"-\",H42-H10)","v":"-"},null,{"$f":"IF(Berechnungen!$J7=\"\",\"\",Berechnungen!$J7)","v":""},{"$f":"IF(B74=\"-\",\"\",IF(H74=D74,\"Richtig!\",IF(AND(D74<>H74,F74=H74),\"Formel: OK\",IF(H74=\"\",\"Fehlt\",\"Falsch\"))))","v":"Fehlt"},{"$f":"IF(OR(B74=\"-\",N74=\"\",AND(D74=\"\",H74=\"\")),\"-\",IF(I74=\"Richtig!\",1,IF(I74=\"Formel: OK\",0.5,IF(OR(I74=\"Falsch\",I74=\"Fehlt\"),0,\"\"))))","v":0},{"$f":"IF(L74=\"\",\"\",\"│\")","v":"│"},{"$f":"IF(OR(B74=\"-\",N74=\"\",AND(D74=\"\",H74=\"\")),\"\",1)","v":1},null,"x"]
[null,{"$f":"IF(Berechnungen!B8=\"\",\"-\",Berechnungen!B8)","v":"Kalbinnen"},"Mehrw./Minderw.",{"$f":"IF(Hilfe!$J8=\"\",\"\",Hilfe!$J8)","v":-2242},null,{"$f":"IF(OR(H43=\"\",H11=\"\"),\"-\",H43-H11)","v":"-"},null,{"$f":"IF(Berechnungen!$J8=\"\",\"\",Berechnungen!$J8)","v":""},{"$f":"IF(B75=\"-\",\"\",IF(H75=D75,\"Richtig!\",IF(AND(D75<>H75,F75=H75),\"Formel: OK\",IF(H75=\"\",\"Fehlt\",\"Falsch\"))))","v":"Fehlt"},0,"│",1,null,"x"]
[null,{"$f":"IF(Berechnungen!B9=\"\",\"-\",Berechnungen!B9)","v":"Jungvieh 1 - 2 J."},"Mehrw./Minderw.",{"$f":"IF(Hilfe!$J9=\"\",\"\",Hilfe!$J9)","v":707},null,"-",null,{"$f":"IF(Berechnungen!$J9=\"\",\"\",Berechnungen!$J9)","v":""},"Fehlt",0,"│",1,null,"x"]
[null,{"$f":"IF(Berechnungen!B10=\"\",\"-\",Berechnungen!B10)","v":"Jungvieh bis 1 J."},"Mehrw./Minderw.",{"$f":"IF(Hilfe!$J10=\"\",\"\",Hilfe!$J10)","v":520},null,"-",null,{"$f":"IF(Berechnungen!$J10=\"\",\"\",Berechnungen!$J10)","v":""},"Fehlt",0,"│",1,null,"x"]
[null,{"$f":"IF(Berechnungen!B11=\"\",\"-\",Berechnungen!B11)","v":"Kälber weib."},"Mehrw./Minderw.",{"$f":"IF(Hilfe!$J11=\"\",\"\",Hilfe!$J11)","v":4},null,"-",null,{"$f":"IF(Berechnungen!$J11=\"\",\"\",Berechnungen!$J11)","v":""},"Fehlt",0,"│",1,null,"x"]
[null,{"$f":"IF(Berechnungen!B12=\"\",\"-\",Berechnungen!B12)","v":"Kälber männ."},"Mehrw./Minderw.",{"$f":"IF(Hilfe!$J12=\"\",\"\",Hilfe!$J12)","v":-179},null,"-",null,{"$f":"IF(Berechnungen!$J12=\"\",\"\",Berechnungen!$J12)","v":""},"Fehlt",0,"│",1,null,"x"]
[null,{"$f":"IF(Berechnungen!B13=\"\",\"-\",Berechnungen!B13)","v":"-"},"Mehrw./Minderw.",{"$f":"IF(Hilfe!$J13=\"\",\"\",Hilfe!$J13)","v":""},null,"-",null,{"$f":"IF(Berechnungen!$J13=\"\",\"\",Berechnungen!$J13)","v":""},"","-","","",null,"x"]
[null,{"$f":"IF(Berechnungen!B14=\"\",\"-\",Berechnungen!B14)","v":"Summe RINDER"},"Mehrw./Minderw.",{"$f":"IF(Hilfe!$J14=\"\",\"\",Hilfe!$J14)","v":-161},null,"-",null,{"$f":"IF(Berechnungen!$J14=\"\",\"\",Berechnungen!$J14)","v":""},"Fehlt",0,"│",1,null,"x"]
[null,{"$f":"IF(Berechnungen!B22=\"\",\"-\",Berechnungen!B22)","v":"SCHWEINE"},null,null,null,null,null,null,null,null,null,null,null,"x"]
[null,{"$f":"IF(Berechnungen!B23=\"\",\"-\",Berechnungen!B23)","v":"Mastsauen"},{"$f":"MID($B$72,1,5)&\"./\"&MID($B$72,10,7)&\".\"","v":"Mehrw./Minderw."},{"$f":"IF(Hilfe!$J23=\"\",\"\",Hilfe!$J23)","v":745.74},null,{"$f":"IF(AND(H51=\"\",H19=\"\"),\"-\",H51-H19)","v":"-"},null,{"$f":"IF(Berechnungen!$J23=\"\",\"\",Berechnungen!$J23)","v":""},{"$f":"IF(B83=\"-\",\"\",IF(H83=D83,\"Richtig!\",IF(AND(D83<>H83,F83=H83),\"Formel: OK\",IF(H83=\"\",\"Fehlt\",\"Falsch\"))))","v":"Fehlt"},{"$f":"IF(OR(B83=\"-\",N83=\"\",AND(D83=\"\",H83=\"\")),\"-\",IF(I83=\"Richtig!\",1,IF(I83=\"Formel: OK\",0.5,IF(OR(I83=\"Falsch\",I83=\"Fehlt\"),0,\"\"))))","v":0},{"$f":"IF(L83=\"\",\"\",\"│\")","v":"│"},{"$f":"IF(OR(B83=\"-\",N83=\"\",AND(D83=\"\",H83=\"\")),\"\",1)","v":1},null,"x"]
[null,{"$f":"IF(Berechnungen!B24=\"\",\"-\",Berechnungen!B24)","v":"Ferkel"},"Mehrw./Minderw.",{"$f":"IF(Hilfe!$J24=\"\",\"\",Hilfe!$J24)","v":109.64},null,{"$f":"IF(AND(H52=\"\",H20=\"\"),\"-\",H52-H20)","v":"-"},null,{"$f":"IF(Berechnungen!$J24=\"\",\"\",Berechnungen!$J24)","v":""},"Fehlt",0,"│",1,null,"x"]
[null,{"$f":"IF(Berechnungen!B25=\"\",\"-\",Berechnungen!B25)","v":"-"},"Mehrw./Minderw.",{"$f":"IF(Hilfe!$J25=\"\",\"\",Hilfe!$J25)","v":""},null,{"$f":"IF(AND(H53=\"\",H21=\"\"),\"-\",H53-H21)","v":"-"},null,{"$f":"IF(Berechnungen!$J25=\"\",\"\",Berechnungen!$J25)","v":""},"","-","","",null,"x"]
[null,{"$f":"IF(Berechnungen!B26=\"\",\"-\",Berechnungen!B26)","v":"-"},"Mehrw./Minderw.",{"$f":"IF(Hilfe!$J26=\"\",\"\",Hilfe!$J26)","v":""},null,{"$f":"IF(AND(H54=\"\",H22=\"\"),\"-\",H54-H22)","v":"-"},null,{"$f":"IF(Berechnungen!$J26=\"\",\"\",Berechnungen!$J26)","v":""},"","-","","",null,"x"]
[null,{"$f":"IF(Berechnungen!B27=\"\",\"-\",Berechnungen!B27)","v":"-"},"Mehrw./Minderw.",{"$f":"IF(Hilfe!$J27=\"\",\"\",Hilfe!$J27)","v":""},null,{"$f":"IF(AND(H55=\"\",H23=\"\"),\"-\",H55-H23)","v":"-"},null,{"$f":"IF(Berechnungen!$J27=\"\",\"\",Berechnungen!$J27)","v":""},"","-","","",null,"x"]
[null,{"$f":"IF(Berechnungen!B28=\"\",\"-\",Berechnungen!B28)","v":"Summe SCHWEINE"},"Mehrw./Minderw.",{"$f":"IF(Hilfe!$J28=\"\",\"\",Hilfe!$J28)","v":855.38},null,{"$f":"IF(AND(H83=\"\",H84=\"\",H85=\"\",H86=\"\",H87=\"\"),\"-\",SUM(H83:H87))","v":"-"},null,{"$f":"IF(Berechnungen!$J28=\"\",\"\",Berechnungen!$J28)","v":""},"Fehlt",0,"│",1,null,"x"]
[null,{"$f":"IF(Berechnungen!B37=\"\",\"-\",Berechnungen!B37)","v":"Selbst erzeugte Vorräte"},null,null,null,null,null,null,null,null,null,null,null,"x"]
[null,{"$f":"IF(Berechnungen!B38=\"\",\"-\",Berechnungen!B38)","v":"Gerste"},{"$f":"MID($B$72,1,5)&\"./\"&MID($B$72,10,7)&\".\"","v":"Mehrw./Minderw."},{"$f":"IF(Hilfe!$J38=\"\",\"\",Hilfe!$J38)","v":92},null,{"$f":"IF(AND(H58=\"\",H26=\"\"),\"-\",H58-H26)","v":"-"},null,{"$f":"IF(Berechnungen!$J38=\"\",\"\",Berechnungen!$J38)","v":""},{"$f":"IF(B90=\"-\",\"\",IF(H90=D90,\"Richtig!\",IF(AND(D90<>H90,F90=H90),\"Formel: OK\",IF(H90=\"\",\"Fehlt\",\"Falsch\"))))","v":"Fehlt"},{"$f":"IF(OR(B90=\"-\",N90=\"\",AND(D90=\"\",H90=\"\")),\"-\",IF(I90=\"Richtig!\",1,IF(I90=\"Formel: OK\",0.5,IF(OR(I90=\"Falsch\",I90=\"Fehlt\"),0,\"\"))))","v":0},{"$f":"IF(L90=\"\",\"\",\"│\")","v":"│"},{"$f":"IF(OR(B90=\"-\",N90=\"\",AND(D90=\"\",H90=\"\")),\"\",1)","v":1},null,"x"]
[null,{"$f":"IF(Berechnungen!B39=\"\",\"-\",Berechnungen!B39)","v":"Futterkartoffeln"},"Mehrw./Minderw.",{"$f":"IF(Hilfe!$J39=\"\",\"\",Hilfe!$J39)","v":-4.5000000000000142},null,{"$f":"IF(AND(H59=\"\",H27=\"\"),\"-\",H59-H27)","v":"-"},null,{"$f":"IF(Berechnungen!$J39=\"\",\"\",Berechnungen!$J39)","v":""},"Fehlt",0,"│",1,null,"x"]
[null,{"$f":"IF(Berechnungen!B40=\"\",\"-\",Berechnungen!B40)","v":"Brennholz"},"Mehrw./Minderw.",{"$f":"IF(Hilfe!$J40=\"\",\"\",Hilfe!$J40)","v":-628.64},null,{"$f":"IF(AND(H60=\"\",H28=\"\"),\"-\",H60-H28)","v":"-"},null,{"$f":"IF(Berechnungen!$J40=\"\",\"\",Berechnungen!$J40)","v":""},"Fehlt",0,"│",1,null,"x"]
[null,{"$f":"IF(Berechnungen!B41=\"\",\"-\",Berechnungen!B41)","v":"-"},"Mehrw./Minderw.",{"$f":"IF(Hilfe!$J41=\"\",\"\",Hilfe!$J41)","v":""},null,{"$f":"IF(AND(H61=\"\",H29=\"\"),\"-\",H61-H29)","v":"-"},null,{"$f":"IF(Berechnungen!$J41=\"\",\"\",Berechnungen!$J41)","v":""},"","-","","",null,"x"]
[null,{"$f":"IF(Berechnungen!B42=\"\",\"-\",Berechnungen!B42)","v":"-"},"Mehrw./Minderw.",{"$f":"IF(Hilfe!$J42=\"\",\"\",Hilfe!$J42)","v":""},null,{"$f":"IF(AND(H62=\"\",H30=\"\"),\"-\",H62-H30)","v":"-"},null,{"$f":"IF(Berechnungen!$J42=\"\",\"\",Berechnungen!$J42)","v":""},"","-","","",null,"x"]
[null,{"$f":"IF(Berechnungen!B43=\"\",\"-\",Berechnungen!B43)","v":"Summe selbst erzeugte Vorräte"},"Mehrw./Minderw.",{"$f":"IF(Hilfe!$J43=\"\",\"\",Hilfe!$J43)","v":-541.14},null,{"$f":"IF(AND(H90=\"\",H91=\"\",H92=\"\",H93=\"\",H94=\"\"),\"-\",SUM(H90:H94))","v":"-"},null,{"$f":"IF(Berechnungen!$J43=\"\",\"\",Berechnungen!$J43)","v":""},"Fehlt",0,"│",1,null,"x"]
[null,{"$f":"IF(Berechnungen!B51=\"\",\"-\",Berechnungen!B51)","v":"Zugekaufte Vorräte"},null,{"$f":"IF(Hilfe!$J51=\"\",\"\",Hilfe!$J51)","v":""},null,null,null,{"$f":"IF(Berechnungen!$J51=\"\",\"\",Berechnungen!$J51)","v":""},null,null,"","",null,"x"]
[null,{"$f":"IF(Berechnungen!B52=\"\",\"-\",Berechnungen!B52)","v":"Milchkraftfutter"},{"$f":"MID($B$72,1,5)&\"./\"&MID($B$72,10,7)&\".\"","v":"Mehrw./Minderw."},{"$f":"IF(Hilfe!$J52=\"\",\"\",Hilfe!$J52)","v":202},null,{"$f":"IF(AND(H65=\"\",H33=\"\"),\"-\",H65-H33)","v":"-"},null,{"$f":"IF(Berechnungen!$J52=\"\",\"\",Berechnungen!$J52)","v":""},{"$f":"IF(B97=\"-\",\"\",IF(H97=D97,\"Richtig!\",IF(AND(D97<>H97,F97=H97),\"Formel: OK\",IF(H97=\"\",\"Fehlt\",\"Falsch\"))))","v":"Fehlt"},{"$f":"IF(OR(B97=\"-\",N97=\"\",AND(D97=\"\",H97=\"\")),\"-\",IF(I97=\"Richtig!\",1,IF(I97=\"Formel: OK\",0.5,IF(OR(I97=\"Falsch\",I97=\"Fehlt\"),0,\"\"))))","v":0},"│",1,null,"x"]
[null,{"$f":"IF(Berechnungen!B53=\"\",\"-\",Berechnungen!B53)","v":"Weizenschrot"},"Mehrw./Minderw.",{"$f":"IF(Hilfe!$J53=\"\",\"\",Hilfe!$J53)","v":25},null,{"$f":"IF(AND(H66=\"\",H34=\"\"),\"-\",H66-H34)","v":"-"},null,{"$f":"IF(Berechnungen!$J53=\"\",\"\",Berechnungen!$J53)","v":""},"Fehlt",0,"│",1,null,"x"]
[null,{"$f":"IF(Berechnungen!B54=\"\",\"-\",Berechnungen!B54)","v":"Erbsenschrot"},"Mehrw./Minderw.",{"$f":"IF(Hilfe!$J54=\"\",\"\",Hilfe!$J54)","v":45},null,{"$f":"IF(AND(H67=\"\",H35=\"\"),\"-\",H67-H35)","v":"-"},null,{"$f":"IF(Berechnungen!$J54=\"\",\"\",Berechnungen!$J54)","v":""},"Fehlt",0,"│",1,null,"x"]
[null,{"$f":"IF(Berechnungen!B55=\"\",\"-\",Berechnungen!B55)","v":"-"},"Mehrw./Minderw.",{"$f":"IF(Hilfe!$J55=\"\",\"\",Hilfe!$J55)","v":""},null,{"$f":"IF(AND(H68=\"\",H36=\"\"),\"-\",H68-H36)","v":"-"},null,{"$f":"IF(Berechnungen!$J55=\"\",\"\",Berechnungen!$J55)","v":""},"","-","","",null,"x"]
[null,{"$f":"IF(Berechnungen!B56=\"\",\"-\",Berechnungen!B56)","v":"-"},"Mehrw./Minderw.",{"$f":"IF(Hilfe!$J56=\"\",\"\",Hilfe!$J56)","v":""},null,{"$f":"IF(AND(H69=\"\",H37=\"\"),\"-\",H69-H37)","v":"-"},null,{"$f":"IF(Berechnungen!$J56=\"\",\"\",Berechnungen!$J56)","v":""},"","-","","",null,"x"]
[null,{"$f":"IF(Berechnungen!B57=\"\",\"-\",Berechnungen!B57)","v":"Summe zugekaufte Vorräte"},"Mehrw./Minderw.",{"$f":"IF(Hilfe!$J57=\"\",\"\",Hilfe!$J57)","v":272},null,{"$f":"IF(AND(H97=\"\",H98=\"\",H99=\"\",H100=\"\",H101=\"\"),\"-\",SUM(H97:H101))","v":"-"},null,{"$f":"IF(Berechnungen!$J57=\"\",\"\",Berechnungen!$J57)","v":""},"Fehlt",0,"│",1,null,"x"]
[null,null,null,null,null,null,null,null,null,null,null,null,null,"x"]
["4.","Mehrwert/Minderwert",null,null,null,null,null,null,null,null,null,null,null,"x"]
[null,{"$f":"IF(Berechnungen!B6=\"\",\"-\",Berechnungen!B6)","v":"RINDER"},null,null,null,null,null,null,null,null,null,null,null,"x"]
[null,{"$f":"IF(Berechnungen!D16=\"\",\"-\",Berechnungen!D16)","v":"Mehrwert"},"Kreuze an!",{"$f":"IF(Hilfe!$C16=\"\",\"\",Hilfe!$C16)","v":""},null,{"$f":"IF(H81=\"\",\"-\",IF(H81>0,\"x\",\"\"))","v":"-"},null,{"$f":"IF(Berechnungen!$C16=\"\",\"\",Berechnungen!$C16)","v":""},{"$f":"IF(AND(B106=\"\",B107=\"\",B108=\"\"),\"\",IF(AND(H106=D106,H107=D107,H108=D108),\"Richtig!\",IF(AND(D106<>H106,F106=H106,D107<>H107,F107=H107,D108<>H108,F108=H108),\"Formel: OK\",IF(AND(H106=\"\",H107=\"\",H108=\"\"),\"Fehlt\",\"Falsch\"))))","v":"Fehlt"},{"$f":"IF(OR(N106<>\"x\",B106=\"-\"),\"-\",IF(I106=\"Richtig!\",1,IF(I106=\"Formel: OK\",0.5,IF(OR(I106=\"Falsch\",I106=\"Fehlt\"),0,\"\"))))","v":0},"│",{"$f":"IF(OR(N106<>\"x\",B106=\"\"),\"-\",1)","v":1},null,"x"]
[null,{"$f":"IF(Berechnungen!D18=\"\",\"-\",Berechnungen!D18)","v":"gleich geblieben"},"Kreuze an!",{"$f":"IF(Hilfe!$C18=\"\",\"\",Hilfe!$C18)","v":""},null,{"$f":"IF(H81=\"\",\"-\",IF(H81=0,\"x\",\"\"))","v":"-"},null,{"$f":"IF(Berechnungen!$C18=\"\",\"\",Berechnungen!$C18)","v":""},null,null,null,null,null,"x"]
[null,{"$f":"IF(Berechnungen!D20=\"\",\"-\",Berechnungen!D20)","v":"Minderwert"},"Kreuze an!",{"$f":"IF(Hilfe!$C20=\"\",\"\",Hilfe!$C20)","v":"x"},null,{"$f":"IF(H81=\"\",\"-\",IF(H81<0,\"x\",\"\"))","v":"-"},null,{"$f":"IF(Berechnungen!$C20=\"\",\"\",Berechnungen!$C20)","v":""},null,null,null,null,null,"x"]
[null,{"$f":"IF(Berechnungen!B22=\"\",\"-\",Berechnungen!B22)","v":"SCHWEINE"},null,null,null,null,null,null,null,null,null,null,null,"x"]
[null,{"$f":"IF(Berechnungen!D30=\"\",\"-\",Berechnungen!D30)","v":"Mehrwert"},"Kreuze an!",{"$f":"IF(Hilfe!$C30=\"\",\"\",Hilfe!$C30)","v":"x"},null,{"$f":"IF(H95=\"\",\"-\",IF(H95>0,\"x\",\"\"))","v":"-"},null,{"$f":"IF(Berechnungen!$C30=\"\",\"\",Berechnungen!$C30)","v":""},{"$f":"IF(AND(B110=\"\",B111=\"\",B112=\"\"),\"\",IF(AND(H110=D110,H111=D111,H112=D112),\"Richtig!\",IF(AND(D110<>H110,F110=H110,D111<>H111,F111=H111,D112<>H112,F112=H112),\"Formel: OK\",IF(AND(H110=\"\",H111=\"\",H112=\"\"),\"Fehlt\",\"Falsch\"))))","v":"Fehlt"},{"$f":"IF(OR(N110<>\"x\",B110=\"-\"),\"-\",IF(I110=\"Richtig!\",1,IF(I110=\"Formel: OK\",0.5,IF(OR(I110=\"Falsch\",I110=\"Fehlt\"),0,\"\"))))","v":0},"│",{"$f":"IF(OR(N110<>\"x\",B110=\"\"),\"-\",1)","v":1},null,"x"]
[null,{"$f":"IF(Berechnungen!D32=\"\",\"-\",Berechnungen!D32)","v":"gleich geblieben"},"Kreuze an!",{"$f":"IF(Hilfe!$C32=\"\",\"\",Hilfe!$C32)","v":""},null,{"$f":"IF(H95=\"\",\"-\",IF(H95=0,\"x\",\"\"))","v":"-"},null,{"$f":"IF(Berechnungen!$C32=\"\",\"\",Berechnungen!$C32)","v":""},null,null,null,null,null,"x"]
[null,{"$f":"IF(Berechnungen!D34=\"\",\"-\",Berechnungen!D34)","v":"Minderwert"},"Kreuze an!",{"$f":"IF(Hilfe!$C34=\"\",\"\",Hilfe!$C34)","v":""},null,{"$f":"IF(H95=\"\",\"-\",IF(H95<0,\"x\",\"\"))","v":"-"},null,{"$f":"IF(Berechnungen!$C34=\"\",\"\",Berechnungen!$C34)","v":""},null,null,null,null,null,"x"]
[null,{"$f":"IF(Berechnungen!B37=\"\",\"-\",Berechnungen!B37)","v":"Selbst erzeugte Vorräte"},null,null,null,null,null,null,null,null,null,null,null,"x"]
[null,{"$f":"IF(Berechnungen!D45=\"\",\"-\",Berechnungen!D45)","v":"Mehrwert"},"Kreuze an!",{"$f":"IF(Hilfe!$C45=\"\",\"\",Hilfe!$C45)","v":""},null,{"$f":"IF(H95=\"\",\"-\",IF(H95>0,\"x\",\"\"))","v":"-"},null,{"$f":"IF(Berechnungen!$C45=\"\",\"\",Berechnungen!$C45)","v":""},{"$f":"IF(AND(B114=\"\",B115=\"\",B116=\"\"),\"\",IF(AND(H114=D114,H115=D115,H116=D116),\"Richtig!\",IF(AND(D114<>H114,F114=H114,D115<>H115,F115=H115,D116<>H116,F116=H116),\"Formel: OK\",IF(AND(H114=\"\",H115=\"\",H116=\"\"),\"Fehlt\",\"Falsch\"))))","v":"Fehlt"},{"$f":"IF(OR(N114<>\"x\",B114=\"-\"),\"-\",IF(I114=\"Richtig!\",1,IF(I114=\"Formel: OK\",0.5,IF(OR(I114=\"Falsch\",I114=\"Fehlt\"),0,\"\"))))","v":0},"│",{"$f":"IF(OR(N114<>\"x\",B114=\"\"),\"-\",1)","v":1},null,"x"]
[null,{"$f":"IF(Berechnungen!D47=\"\",\"-\",Berechnungen!D47)","v":"gleich geblieben"},"Kreuze an!",{"$f":"IF(Hilfe!$C47=\"\",\"\",Hilfe!$C47)","v":""},null,{"$f":"IF(H95=\"\",\"-\",IF(H95=0,\"x\",\"\"))","v":"-"},null,{"$f":"IF(Berechnungen!$C47=\"\",\"\",Berechnungen!$C47)","v":""},null,null,null,null,null,"x"]
[null,{"$f":"IF(Berechnungen!D49=\"\",\"-\",Berechnungen!D49)","v":"Minderwert"},"Kreuze an!",{"$f":"IF(Hilfe!$C49=\"\",\"\",Hilfe!$C49)","v":"x"},null,{"$f":"IF(H95=\"\",\"-\",IF(H95<0,\"x\",\"\"))","v":"-"},null,{"$f":"IF(Berechnungen!$C49=\"\",\"\",Berechnungen!$C49)","v":""},null,null,null,null,null,"x"]
[null,{"$f":"IF(Berechnungen!B51=\"\",\"-\",Berechnungen!B51)","v":"Zugekaufte Vorräte"},null,null,null,null,null,null,null,null,null,null,null,"x"]
[null,{"$f":"IF(Berechnungen!D59=\"\",\"-\",Berechnungen!D59)","v":"Mehrwert"},"Kreuze an!",{"$f":"IF(Hilfe!$C59=\"\",\"\",Hilfe!$C59)","v":"x"},null,{"$f":"IF(H109=\"\",\"-\",IF(H109>0,\"x\",\"\"))","v":"-"},null,{"$f":"IF(Berechnungen!$C59=\"\",\"\",Berechnungen!$C59)","v":""},{"$f":"IF(AND(B118=\"\",B119=\"\",B120=\"\"),\"\",IF(AND(H118=D118,H119=D119,H120=D120),\"Richtig!\",IF(AND(D118<>H118,F118=H118,D119<>H119,F119=H119,D120<>H120,F120=H120),\"Formel: OK\",IF(AND(H118=\"\",H119=\"\",H120=\"\"),\"Fehlt\",\"Falsch\"))))","v":"Fehlt"},{"$f":"IF(OR(N118<>\"x\",B118=\"-\"),\"-\",IF(I118=\"Richtig!\",1,IF(I118=\"Formel: OK\",0.5,IF(OR(I118=\"Falsch\",I118=\"Fehlt\"),0,\"\"))))","v":0},"│",{"$f":"IF(OR(N118<>\"x\",B118=\"\"),\"-\",1)","v":1},null,"x"]
[null,{"$f":"IF(Berechnungen!D61=\"\",\"-\",Berechnungen!D61)","v":"gleich geblieben"},"Kreuze an!",{"$f":"IF(Hilfe!$C61=\"\",\"\",Hilfe!$C61)","v":""},null,{"$f":"IF(H109=\"\",\"-\",IF(H109=0,\"x\",\"\"))","v":"-"},null,{"$f":"IF(Berechnungen!$C61=\"\",\"\",Berechnungen!$C61)","v":""},null,null,null,null,null,"x"]
[null,{"$f":"IF(Berechnungen!D63=\"\",\"-\",Berechnungen!D63)","v":"Minderwert"},"Kreuze an!",{"$f":"IF(Hilfe!$C63=\"\",\"\",Hilfe!$C63)","v":""},null,{"$f":"IF(H109=\"\",\"-\",IF(H109<0,\"x\",\"\"))","v":"-"},null,{"$f":"IF(Berechnungen!$C63=\"\",\"\",Berechnungen!$C63)","v":""},null,null,null,null,null,"x"]
[null,null,null,null,null,null,null,null,null,null,null,null,null,"x"]
["Gesamtpunktezahl",null,null,{"$f":"SUM(COUNT(D10:D120),COUNTIF(D10:D120,\"x\"))","v":58},null,null,null,{"$f":"SUM(COUNT(H10:H120),COUNTIF(H10:H120,\"x\"))","v":0},null,{"$f":"Berechnungen!M65","v":0},{"$f":"IF(L122=\"\",\"\",\"│\")","v":"│"},{"$f":"Berechnungen!O65","v":22},null,"x"]
[null,null,null,null,null,null,null,null,null,null,null,null,null,{"$f":"N122","v":"x"}]
[{"$f":"Berechnungen!A1999","v":"NACHNAME Vorname"},null,null,null,null,null,null,null,null,null,null,{"$f":"\"KNr.: \"&TEXT(Berechnungen!Q1,\"00\")","v":"KNr.: 20"}]
["Note",null,{"$f":"IF(L122=0,\"\",J122/L122)","v":0}]
[null,{"$f":"C126-I130+J129","v":22},{"$f":"L122","v":22},{"$f":"IF(AND(J122>=B126-0.5,J122<=C126),\"u\",\"j\")","v":"j"},{"$f":"IF(OR(J122=B126-0.5,J122=B126),\"-\",\"\")","v":""}]
[null,{"$f":"C127-I130+J129","v":21},{"$f":"B126-1","v":21},{"$f":"IF(AND(J122>=B127-0.5,J122<=C127),\"v\",\"k\")","v":"k"},{"$f":"IF(OR(J122=B127-0.5,J122=B127),\"-\",IF(OR(J122=C127-0.5,J122=C127),\"+\",\"\"))","v":""}]
[null,{"$f":"C128-I130","v":17},{"$f":"B127-1","v":20},{"$f":"IF(AND(J122>=B128-0.5,J122<=C128),\"w\",\"l\")","v":"l"},{"$f":"IF(OR(J122=B128-0.5,J122=B128),\"-\",IF(OR(J122=C128-0.5,J122=C128),\"+\",\"\"))","v":""},null,null,null,"Abstufung 1","Abstufung 2"]
[null,{"$f":"C129-I130","v":13},{"$f":"B128-1","v":16},{"$f":"IF(AND(J122>=B129-0.5,J122<=C129),\"x\",\"m\")","v":"m"},{"$f":"IF(OR(J122=B129-0.5,J122=B129),\"-\",IF(OR(J122=C129-0.5,J122=C129),\"+\",\"\"))","v":""},null,"Abstufung:",null,0.13,3]
[null,0,{"$f":"B129-1","v":12},{"$f":"IF(L122=0,\"\",IF(AND(J122>=B130-0.5,J122<=C130),\"y\",\"n\"))","v":"y"},{"$f":"IF(OR(J122=C130-1,J122=C130-0.5,J122=C130),\"+\",\"\")","v":""},null,null,null,{"$f":"ROUND(L122*I129,0)","v":3}]
[]
[]
[null,"Schüler"]
[1,"Achenrainer Christoph"]
[2,"Auer Thomas"]
[3,"Drexel Dominik"]
[4,"Egger Christian"]
[5,"Falkner Mario"]
[6,"Föger Martin"]
[7,"Gapp Benjamin"]
[8,"Gaßler Bernhard"]
[9,"Grissemann Daniel"]
[10,"Gufler Michael"]
[11,"Haslwanter Christoph"]
[12,"Holzknecht Johannes"]
[13,"Holzknecht Raffael"]
[14,"Jenewein Mario"]
[15,"Juen Matthäus"]
[16,"Knittel Marcus"]
[17,"Knittel Pirmin"]
[18,"Köfler Andreas"]
[19,"Köhle Christian"]
[20,"Schimpfößl Johannes"]
[21]
[22,"Krug Markus"]
[23,"Kuprian Renè"]
[24,"Kuprian Sandro"]
[25,"Maaß Matthäus"]
[26,"Muigg Simon"]
[27,"Neuner Wendelin"]
[28,"Neururer Bernhard"]
[29,"Ostermann Christoph"]
[30,"Pedroß Matthias"]
[31,"Pfeifer Gregor"]
[32,"Pichler Fabian"]
[33,"Regensburger Thomas"]
[34,"Rief Christian"]
[35,"Schaffenrath Sandro"]
[36,"Scheiber Michael"]
[37,"Schöpf Florian"]
[38,"Schuster Michael"]
[39,"Weiß Patrick"]
[40,"Weistreicher Christoph"]
[41,"Zangerl Alexander"]
[42,"Zöhrer Stefan"]
[43]
[44]
[45]
[46]
[47]
[48]
[49]
[50]

{"sheet":"Hilfe","index":3,"n_rows":67,"n_cols":22,"rows_kept":67,"cut":false,"hidden":false,"merged":[[15,1,17,1],[63,14,64,18],[0,21,1,21],[2,3,2,4],[2,6,2,7],[2,9,3,9],[49,14,50,18],[55,14,56,18],[15,6,15,7],[17,8,19,9],[19,6,19,7]]}
[null,"Modell - Bewertung von Umlaufvermögen",null,null,null,null,null,null,null,null,null,null,null,null,null,null,null,null,null,null,null,"Notizen"]
[]
[null,null,null,"Bestand am 01. 01.",null,{"$f":"IF(Dateneingabe!D12=\"\",\"\",Dateneingabe!D12)","v":2024},"Bestand am 31. 12.",null,{"$f":"IF(Dateneingabe!D12=\"\",\"\",Dateneingabe!D12)","v":2024},"Mehr- Minderwert"]
[null,null,null,"Menge","€/Stück","Gesamt","Menge","€/Stück","Gesamt"]
[null,"V IEHBESTAND",null,null,null,null,null,null,null,null,null,null,{"$f":"D3&\" \"&F3","v":"Bestand am 01. 01. 2024"}]
[null,{"$f":"IF(Dateneingabe!D14=\"\",\"\",Dateneingabe!D14)","v":"RINDER"},null,null,null,null,null,null,null,null,null,null,"Gesamt1.1.  =  Menge1.1.  x  €/Stück1.1."]
[null,{"$f":"IF(Dateneingabe!C18=\"\",\"\",Dateneingabe!C18)","v":"Kühe"},null,{"$f":"IF(Dateneingabe!E18=\"\",\"\",Dateneingabe!E18)","v":9},{"$f":"IF(Dateneingabe!S18=\"\",\"\",Dateneingabe!S18)","v":1019},{"$f":"IF(OR(D7=\"\",E7=\"\"),\"\",D7*E7)","v":9171},{"$f":"IF(Dateneingabe!K18=\"\",\"\",Dateneingabe!K18)","v":10},{"$f":"IF(Dateneingabe!T18=\"\",\"\",Dateneingabe!T18)","v":1020},{"$f":"IF(OR(G7=\"\",H7=\"\"),\"\",G7*H7)","v":10200},{"$f":"IF(AND(F7=\"\",I7=\"\"),\"\",I7-F7)","v":1029},null,null,{"$f":"IF(B7=\"\",\"\",MID(M6,1,6))","v":"Gesamt"},{"$f":"IF(B7=\"\",\"\",\"1.1.(\"&B7&\")\")","v":"1.1.(Kühe)"},null,{"$f":"IF(B7=\"\",\"\",\"=  \"&FIXED(D7,0)&\"  x  \"&DOLLAR(E7,2)&\"  =  \"&DOLLAR(D7*E7,2))","v":"=  9  x  € 1 019,00  =  € 9 171,00"}]
[null,{"$f":"IF(Dateneingabe!C20=\"\",\"\",Dateneingabe!C20)","v":"Kalbinnen"},null,{"$f":"IF(Dateneingabe!E20=\"\",\"\",Dateneingabe!E20)","v":6},{"$f":"IF(Dateneingabe!S20=\"\",\"\",Dateneingabe!S20)","v":1115},6690,{"$f":"IF(Dateneingabe!K20=\"\",\"\",Dateneingabe!K20)","v":4},{"$f":"IF(Dateneingabe!T20=\"\",\"\",Dateneingabe!T20)","v":1112},4448,-2242,null,null,{"$f":"IF(B8=\"\",\"\",MID(M6,1,6))","v":"Gesamt"},"1.1.(Kalbinnen)",null,"=  6  x  € 1 115,00  =  € 6 690,00"]
[null,{"$f":"IF(Dateneingabe!C22=\"\",\"\",Dateneingabe!C22)","v":"Jungvieh 1 - 2 J."},null,{"$f":"IF(Dateneingabe!E22=\"\",\"\",Dateneingabe!E22)","v":4},{"$f":"IF(Dateneingabe!S22=\"\",\"\",Dateneingabe!S22)","v":712},2848,{"$f":"IF(Dateneingabe!K22=\"\",\"\",Dateneingabe!K22)","v":5},{"$f":"IF(Dateneingabe!T22=\"\",\"\",Dateneingabe!T22)","v":711},3555,707,null,null,{"$f":"IF(B9=\"\",\"\",MID(M6,1,6))","v":"Gesamt"},"1.1.(Jungvieh 1 - 2 J.)",null,"=  4  x  € 712,00  =  € 2 848,00"]
[null,{"$f":"IF(Dateneingabe!C24=\"\",\"\",Dateneingabe!C24)","v":"Jungvieh bis 1 J."},null,{"$f":"IF(Dateneingabe!E24=\"\",\"\",Dateneingabe!E24)","v":5},{"$f":"IF(Dateneingabe!S24=\"\",\"\",Dateneingabe!S24)","v":526},2630,{"$f":"IF(Dateneingabe!K24=\"\",\"\",Dateneingabe!K24)","v":6},{"$f":"IF(Dateneingabe!T24=\"\",\"\",Dateneingabe!T24)","v":525},3150,520,null,null,{"$f":"IF(B10=\"\",\"\",MID(M6,1,6))","v":"Gesamt"},"1.1.(Jungvieh bis 1 J.)",null,"=  5  x  € 526,00  =  € 2 630,00"]
[null,{"$f":"IF(Dateneingabe!C26=\"\",\"\",Dateneingabe!C26)","v":"Kälber weib."},null,{"$f":"IF(Dateneingabe!E26=\"\",\"\",Dateneingabe!E26)","v":4},{"$f":"IF(Dateneingabe!S26=\"\",\"\",Dateneingabe!S26)","v":295},1180,{"$f":"IF(Dateneingabe!K26=\"\",\"\",Dateneingabe!K26)","v":4},{"$f":"IF(Dateneingabe!T26=\"\",\"\",Dateneingabe!T26)","v":296},1184,4,null,null,{"$f":"IF(B11=\"\",\"\",MID(M6,1,6))","v":"Gesamt"},"1.1.(Kälber weib.)",null,"=  4  x  € 295,00  =  € 1 180,00"]
[null,{"$f":"IF(Dateneingabe!C28=\"\",\"\",Dateneingabe!C28)","v":"Kälber männ."},null,{"$f":"IF(Dateneingabe!E28=\"\",\"\",Dateneingabe!E28)","v":3},{"$f":"IF(Dateneingabe!S28=\"\",\"\",Dateneingabe!S28)","v":179},537,{"$f":"IF(Dateneingabe!K28=\"\",\"\",Dateneingabe!K28)","v":2},{"$f":"IF(Dateneingabe!T28=\"\",\"\",Dateneingabe!T28)","v":179},358,-179,null,null,{"$f":"IF(B12=\"\",\"\",MID(M6,1,6))","v":"Gesamt"},"1.1.(Kälber männ.)",null,"=  3  x  € 179,00  =  € 537,00"]
[null,{"$f":"IF(Dateneingabe!C30=\"\",\"\",Dateneingabe!C30)","v":""},null,{"$f":"IF(Dateneingabe!E30=\"\",\"\",Dateneingabe!E30)","v":""},{"$f":"IF(Dateneingabe!S30=\"\",\"\",Dateneingabe!S30)","v":""},"",{"$f":"IF(Dateneingabe!K30=\"\",\"\",Dateneingabe!K30)","v":""},{"$f":"IF(Dateneingabe!T30=\"\",\"\",Dateneingabe!T30)","v":""},"","",null,null,{"$f":"IF(B13=\"\",\"\",MID(M6,1,6))","v":""},"",null,""]
[null,{"$f":"\"Summe \"&B6","v":"Summe RINDER"},null,null,null,{"$f":"IF(SUM(F7:F13)=0,\"\",SUM(F7:F13))","v":23056},null,null,{"$f":"IF(SUM(I7:I13)=0,\"\",SUM(I7:I13))","v":22895},-161]
[]
[null,null,{"$f":"IF(J14>0,\"x\",\"\")","v":""},"Mehrwert",null,{"$f":"IF(J14>0,\"... in Höhe von:\",\"\")","v":""},{"$f":"IF(J14>0,J14,\"\")","v":""}]
[]
[null,null,{"$f":"IF(J14=0,\"x\",\"\")","v":""},"gleich geblieben",null,null,null,null,{"$f":"IF(C20<>\"\",\"ACHTUNG: Wert ohne (Minus) '-' übernehemen!\",\"\")","v":"ACHTUNG: Wert ohne (Minus) '-' übernehemen!"}]
[]
[null,null,{"$f":"IF(J14<0,\"x\",\"\")","v":"x"},"Minderwert",null,{"$f":"IF(J14<0,\"... in Höhe von:\",\"\")","v":"... in Höhe von:"},{"$f":"IF(J14<0,-J14,\"\")","v":161},null,null,null,null,null,{"$f":"G3&\" \"&I3","v":"Bestand am 31. 12. 2024"}]
[null,null,null,null,null,null,null,null,null,null,null,null,"Gesamt31.12.  =  Menge31.12.  x  €/Stück31.12."]
[null,{"$f":"IF(Dateneingabe!D32=\"\",\"\",UPPER(Dateneingabe!D32))","v":"SCHWEINE"},null,null,null,null,null,null,null,null,null,null,{"$f":"IF($B$7=\"\",\"\",MID(M21,1,6))","v":"Gesamt"},{"$f":"IF($B$7=\"\",\"\",\"31.12.(\"&$B$7&\")\")","v":"31.12.(Kühe)"},null,{"$f":"IF($B$7=\"\",\"\",\"=  \"&FIXED(G7,0)&\"  x  \"&DOLLAR(H7,2)&\"  =  \"&DOLLAR(G7*H7,2))","v":"=  10  x  € 1 020,00  =  € 10 200,00"}]
[null,{"$f":"IF(Dateneingabe!C36=\"\",\"\",Dateneingabe!C36)","v":"Mastsauen"},null,{"$f":"IF(Dateneingabe!E36=\"\",\"\",Dateneingabe!E36)","v":2},{"$f":"IF(Dateneingabe!S36=\"\",\"\",Dateneingabe!S36)","v":148.63},{"$f":"IF(OR(D23=\"\",E23=\"\"),\"\",D23*E23)","v":297.26},{"$f":"IF(Dateneingabe!K36=\"\",\"\",Dateneingabe!K36)","v":7},{"$f":"IF(Dateneingabe!T36=\"\",\"\",Dateneingabe!T36)","v":149},{"$f":"IF(OR(G23=\"\",H23=\"\"),\"\",G23*H23)","v":1043},{"$f":"IF(AND(F23=\"\",I23=\"\"),\"\",I23-F23)","v":745.74},null,null,{"$f":"IF($B$8=\"\",\"\",MID(M21,1,6))","v":"Gesamt"},{"$f":"IF($B$8=\"\",\"\",\"31.12.(\"&$B$8&\")\")","v":"31.12.(Kalbinnen)"},null,{"$f":"IF($B$8=\"\",\"\",\"=  \"&FIXED(G8,0)&\"  x  \"&DOLLAR(H8,2)&\"  =  \"&DOLLAR(G8*H8,2))","v":"=  4  x  € 1 112,00  =  € 4 448,00"}]
[null,{"$f":"IF(Dateneingabe!C38=\"\",\"\",Dateneingabe!C38)","v":"Ferkel"},null,{"$f":"IF(Dateneingabe!E38=\"\",\"\",Dateneingabe!E38)","v":2},{"$f":"IF(Dateneingabe!S38=\"\",\"\",Dateneingabe!S38)","v":55.18},{"$f":"IF(OR(D24=\"\",E24=\"\"),\"\",D24*E24)","v":110.36},{"$f":"IF(Dateneingabe!K38=\"\",\"\",Dateneingabe!K38)","v":4},{"$f":"IF(Dateneingabe!T38=\"\",\"\",Dateneingabe!T38)","v":55},{"$f":"IF(OR(G24=\"\",H24=\"\"),\"\",G24*H24)","v":220},{"$f":"IF(AND(F24=\"\",I24=\"\"),\"\",I24-F24)","v":109.64},null,null,{"$f":"IF($B$9=\"\",\"\",MID(M21,1,6))","v":"Gesamt"},{"$f":"IF($B$9=\"\",\"\",\"31.12.(\"&$B$9&\")\")","v":"31.12.(Jungvieh 1 - 2 J.)"},null,{"$f":"IF($B$9=\"\",\"\",\"=  \"&FIXED(G9,0)&\"  x  \"&DOLLAR(H9,2)&\"  =  \"&DOLLAR(G9*H9,2))","v":"=  5  x  € 711,00  =  € 3 555,00"}]
[null,{"$f":"IF(Dateneingabe!C40=\"\",\"\",Dateneingabe!C40)","v":""},null,{"$f":"IF(Dateneingabe!E40=\"\",\"\",Dateneingabe!E40)","v":""},{"$f":"IF(Dateneingabe!S40=\"\",\"\",Dateneingabe!S40)","v":""},{"$f":"IF(OR(D25=\"\",E25=\"\"),\"\",D25*E25)","v":""},{"$f":"IF(Dateneingabe!K40=\"\",\"\",Dateneingabe!K40)","v":""},{"$f":"IF(Dateneingabe!T40=\"\",\"\",Dateneingabe!T40)","v":""},{"$f":"IF(OR(G25=\"\",H25=\"\"),\"\",G25*H25)","v":""},{"$f":"IF(AND(F25=\"\",I25=\"\"),\"\",I25-F25)","v":""},null,null,{"$f":"IF($B$10=\"\",\"\",MID(M21,1,6))","v":"Gesamt"},{"$f":"IF($B$10=\"\",\"\",\"31.12.(\"&$B$10&\")\")","v":"31.12.(Jungvieh bis 1 J.)"},null,{"$f":"IF($B$10=\"\",\"\",\"=  \"&FIXED(G10,0)&\"  x  \"&DOLLAR(H10,2)&\"  =  \"&DOLLAR(G10*H10,2))","v":"=  6  x  € 525,00  =  € 3 150,00"}]
[null,{"$f":"IF(Dateneingabe!C42=\"\",\"\",Dateneingabe!C42)","v":""},null,{"$f":"IF(Dateneingabe!E42=\"\",\"\",Dateneingabe!E42)","v":""},{"$f":"IF(Dateneingabe!S42=\"\",\"\",Dateneingabe!S42)","v":""},{"$f":"IF(OR(D26=\"\",E26=\"\"),\"\",D26*E26)","v":""},{"$f":"IF(Dateneingabe!K42=\"\",\"\",Dateneingabe!K42)","v":""},{"$f":"IF(Dateneingabe!T42=\"\",\"\",Dateneingabe!T42)","v":""},{"$f":"IF(OR(G26=\"\",H26=\"\"),\"\",G26*H26)","v":""},{"$f":"IF(AND(F26=\"\",I26=\"\"),\"\",I26-F26)","v":""},null,null,{"$f":"IF($B$11=\"\",\"\",MID(M21,1,6))","v":"Gesamt"},{"$f":"IF($B$11=\"\",\"\",\"31.12.(\"&$B$11&\")\")","v":"31.12.(Kälber weib.)"},null,{"$f":"IF($B$11=\"\",\"\",\"=  \"&FIXED(G11,0)&\"  x  \"&DOLLAR(H11,2)&\"  =  \"&DOLLAR(G11*H11,2))","v":"=  4  x  € 296,00  =  € 1 184,00"}]
[null,{"$f":"IF(Dateneingabe!C44=\"\",\"\",Dateneingabe!C44)","v":""},null,{"$f":"IF(Dateneingabe!E44=\"\",\"\",Dateneingabe!E44)","v":""},{"$f":"IF(Dateneingabe!S44=\"\",\"\",Dateneingabe!S44)","v":""},{"$f":"IF(OR(D27=\"\",E27=\"\"),\"\",D27*E27)","v":""},{"$f":"IF(Dateneingabe!K44=\"\",\"\",Dateneingabe!K44)","v":""},{"$f":"IF(Dateneingabe!T44=\"\",\"\",Dateneingabe!T44)","v":""},{"$f":"IF(OR(G27=\"\",H27=\"\"),\"\",G27*H27)","v":""},{"$f":"IF(AND(F27=\"\",I27=\"\"),\"\",I27-F27)","v":""},null,null,{"$f":"IF($B$12=\"\",\"\",MID(M21,1,6))","v":"Gesamt"},{"$f":"IF($B$12=\"\",\"\",\"31.12.(\"&$B$12&\")\")","v":"31.12.(Kälber männ.)"},null,{"$f":"IF($B$12=\"\",\"\",\"=  \"&FIXED(G12,0)&\"  x  \"&DOLLAR(H12,2)&\"  =  \"&DOLLAR(G12*H12,2))","v":"=  2  x  € 179,00  =  € 358,00"}]
[null,{"$f":"\"Summe \"&B22","v":"Summe SCHWEINE"},null,null,null,{"$f":"IF(SUM(F23:F27)=0,\"\",SUM(F23:F27))","v":407.62},null,null,{"$f":"IF(SUM(I23:I27)=0,\"\",SUM(I23:I27))","v":1263},{"$f":"IF(SUM(J23:J27)=0,\"\",SUM(J23:J27))","v":855.38},null,null,{"$f":"IF($B$13=\"\",\"\",MID(M21,1,6))","v":""},{"$f":"IF($B$13=\"\",\"\",\"31.12.(\"&$B$13&\")\")","v":""},null,{"$f":"IF($B$13=\"\",\"\",\"=  \"&FIXED(G13,0)&\"  x  \"&DOLLAR(H13,2)&\"  =  \"&DOLLAR(G13*H13,2))","v":""}]
[]
[null,null,{"$f":"IF(J28>0,\"x\",\"\")","v":"x"},"Mehrwert",null,"Kreuze zutreffendes an! (ACHTUNG: Nur eine Antwort ist richtig!!)"]
[]
[null,null,{"$f":"IF(J28=0,\"x\",\"\")","v":""},"gleich geblieben"]
[]
[null,null,{"$f":"IF(J28<0,\"x\",\"\")","v":""},"Minderwert",null,null,null,null,null,null,null,null,{"$f":"MID(J3,1,5)&\"/\"&MID(J3,7,10)&\" - MW(+/-)\"","v":"Mehr-/Minderwert - MW(+/-)"}]
[null,null,null,null,null,null,null,null,null,null,null,null,"MW(+/-)  =  Gesamt31.12.  -  Gesamt1.1."]
[null,"VORRÄTE",null,null,null,null,null,null,null,null,null,null,{"$f":"IF($B$7=\"\",\"\",MID(M35,1,7))","v":"MW(+/-)"},{"$f":"IF($B$7=\"\",\"\",\"1.1. (\"&$B$7&\")\")","v":"1.1. (Kühe)"},null,{"$f":"IF(B7=\"\",\"\",\"=  \"&DOLLAR(I7,2)&\"  -  \"&DOLLAR(F7,2)&\"  =  \"&DOLLAR(I7-F7))","v":"=  € 10 200,00  -  € 9 171,00  =  € 1 029,00"}]
[null,"Selbst erzeugte Vorräte",null,null,null,null,null,null,null,null,null,null,{"$f":"IF($B$8=\"\",\"\",MID(M35,1,7))","v":"MW(+/-)"},{"$f":"IF($B$8=\"\",\"\",\"1.1. (\"&$B$8&\")\")","v":"1.1. (Kalbinnen)"},null,"=  € 4 448,00  -  € 6 690,00  =  -€ 2 242,00"]
[null,{"$f":"IF(Dateneingabe!C50=\"\",\"\",Dateneingabe!C50)","v":"Gerste"},null,{"$f":"IF(Dateneingabe!E50=\"\",\"\",Dateneingabe!E50)","v":100},{"$f":"IF(Dateneingabe!S50=\"\",\"\",Dateneingabe!S50)","v":0.12},{"$f":"IF(OR(D38=\"\",E38=\"\"),\"\",D38*E38)","v":12},{"$f":"IF(Dateneingabe!K50=\"\",\"\",Dateneingabe!K50)","v":800},{"$f":"IF(Dateneingabe!T50=\"\",\"\",Dateneingabe!T50)","v":0.13},{"$f":"IF(OR(G38=\"\",H38=\"\"),\"\",G38*H38)","v":104},{"$f":"IF(AND(F38=\"\",I38=\"\"),\"\",I38-F38)","v":92},null,null,{"$f":"IF($B$9=\"\",\"\",MID(M35,1,7))","v":"MW(+/-)"},{"$f":"IF($B$9=\"\",\"\",\"1.1. (\"&$B$9&\")\")","v":"1.1. (Jungvieh 1 - 2 J.)"},null,"=  € 3 555,00  -  € 2 848,00  =  € 707,00"]
[null,{"$f":"IF(Dateneingabe!C52=\"\",\"\",Dateneingabe!C52)","v":"Futterkartoffeln"},null,{"$f":"IF(Dateneingabe!E52=\"\",\"\",Dateneingabe!E52)","v":1350},{"$f":"IF(Dateneingabe!S52=\"\",\"\",Dateneingabe!S52)","v":7.0000000000000007E-2},{"$f":"IF(OR(D39=\"\",E39=\"\"),\"\",D39*E39)","v":94.500000000000014},{"$f":"IF(Dateneingabe!K52=\"\",\"\",Dateneingabe!K52)","v":1500},{"$f":"IF(Dateneingabe!T52=\"\",\"\",Dateneingabe!T52)","v":0.06},{"$f":"IF(OR(G39=\"\",H39=\"\"),\"\",G39*H39)","v":90},{"$f":"IF(AND(F39=\"\",I39=\"\"),\"\",I39-F39)","v":-4.5000000000000142},null,null,{"$f":"IF($B$10=\"\",\"\",MID(M35,1,7))","v":"MW(+/-)"},{"$f":"IF($B$10=\"\",\"\",\"1.1. (\"&$B$10&\")\")","v":"1.1. (Jungvieh bis 1 J.)"},null,"=  € 3 150,00  -  € 2 630,00  =  € 520,00"]
[null,{"$f":"IF(Dateneingabe!C54=\"\",\"\",Dateneingabe!C54)","v":"Brennholz"},null,{"$f":"IF(Dateneingabe!E54=\"\",\"\",Dateneingabe!E54)","v":30},{"$f":"IF(Dateneingabe!S54=\"\",\"\",Dateneingabe!S54)","v":24.48},{"$f":"IF(OR(D40=\"\",E40=\"\"),\"\",D40*E40)","v":734.4},{"$f":"IF(Dateneingabe!K54=\"\",\"\",Dateneingabe!K54)","v":4},{"$f":"IF(Dateneingabe!T54=\"\",\"\",Dateneingabe!T54)","v":26.44},{"$f":"IF(OR(G40=\"\",H40=\"\"),\"\",G40*H40)","v":105.76},{"$f":"IF(AND(F40=\"\",I40=\"\"),\"\",I40-F40)","v":-628.64},null,null,{"$f":"IF($B$11=\"\",\"\",MID(M35,1,7))","v":"MW(+/-)"},{"$f":"IF($B$11=\"\",\"\",\"1.1. (\"&$B$11&\")\")","v":"1.1. (Kälber weib.)"},null,"=  € 1 184,00  -  € 1 180,00  =  € 4,00"]
[null,{"$f":"IF(Dateneingabe!C56=\"\",\"\",Dateneingabe!C56)","v":""},null,{"$f":"IF(Dateneingabe!E56=\"\",\"\",Dateneingabe!E56)","v":""},{"$f":"IF(Dateneingabe!S56=\"\",\"\",Dateneingabe!S56)","v":""},{"$f":"IF(OR(D41=\"\",E41=\"\"),\"\",D41*E41)","v":""},{"$f":"IF(Dateneingabe!K56=\"\",\"\",Dateneingabe!K56)","v":""},{"$f":"IF(Dateneingabe!T56=\"\",\"\",Dateneingabe!T56)","v":""},{"$f":"IF(OR(G41=\"\",H41=\"\"),\"\",G41*H41)","v":""},{"$f":"IF(AND(F41=\"\",I41=\"\"),\"\",I41-F41)","v":""},null,null,{"$f":"IF($B$12=\"\",\"\",MID(M35,1,7))","v":"MW(+/-)"},{"$f":"IF($B$12=\"\",\"\",\"1.1. (\"&$B$12&\")\")","v":"1.1. (Kälber männ.)"},null,"=  € 358,00  -  € 537,00  =  -€ 179,00"]
[null,{"$f":"IF(Dateneingabe!C58=\"\",\"\",Dateneingabe!C58)","v":""},null,{"$f":"IF(Dateneingabe!E58=\"\",\"\",Dateneingabe!E58)","v":""},{"$f":"IF(Dateneingabe!S58=\"\",\"\",Dateneingabe!S58)","v":""},{"$f":"IF(OR(D42=\"\",E42=\"\"),\"\",D42*E42)","v":""},{"$f":"IF(Dateneingabe!K58=\"\",\"\",Dateneingabe!K58)","v":""},{"$f":"IF(Dateneingabe!T58=\"\",\"\",Dateneingabe!T58)","v":""},{"$f":"IF(OR(G42=\"\",H42=\"\"),\"\",G42*H42)","v":""},{"$f":"IF(AND(F42=\"\",I42=\"\"),\"\",I42-F42)","v":""},null,null,{"$f":"IF($B$13=\"\",\"\",MID(M35,1,7))","v":""},{"$f":"IF($B$13=\"\",\"\",\"1.1. (\"&$B$13&\")\")","v":""},null,""]
[null,"Summe selbst erzeugte Vorräte",null,null,null,{"$f":"IF(SUM(F38:F42)=0,\"\",SUM(F38:F42))","v":840.9},null,null,{"$f":"IF(SUM(I38:I42)=0,\"\",SUM(I38:I42))","v":299.76},{"$f":"IF(SUM(J38:J42)=0,\"\",SUM(J38:J42))","v":-541.14}]
[]
[null,null,{"$f":"IF(J43>0,\"x\",\"\")","v":""},"Mehrwert",null,"Kreuze zutreffendes an! (ACHTUNG: Nur eine Antwort ist richtig!!)"]
[]
[null,null,{"$f":"IF(J43=0,\"x\",\"\")","v":""},"gleich geblieben"]
[]
[null,null,{"$f":"IF(J43<0,\"x\",\"\")","v":"x"},"Minderwert",null,null,null,null,null,null,null,null,{"$f":"MID($B$14,1,5)&MID(D$3,8,10)&\" \"&F$3","v":"Summe am 01. 01 2024"}]
[null,null,null,null,null,null,null,null,null,null,null,null,"Summe1.1.=",null,{"$f":"IF(B7=\"\",\"\",B7)&IF(B8=\"\",\"\",\"  +  \"&B8)&IF(B9=\"\",\"\",\"  +  \"&B9)&IF(B10=\"\",\"\",\"  +  \"&B10)&IF(B11=\"\",\"\",\"  +  \"&B11)&IF(B12=\"\",\"\",\"  +  \"&B12)&IF(B13=\"\",\"\",\"  +  \"&B13)","v":"Kühe  +  Kalbinnen  +  Jungvieh 1 - 2 J.  +  Jungvieh bis 1 J.  +  Kälber weib.  +  Kälber männ."}]
[null,"Zugekaufte Vorräte"]
[null,{"$f":"IF(Dateneingabe!C64=\"\",\"\",Dateneingabe!C64)","v":"Milchkraftfutter"},null,{"$f":"IF(Dateneingabe!E64=\"\",\"\",Dateneingabe!E64)","v":650},{"$f":"IF(Dateneingabe!S64=\"\",\"\",Dateneingabe!S64)","v":0.22},{"$f":"IF(OR(D52=\"\",E52=\"\"),\"\",D52*E52)","v":143},{"$f":"IF(Dateneingabe!K64=\"\",\"\",Dateneingabe!K64)","v":1500},{"$f":"IF(Dateneingabe!T64=\"\",\"\",Dateneingabe!T64)","v":0.23},{"$f":"IF(OR(G52=\"\",H52=\"\"),\"\",G52*H52)","v":345},{"$f":"IF(AND(F52=\"\",I52=\"\"),\"\",I52-F52)","v":202},null,null,{"$f":"IF(B7=\"\",\"\",MID(M50,1,5))","v":"Summe"},{"$f":"IF(B7=\"\",\"\",\"1.1.\")","v":"1.1."},{"$f":" \"=  \"&IF(F7=\"\",\"\",DOLLAR(F7,2))&IF(F8=\"\",\"\",\"  +  \"&DOLLAR(F8,2))&IF(F9=\"\",\"\",\"  +  \"&DOLLAR(F9,2))&IF(F10=\"\",\"\",\"  +  \"&DOLLAR(F10,2))&IF(F11=\"\",\"\",\"  +  \"&DOLLAR(F11,2))&IF(F12=\"\",\"\",\"  +  \"&DOLLAR(F12,2))&IF(F13=\"\",\"\",\"  +  \"&DOLLAR(F13,2))","v":"=  € 9 171,00  +  € 6 690,00  +  € 2 848,00  +  € 2 630,00  +  € 1 180,00  +  € 537,00"}]
[null,{"$f":"IF(Dateneingabe!C66=\"\",\"\",Dateneingabe!C66)","v":"Weizenschrot"},null,{"$f":"IF(Dateneingabe!E66=\"\",\"\",Dateneingabe!E66)","v":350},{"$f":"IF(Dateneingabe!S66=\"\",\"\",Dateneingabe!S66)","v":0.2},{"$f":"IF(OR(D53=\"\",E53=\"\"),\"\",D53*E53)","v":70},{"$f":"IF(Dateneingabe!K66=\"\",\"\",Dateneingabe!K66)","v":500},{"$f":"IF(Dateneingabe!T66=\"\",\"\",Dateneingabe!T66)","v":0.19},{"$f":"IF(OR(G53=\"\",H53=\"\"),\"\",G53*H53)","v":95},{"$f":"IF(AND(F53=\"\",I53=\"\"),\"\",I53-F53)","v":25},null,null,null,null,{"$f":"\"=  \"&DOLLAR(SUM(F7:F13),2)","v":"=  € 23 056,00"}]
[null,{"$f":"IF(Dateneingabe!C68=\"\",\"\",Dateneingabe!C68)","v":"Erbsenschrot"},null,{"$f":"IF(Dateneingabe!E68=\"\",\"\",Dateneingabe!E68)","v":75},{"$f":"IF(Dateneingabe!S68=\"\",\"\",Dateneingabe!S68)","v":0.2},{"$f":"IF(OR(D54=\"\",E54=\"\"),\"\",D54*E54)","v":15},{"$f":"IF(Dateneingabe!K68=\"\",\"\",Dateneingabe!K68)","v":300},{"$f":"IF(Dateneingabe!T68=\"\",\"\",Dateneingabe!T68)","v":0.2},{"$f":"IF(OR(G54=\"\",H54=\"\"),\"\",G54*H54)","v":60},{"$f":"IF(AND(F54=\"\",I54=\"\"),\"\",I54-F54)","v":45}]
[null,{"$f":"IF(Dateneingabe!C70=\"\",\"\",Dateneingabe!C70)","v":""},null,{"$f":"IF(Dateneingabe!E70=\"\",\"\",Dateneingabe!E70)","v":""},{"$f":"IF(Dateneingabe!S70=\"\",\"\",Dateneingabe!S70)","v":""},{"$f":"IF(OR(D55=\"\",E55=\"\"),\"\",D55*E55)","v":""},{"$f":"IF(Dateneingabe!K70=\"\",\"\",Dateneingabe!K70)","v":""},{"$f":"IF(Dateneingabe!T70=\"\",\"\",Dateneingabe!T70)","v":""},{"$f":"IF(OR(G55=\"\",H55=\"\"),\"\",G55*H55)","v":""},{"$f":"IF(AND(F55=\"\",I55=\"\"),\"\",I55-F55)","v":""},null,null,{"$f":"MID($B$14,1,5)&MID(G$3,8,10)&\" \"&I$3","v":"Summe am 31. 12 2024"}]
[null,{"$f":"IF(Dateneingabe!C72=\"\",\"\",Dateneingabe!C72)","v":""},null,{"$f":"IF(Dateneingabe!E72=\"\",\"\",Dateneingabe!E72)","v":""},{"$f":"IF(Dateneingabe!S72=\"\",\"\",Dateneingabe!S72)","v":""},{"$f":"IF(OR(D56=\"\",E56=\"\"),\"\",D56*E56)","v":""},{"$f":"IF(Dateneingabe!K72=\"\",\"\",Dateneingabe!K72)","v":""},{"$f":"IF(Dateneingabe!T72=\"\",\"\",Dateneingabe!T72)","v":""},{"$f":"IF(OR(G56=\"\",H56=\"\"),\"\",G56*H56)","v":""},{"$f":"IF(AND(F56=\"\",I56=\"\"),\"\",I56-F56)","v":""},null,null,"Summe31.12.=",null,{"$f":"IF(B7=\"\",\"\",B7)&IF(B8=\"\",\"\",\"  +  \"&B8)&IF(B9=\"\",\"\",\"  +  \"&B9)&IF(B10=\"\",\"\",\"  +  \"&B10)&IF(B11=\"\",\"\",\"  +  \"&B11)&IF(B12=\"\",\"\",\"  +  \"&B12)&IF(B13=\"\",\"\",\"  +  \"&B13)","v":"Kühe  +  Kalbinnen  +  Jungvieh 1 - 2 J.  +  Jungvieh bis 1 J.  +  Kälber weib.  +  Kälber männ."}]
[null,"Summe zugekaufte Vorräte",null,null,null,{"$f":"IF(SUM(F52:F56)=0,\"\",SUM(F52:F56))","v":228},null,null,{"$f":"IF(SUM(I52:I56)=0,\"\",SUM(I52:I56))","v":500},{"$f":"IF(SUM(J52:J56)=0,\"\",SUM(J52:J56))","v":272}]
[null,null,null,null,null,null,null,null,null,null,null,null,{"$f":"IF(B7=\"\",\"\",MID(M56,1,5))","v":"Summe"},{"$f":"IF(B7=\"\",\"\",\"31.12.\")","v":"31.12."},{"$f":" \"=  \"&IF(I7=\"\",\"\",DOLLAR(I7,2))&IF(I8=\"\",\"\",\"  +  \"&DOLLAR(I8,2))&IF(I9=\"\",\"\",\"  +  \"&DOLLAR(I9,2))&IF(I10=\"\",\"\",\"  +  \"&DOLLAR(I10,2))&IF(I11=\"\",\"\",\"  +  \"&DOLLAR(I11,2))&IF(I12=\"\",\"\",\"  +  \"&DOLLAR(I12,2))&IF(I13=\"\",\"\",\"  +  \"&DOLLAR(I13,2))","v":"=  € 10 200,00  +  € 4 448,00  +  € 3 555,00  +  € 3 150,00  +  € 1 184,00  +  € 358,00"}]
[null,null,{"$f":"IF(J57>0,\"x\",\"\")","v":"x"},"Mehrwert",null,"Kreuze zutreffendes an! (ACHTUNG: Nur eine Antwort ist richtig!!)",null,null,null,null,null,null,null,null,{"$f":"\"=  \"&DOLLAR(SUM(I7:I13),2)","v":"=  € 22 895,00"}]
[]
[null,null,{"$f":"IF(J57=0,\"x\",\"\")","v":""},"gleich geblieben"]
[]
[null,null,{"$f":"IF(J57<0,\"x\",\"\")","v":""},"Minderwert",null,null,null,null,null,null,null,null,{"$f":"MID($B$14,1,6)&\"Mehr-/Minderwert (MW)\"","v":"Summe Mehr-/Minderwert (MW)"}]
[null,null,null,null,null,null,null,null,null,null,null,null,"SummeMW=",null,{"$f":"IF(B7=\"\",\"\",B7)&IF(B8=\"\",\"\",\"  +  \"&B8)&IF(B9=\"\",\"\",\"  +  \"&B9)&IF(B10=\"\",\"\",\"  +  \"&B10)&IF(B11=\"\",\"\",\"  +  \"&B11)&IF(B12=\"\",\"\",\"  +  \"&B12)&IF(B13=\"\",\"\",\"  +  \"&B13)","v":"Kühe  +  Kalbinnen  +  Jungvieh 1 - 2 J.  +  Jungvieh bis 1 J.  +  Kälber weib.  +  Kälber männ."}]
[]
[null,null,null,null,null,null,null,null,null,null,null,null,{"$f":"IF(B7=\"\",\"\",MID(M64,1,5))","v":"Summe"},"MW",{"$f":"\"=  \"&IF(J7=\"\",\"\",DOLLAR(J7,2))&IF(J8=\"\",\"\",\"  \"&IF(J8<0,\"-\",\"+\")&\"  \"&DOLLAR(IF(J8<0,-J8,J8),2))&IF(J9=\"\",\"\",\"  \"&IF(J9<0,\"-\",\"+\")&\"  \"&DOLLAR(IF(J9<0,-J9,J9),2))&IF(J10=\"\",\"\",\"  \"&IF(J10<0,\"-\",\"+\")&\"  \"&DOLLAR(IF(J10<0,-J10,J10),2))&IF(J11=\"\",\"\",\"  \"&IF(J11<0,\"-\",\"+\")&\"  \"&DOLLAR(IF(J11<0,-J11,J11),2))&IF(J12=\"\",\"\",\"  \"&IF(J12<0,\"-\",\"+\")&\"  \"&DOLLAR(IF(J12<0,-J12,J12),2))&IF(J13=\"\",\"\",\"  \"&IF(J13<0,\"-\",\"+\")&\"  \"&DOLLAR(IF(J13<0,-J13,J13),2))","v":"=  € 1 029,00  -  € 2 242,00  +  € 707,00  +  € 520,00  +  € 4,00  -  € 179,00"}]
[null,null,null,null,null,null,null,null,null,null,null,null,null,null,{"$f":"\"=  \"&DOLLAR(SUM(J7:J13),2)&\"   →   \"&IF(SUM(J7:J13)<0,\"Minderwert!\",IF(SUM(J7:J13)=0,\"Bestand ist gleich geblieben!\",\"Mehrwert!\"))","v":"=  -€ 161,00   →   Minderwert!"}]

{"sheet":"Bewertung","index":4,"n_rows":76,"n_cols":29,"rows_kept":76,"cut":false,"hidden":true,"merged":[[0,0,0,27],[14,0,14,6],[72,0,72,6]]}
["Bewertung: Bewertung von Umlaufvermögen",null,null,null,null,null,null,null,null,null,null,null,null,null,null,null,null,null,null,null,null,null,null,null,null,null,null,null,1]
[{"$f":"IF(K3<>A3,\"???\",\"\")","v":""},null,null,null,null,null,{"$f":"IF(AB3<>G3,\"???\",\"\")","v":""},null,null,null,{"$f":"IF(K3<>A3,\"???\",\"\")","v":""},null,null,null,null,null,null,null,null,null,null,null,null,null,null,null,null,{"$f":"IF(AB3<>G3,\"???\",\"\")","v":""}]
["NACHNAME Vorname",null,null,null,null,null,"Gruppe: 01",null,null,null,"NACHNAME Vorname",null,null,null,null,null,null,null,null,null,null,null,null,null,null,null,null,"Gruppe: 01"]
[{"$f":"\"Liebe(r) \"&MID(A3,FIND(\" \",A3,1)+1,100)&\"!\"","v":"Liebe(r) Vorname!"},null,null,null,null,null,null,null,null,null,"Notenliste: ",null,null,null,null,0.1]
[null,null,null,null,null,null,null,null,null,null,"Spaltenindeces: ",null,null,null,null,{"$f":"IF(TYPE(IF(SPI_mPKTE=\"\",\"-\",SPI_mPKTE))=16,\"-\",IF(SPI_mPKTE=\"\",\"-\",SPI_mPKTE))","v":"-"},"/",{"$f":"IF(TYPE(IF(SPI_gPKTE=\"\",\"-\",SPI_gPKTE))=16,\"-\",IF(SPI_gPKTE=\"\",\"-\",SPI_gPKTE))","v":"-"},{"$f":"IF(TYPE(IF(SPI_KOMP=\"\",\"-\",SPI_KOMP))=16,\"-\",IF(SPI_KOMP=\"\",\"-\",SPI_KOMP))","v":"-"}]
["Du hast die abgefragten Kompetenzen wiefolgt erfüllt:",null,null,null,null,null,null,null,null,null,"Genügend bei:",null,null,null,null,{"$f":"O21/M18","v":0.54545454545454541},null,null,null,null,null,null,null,"Punkte nach Kompetenzen"]
[{"$f":"IF(X7=\"\",\"\",X7&\": \"&Z7&AA7&AB7&IF(AND(Z7>=AB7*50%,Z7<AB7*75%),\"   →   überwiegend erfüllt!\",IF(Z7>=AB7*75%,\"   →   vollständig erfülltt!\",\"   →   nicht erfüllt!\")))","v":"GK17: 0/22   →   nicht erfüllt!"},null,null,null,null,null,null,null,null,null,"Nicht erfüllte Grundkompetenzen:",null,null,null,null,{"$f":"SUM(IF(Z7<AB7*50%,1,0),IF(Z8<AB8*50%,1,0),IF(Z9<AB9*50%,1,0))","v":1},null,null,null,null,null,null,null,"GK17",null,{"$f":"SUMIFS(Z$30:Z$69,$X$30:$X$69,$X7)","v":0},"/",{"$f":"SUMIFS(AB$30:AB$69,$X$30:$X$69,$X7)","v":22}]
[{"$f":"IF(X8=\"\",\"\",X8&\": \"&Z8&AA8&AB8&IF(AND(Z8>=AB8*50%,Z8<AB8*75%),\"   →   überwiegend erfüllt!\",IF(Z8>=AB8*75%,\"   →   vollständig erfülltt!\",\"   →   nicht erfüllt!\")))","v":"GK: 0/0   →   vollständig erfülltt!"},null,null,null,null,null,null,null,null,null,null,null,null,null,null,null,null,null,null,null,null,null,null,{"$f":"IF(TYPE(MID(GK..,FIND(\"(\",GK..,1)+1,(FIND(\")\",GK..,1)-FIND(\"(\",GK..,1)-1)))=16,\"GK\",MID(GK..,FIND(\"(\",GK..,1)+1,(FIND(\")\",GK..,1)-FIND(\"(\",GK..,1)-1)))","v":"GK"},null,0,"/",0]
["GK: 0/0   →   vollständig erfülltt!",null,null,null,null,null,null,null,null,null,null,null,null,null,null,null,null,null,null,null,null,null,null,{"$f":"IF(TYPE(MID(GK.,FIND(\"(\",GK.,1)+1,(FIND(\")\",GK.,1)-FIND(\"(\",GK.,1)-1)))=16,\"GK\",MID(GK.,FIND(\"(\",GK.,1)+1,(FIND(\")\",GK.,1)-FIND(\"(\",GK.,1)-1)))","v":"GK"},null,0,"/",0]
["EK: 0/0   →   vollständig erfülltt!",null,null,null,null,null,null,null,null,null,null,null,null,null,null,null,null,null,null,null,null,null,null,{"$f":"IF(TYPE(MID(EK,FIND(\"(\",EK,1)+1,(FIND(\")\",EK,1)-FIND(\"(\",EK,1)-1)))=16,\"EK\",MID(EK,FIND(\"(\",EK,1)+1,(FIND(\")\",EK,1)-FIND(\"(\",EK,1)-1)))","v":"EK"},null,0,"/",0]
["EK: 0/0   →   vollständig erfülltt!",null,null,null,null,null,null,null,null,null,null,null,null,null,null,null,null,null,null,null,null,null,null,{"$f":"IF(TYPE(MID(EK.,FIND(\"(\",EK.,1)+1,(FIND(\")\",EK.,1)-FIND(\"(\",EK.,1)-1)))=16,\"EK\",MID(EK.,FIND(\"(\",EK.,1)+1,(FIND(\")\",EK.,1)-FIND(\"(\",EK.,1)-1)))","v":"EK"},null,0,"/",0]
["EK: 0/0   →   vollständig erfülltt!",null,null,null,null,null,null,null,null,null,null,null,null,null,null,null,null,null,null,null,null,null,null,{"$f":"IF(TYPE(MID(EK..,FIND(\"(\",EK..,1)+1,(FIND(\")\",EK..,1)-FIND(\"(\",EK..,1)-1)))=16,\"EK\",MID(EK..,FIND(\"(\",EK..,1)+1,(FIND(\")\",EK..,1)-FIND(\"(\",EK..,1)-1)))","v":"EK"},null,0,"/",0]
[null,null,null,null,null,null,null,null,null,null,null,null,null,null,null,null,null,null,null,null,null,null,null,"Summe",null,{"$f":"SUM(Z7:Z12)","v":0},"/",{"$f":"SUM(AB7:AB12)","v":22}]
[{"$f":"\"Daraus würde sich für diese Aufgabe ein \"&IF(N25=1,UPPER(\"„Sehr gut”\"),IF(N25=2,UPPER(\"„Gut”\"),IF(N25=3,UPPER(\"„Befriedigend”\"),IF(N25=4,UPPER(\"„Genügend”\"),IF(N25=5,UPPER(\"„Nicht genügend”\"),\"---\")))))&\" ergeben.\"","v":"Daraus würde sich für diese Aufgabe ein „NICHT GENÜGEND” ergeben."},null,null,null,null,null,null,null,null,null,"Notenschlüssel:"]
[{"$f":"IF(N25=1,\"Das hast du ganz toll gemacht!!!   😀\",IF(N25=2,\"Das ist eine gute Arbeit geworden!!   🙂\",IF(N25=3,\"Das passt schon so!   😐\",IF(N25=4,\"Das geht noch besser!   🙁\",\"Das ist leider zu wenig!   ☹️   Schau dir deine Ergebnisse bitte noch einmal an und versuch' es beim nächsten Mal besser zu machen!!!\"))))","v":"Das ist leider zu wenig!   ☹️   Schau dir deine Ergebnisse bitte noch einmal an und versuch' es beim nächsten Mal besser zu machen!!!"},null,null,null,null,null,null,null,null,null,"❶",{"$f":"IF(O18=M18,M18&\" P\",O18&\" - \"&M18&\" P\")","v":"21 - 22 P"},"❷",{"$f":"IF(O19=M19,M19&\" P\",O19&\" - \"&M19&\" P\")","v":"18 - 20 P"},"❸",{"$f":"O20&\" - \"&M20&\" P\"","v":"15 - 17 P"},"❹",{"$f":"O21&\" - \"&M21&\" P\"","v":"12 - 14 P"},"❺",{"$f":"O22&\" - \"&M22&\" P\"","v":"0 - 11 P"}]
[]
["LG",null,null,null,null,null,null,null,null,null,null,null,null,null,null,null,null,"Differenz",null,"Abstufung"]
["FL Harasleben",null,null,null,null,null,null,null,null,null,null,"❶",{"$f":"AB13","v":22},"-",{"$f":"M19+1","v":21},null,null,{"$f":"M18-O18","v":1},null,1]
[null,null,null,null,null,null,null,null,null,null,null,"❷",{"$f":"ROUNDUP($M$18*T19,0)","v":20},"-",{"$f":"M20+1","v":18},null,null,{"$f":"M19-O19","v":2},null,0.88300000000000001]
["Punkterechner",null,null,{"$f":"SUM(AB7:AB12)","v":22},"…............",100," %",null,null,null,null,"❸",{"$f":"ROUNDUP($M$18*T20,0)","v":17},"-",{"$f":"M21+1","v":15},null,null,{"$f":"M20-O20","v":2},null,0.76]
[null,null,"Deine  erreichten Punkte:",{"$f":"ROUND(SUM(Z7:Z12),2)","v":0},"…............",{"$f":"D21*F20/(IF(D20=0,1,D20))","v":0}," %",null,null,null,null,"❹",14,"-",{"$f":"M22+1","v":12},null,null,{"$f":"M21-O21","v":2},null,0.628]
[null,null,null,null,null,null,null,null,null,null,null,"❺",11,"-",0,null,null,null,null,0.47]
[]
[null,null,null,null,null,null,null,null,null,null,"Erreichte Punkte:",null,null,{"$f":"SUM(Z7:Z12)","v":0},{"$f":"\"  das entspricht: \"&TEXT(ROUND(F21,4),\"# ##0,00\")&\" %\"","v":"  das entspricht: 0,00 %"}]
[null,null,null,null,null,null,null,null,null,null,"Note:",null,null,{"$f":"IF(P7>0,5,IF(N24>=O18,1,IF(AND(N24>=O19,N24<O18),2,IF(AND(N24>=O20,N24<O19),3,IF(AND(N24>=O21,N24<O20),4,5)))))","v":5}]
[]
["Deine Ergebnisse im Detail"]
[null,null,null,null,null,null,null,null,null,null,null,null,null,null,null,null,null,null,null,null,null,null,null," "]
["Frage",null,null,"Pkte","/","Ges.",null,null,null,null,null,null,null,null,null,null,null,null,null,null,null,null,null,null,null,"Pkte","/","Ges."]
["1.",{"$f":"MID(A1,12,300)","v":"Bewertung von Umlaufvermögen"},null,{"$f":"Berechnungen!M65","v":0},{"$f":"IF(B30=\"\",\"\",\"/\")","v":"/"},{"$f":"Berechnungen!O65","v":22},"GK17",null,null,null,null,null,null,null,null,null,null,null,null,null,null,null,null,{"$f":"IF(G30=\"\",\"\",G30)","v":"GK17"},":",{"$f":"D30","v":0},{"$f":"E30","v":"/"},{"$f":"F30","v":22}]
["2.",{"$f":"IF(TYPE(VLOOKUP($A31,FB_1,2,0))=16,\"\",VLOOKUP($A31,FB_1,2,0))&IF(TYPE(VLOOKUP($A31,FB_2,2,0))=16,\"\",VLOOKUP($A31,FB_2,2,0))&IF(TYPE(VLOOKUP($A31,FB_3,2,0))=16,\"\",VLOOKUP($A31,FB_3,2,0))&IF(TYPE(VLOOKUP($A31,FB_4,2,0))=16,\"\",VLOOKUP($A31,FB_4,2,0))&IF(TYPE(VLOOKUP($A31,FB_5,2,0))=16,\"\",VLOOKUP($A31,FB_5,2,0))&IF(TYPE(VLOOKUP($A31,FB_6,2,0))=16,\"\",VLOOKUP($A31,FB_6,2,0))&IF(TYPE(VLOOKUP($A31,FB_7,2,0))=16,\"\",VLOOKUP($A31,FB_7,2,0))&IF(TYPE(VLOOKUP($A31,FB_8,2,0))=16,\"\",VLOOKUP($A31,FB_8,2,0))&IF(TYPE(VLOOKUP($A31,FB_9,2,0))=16,\"\",VLOOKUP($A31,FB_9,2,0))&IF(TYPE(VLOOKUP($A31,FB_10,2,0))=16,\"\",VLOOKUP($A31,FB_10,2,0))&IF(TYPE(VLOOKUP($A31,FB_11,2,0))=16,\"\",VLOOKUP($A31,FB_11,2,0))&IF(TYPE(VLOOKUP($A31,FB_12,2,0))=16,\"\",VLOOKUP($A31,FB_12,2,0))&IF(TYPE(VLOOKUP($A31,FB_13,2,0))=16,\"\",VLOOKUP($A31,FB_13,2,0))&IF(TYPE(VLOOKUP($A31,FB_14,2,0))=16,\"\",VLOOKUP($A31,FB_14,2,0))&IF(TYPE(VLOOKUP($A31,FB_15,2,0))=16,\"\",VLOOKUP($A31,FB_15,2,0))&IF(TYPE(VLOOKUP($A31,FB_16,2,0))=16,\"\",VLOOKUP($A31,FB_16,2,0))&IF(TYPE(VLOOKUP($A31,FB_17,2,0))=16,\"\",VLOOKUP($A31,FB_17,2,0))&IF(TYPE(VLOOKUP($A31,FB_18,2,0))=16,\"\",VLOOKUP($A31,FB_18,2,0))&IF(TYPE(VLOOKUP($A31,FB_19,2,0))=16,\"\",VLOOKUP($A31,FB_19,2,0))&IF(TYPE(VLOOKUP($A31,FB_20,2,0))=16,\"\",VLOOKUP($A31,FB_20,2,0))&IF(TYPE(VLOOKUP($A31,FB_21,2,0))=16,\"\",VLOOKUP($A31,FB_21,2,0))&IF(TYPE(VLOOKUP($A31,FB_22,2,0))=16,\"\",VLOOKUP($A31,FB_22,2,0))&IF(TYPE(VLOOKUP($A31,FB_23,2,0))=16,\"\",VLOOKUP($A31,FB_23,2,0))&IF(TYPE(VLOOKUP($A31,FB_24,2,0))=16,\"\",VLOOKUP($A31,FB_24,2,0))&IF(TYPE(VLOOKUP($A31,FB_25,2,0))=16,\"\",VLOOKUP($A31,FB_25,2,0))&IF(TYPE(VLOOKUP($A31,FB_26,2,0))=16,\"\",VLOOKUP($A31,FB_26,2,0))&IF(TYPE(VLOOKUP($A31,FB_27,2,0))=16,\"\",VLOOKUP($A31,FB_27,2,0))&IF(TYPE(VLOOKUP($A31,FB_28,2,0))=16,\"\",VLOOKUP($A31,FB_28,2,0))&IF(TYPE(VLOOKUP($A31,FB_29,2,0))=16,\"\",VLOOKUP($A31,FB_29,2,0))&IF(TYPE(VLOOKUP($A31,FB_30,2,0))=16,\"\",VLOOKUP($A31,FB_30,2,0))","v":""},null,{"$f":"IF($B31=\"\",\"\",_xlfn.NUMBERVALUE(IF(TYPE(VLOOKUP($A31,FB_1,P$5,0))=16,\"\",VLOOKUP($A31,FB_1,P$5,0))&IF(TYPE(VLOOKUP($A31,FB_2,P$5,0))=16,\"\",VLOOKUP($A31,FB_2,P$5,0))&IF(TYPE(VLOOKUP($A31,FB_3,P$5,0))=16,\"\",VLOOKUP($A31,FB_3,P$5,0))&IF(TYPE(VLOOKUP($A31,FB_4,P$5,0))=16,\"\",VLOOKUP($A31,FB_4,P$5,0))&IF(TYPE(VLOOKUP($A31,FB_5,P$5,0))=16,\"\",VLOOKUP($A31,FB_5,P$5,0))&IF(TYPE(VLOOKUP($A31,FB_6,P$5,0))=16,\"\",VLOOKUP($A31,FB_6,P$5,0))&IF(TYPE(VLOOKUP($A31,FB_7,P$5,0))=16,\"\",VLOOKUP($A31,FB_7,P$5,0))&IF(TYPE(VLOOKUP($A31,FB_8,P$5,0))=16,\"\",VLOOKUP($A31,FB_8,P$5,0))&IF(TYPE(VLOOKUP($A31,FB_9,P$5,0))=16,\"\",VLOOKUP($A31,FB_9,P$5,0))&IF(TYPE(VLOOKUP($A31,FB_10,P$5,0))=16,\"\",VLOOKUP($A31,FB_10,P$5,0))&IF(TYPE(VLOOKUP($A31,FB_11,P$5,0))=16,\"\",VLOOKUP($A31,FB_11,P$5,0))&IF(TYPE(VLOOKUP($A31,FB_12,P$5,0))=16,\"\",VLOOKUP($A31,FB_12,P$5,0))&IF(TYPE(VLOOKUP($A31,FB_13,P$5,0))=16,\"\",VLOOKUP($A31,FB_13,P$5,0))&IF(TYPE(VLOOKUP($A31,FB_14,P$5,0))=16,\"\",VLOOKUP($A31,FB_14,P$5,0))&IF(TYPE(VLOOKUP($A31,FB_15,P$5,0))=16,\"\",VLOOKUP($A31,FB_15,P$5,0))&IF(TYPE(VLOOKUP($A31,FB_16,P$5,0))=16,\"\",VLOOKUP($A31,FB_16,P$5,0))&IF(TYPE(VLOOKUP($A31,FB_17,P$5,0))=16,\"\",VLOOKUP($A31,FB_17,P$5,0))&IF(TYPE(VLOOKUP($A31,FB_18,P$5,0))=16,\"\",VLOOKUP($A31,FB_18,P$5,0))&IF(TYPE(VLOOKUP($A31,FB_19,P$5,0))=16,\"\",VLOOKUP($A31,FB_19,P$5,0))&IF(TYPE(VLOOKUP($A31,FB_20,P$5,0))=16,\"\",VLOOKUP($A31,FB_20,P$5,0))&IF(TYPE(VLOOKUP($A31,FB_21,P$5,0))=16,\"\",VLOOKUP($A31,FB_21,P$5,0))&IF(TYPE(VLOOKUP($A31,FB_22,P$5,0))=16,\"\",VLOOKUP($A31,FB_22,P$5,0))&IF(TYPE(VLOOKUP($A31,FB_23,P$5,0))=16,\"\",VLOOKUP($A31,FB_23,P$5,0))&IF(TYPE(VLOOKUP($A31,FB_24,P$5,0))=16,\"\",VLOOKUP($A31,FB_24,P$5,0))&IF(TYPE(VLOOKUP($A31,FB_25,P$5,0))=16,\"\",VLOOKUP($A31,FB_25,P$5,0))&IF(TYPE(VLOOKUP($A31,FB_26,P$5,0))=16,\"\",VLOOKUP($A31,FB_26,P$5,0))&IF(TYPE(VLOOKUP($A31,FB_27,P$5,0))=16,\"\",VLOOKUP($A31,FB_27,P$5,0))&IF(TYPE(VLOOKUP($A31,FB_28,P$5,0))=16,\"\",VLOOKUP($A31,FB_28,P$5,0))&IF(TYPE(VLOOKUP($A31,FB_29,P$5,0))=16,\"\",VLOOKUP($A31,FB_29,P$5,0))&IF(TYPE(VLOOKUP($A31,FB_30,P$5,0))=16,\"\",VLOOKUP($A31,FB_30,P$5,0))))","v":""},{"$f":"IF(B31=\"\",\"\",\"/\")","v":""},{"$f":"IF($B31=\"\",\"\",_xlfn.NUMBERVALUE(IF(TYPE(VLOOKUP($A31,FB_1,R$5,0))=16,\"\",VLOOKUP($A31,FB_1,R$5,0))&IF(TYPE(VLOOKUP($A31,FB_2,R$5,0))=16,\"\",VLOOKUP($A31,FB_2,R$5,0))&IF(TYPE(VLOOKUP($A31,FB_3,R$5,0))=16,\"\",VLOOKUP($A31,FB_3,R$5,0))&IF(TYPE(VLOOKUP($A31,FB_4,R$5,0))=16,\"\",VLOOKUP($A31,FB_4,R$5,0))&IF(TYPE(VLOOKUP($A31,FB_5,R$5,0))=16,\"\",VLOOKUP($A31,FB_5,R$5,0))&IF(TYPE(VLOOKUP($A31,FB_6,R$5,0))=16,\"\",VLOOKUP($A31,FB_6,R$5,0))&IF(TYPE(VLOOKUP($A31,FB_7,R$5,0))=16,\"\",VLOOKUP($A31,FB_7,R$5,0))&IF(TYPE(VLOOKUP($A31,FB_8,R$5,0))=16,\"\",VLOOKUP($A31,FB_8,R$5,0))&IF(TYPE(VLOOKUP($A31,FB_9,R$5,0))=16,\"\",VLOOKUP($A31,FB_9,R$5,0))&IF(TYPE(VLOOKUP($A31,FB_10,R$5,0))=16,\"\",VLOOKUP($A31,FB_10,R$5,0))&IF(TYPE(VLOOKUP($A31,FB_11,R$5,0))=16,\"\",VLOOKUP($A31,FB_11,R$5,0))&IF(TYPE(VLOOKUP($A31,FB_12,R$5,0))=16,\"\",VLOOKUP($A31,FB_12,R$5,0))&IF(TYPE(VLOOKUP($A31,FB_13,R$5,0))=16,\"\",VLOOKUP($A31,FB_13,R$5,0))&IF(TYPE(VLOOKUP($A31,FB_14,R$5,0))=16,\"\",VLOOKUP($A31,FB_14,R$5,0))&IF(TYPE(VLOOKUP($A31,FB_15,R$5,0))=16,\"\",VLOOKUP($A31,FB_15,R$5,0))&IF(TYPE(VLOOKUP($A31,FB_16,R$5,0))=16,\"\",VLOOKUP($A31,FB_16,R$5,0))&IF(TYPE(VLOOKUP($A31,FB_17,R$5,0))=16,\"\",VLOOKUP($A31,FB_17,R$5,0))&IF(TYPE(VLOOKUP($A31,FB_18,R$5,0))=16,\"\",VLOOKUP($A31,FB_18,R$5,0))&IF(TYPE(VLOOKUP($A31,FB_19,R$5,0))=16,\"\",VLOOKUP($A31,FB_19,R$5,0))&IF(TYPE(VLOOKUP($A31,FB_20,R$5,0))=16,\"\",VLOOKUP($A31,FB_20,R$5,0))&IF(TYPE(VLOOKUP($A31,FB_21,R$5,0))=16,\"\",VLOOKUP($A31,FB_21,R$5,0))&IF(TYPE(VLOOKUP($A31,FB_22,R$5,0))=16,\"\",VLOOKUP($A31,FB_22,R$5,0))&IF(TYPE(VLOOKUP($A31,FB_23,R$5,0))=16,\"\",VLOOKUP($A31,FB_23,R$5,0))&IF(TYPE(VLOOKUP($A31,FB_24,R$5,0))=16,\"\",VLOOKUP($A31,FB_24,R$5,0))&IF(TYPE(VLOOKUP($A31,FB_25,R$5,0))=16,\"\",VLOOKUP($A31,FB_25,R$5,0))&IF(TYPE(VLOOKUP($A31,FB_26,R$5,0))=16,\"\",VLOOKUP($A31,FB_26,R$5,0))&IF(TYPE(VLOOKUP($A31,FB_27,R$5,0))=16,\"\",VLOOKUP($A31,FB_27,R$5,0))&IF(TYPE(VLOOKUP($A31,FB_28,R$5,0))=16,\"\",VLOOKUP($A31,FB_28,R$5,0))&IF(TYPE(VLOOKUP($A31,FB_29,R$5,0))=16,\"\",VLOOKUP($A31,FB_29,R$5,0))&IF(TYPE(VLOOKUP($A31,FB_30,R$5,0))=16,\"\",VLOOKUP($A31,FB_30,R$5,0))))","v":""},{"$f":"IF($B31=\"\",\"\",IF(TYPE(VLOOKUP($A31,FB_1,S$5,0))=16,\"\",VLOOKUP($A31,FB_1,S$5,0))&IF(TYPE(VLOOKUP($A31,FB_2,S$5,0))=16,\"\",VLOOKUP($A31,FB_2,S$5,0))&IF(TYPE(VLOOKUP($A31,FB_3,S$5,0))=16,\"\",VLOOKUP($A31,FB_3,S$5,0))&IF(TYPE(VLOOKUP($A31,FB_4,S$5,0))=16,\"\",VLOOKUP($A31,FB_4,S$5,0))&IF(TYPE(VLOOKUP($A31,FB_5,S$5,0))=16,\"\",VLOOKUP($A31,FB_5,S$5,0))&IF(TYPE(VLOOKUP($A31,FB_6,S$5,0))=16,\"\",VLOOKUP($A31,FB_6,S$5,0))&IF(TYPE(VLOOKUP($A31,FB_7,S$5,0))=16,\"\",VLOOKUP($A31,FB_7,S$5,0))&IF(TYPE(VLOOKUP($A31,FB_8,S$5,0))=16,\"\",VLOOKUP($A31,FB_8,S$5,0))&IF(TYPE(VLOOKUP($A31,FB_9,S$5,0))=16,\"\",VLOOKUP($A31,FB_9,S$5,0))&IF(TYPE(VLOOKUP($A31,FB_10,S$5,0))=16,\"\",VLOOKUP($A31,FB_10,S$5,0))&IF(TYPE(VLOOKUP($A31,FB_11,S$5,0))=16,\"\",VLOOKUP($A31,FB_11,S$5,0))&IF(TYPE(VLOOKUP($A31,FB_12,S$5,0))=16,\"\",VLOOKUP($A31,FB_12,S$5,0))&IF(TYPE(VLOOKUP($A31,FB_13,S$5,0))=16,\"\",VLOOKUP($A31,FB_13,S$5,0))&IF(TYPE(VLOOKUP($A31,FB_14,S$5,0))=16,\"\",VLOOKUP($A31,FB_14,S$5,0))&IF(TYPE(VLOOKUP($A31,FB_15,S$5,0))=16,\"\",VLOOKUP($A31,FB_15,S$5,0))&IF(TYPE(VLOOKUP($A31,FB_16,S$5,0))=16,\"\",VLOOKUP($A31,FB_16,S$5,0))&IF(TYPE(VLOOKUP($A31,FB_17,S$5,0))=16,\"\",VLOOKUP($A31,FB_17,S$5,0))&IF(TYPE(VLOOKUP($A31,FB_18,S$5,0))=16,\"\",VLOOKUP($A31,FB_18,S$5,0))&IF(TYPE(VLOOKUP($A31,FB_19,S$5,0))=16,\"\",VLOOKUP($A31,FB_19,S$5,0))&IF(TYPE(VLOOKUP($A31,FB_20,S$5,0))=16,\"\",VLOOKUP($A31,FB_20,S$5,0))&IF(TYPE(VLOOKUP($A31,FB_21,S$5,0))=16,\"\",VLOOKUP($A31,FB_21,S$5,0))&IF(TYPE(VLOOKUP($A31,FB_22,S$5,0))=16,\"\",VLOOKUP($A31,FB_22,S$5,0))&IF(TYPE(VLOOKUP($A31,FB_23,S$5,0))=16,\"\",VLOOKUP($A31,FB_23,S$5,0))&IF(TYPE(VLOOKUP($A31,FB_24,S$5,0))=16,\"\",VLOOKUP($A31,FB_24,S$5,0))&IF(TYPE(VLOOKUP($A31,FB_25,S$5,0))=16,\"\",VLOOKUP($A31,FB_25,S$5,0))&IF(TYPE(VLOOKUP($A31,FB_26,S$5,0))=16,\"\",VLOOKUP($A31,FB_26,S$5,0))&IF(TYPE(VLOOKUP($A31,FB_27,S$5,0))=16,\"\",VLOOKUP($A31,FB_27,S$5,0))&IF(TYPE(VLOOKUP($A31,FB_28,S$5,0))=16,\"\",VLOOKUP($A31,FB_28,S$5,0))&IF(TYPE(VLOOKUP($A31,FB_29,S$5,0))=16,\"\",VLOOKUP($A31,FB_29,S$5,0))&IF(TYPE(VLOOKUP($A31,FB_30,S$5,0))=16,\"\",VLOOKUP($A31,FB_30,S$5,0)))","v":""},null,null,null,null,null,null,null,null,null,null,null,null,null,null,null,null,{"$f":"IF(G31=\"\",\"\",G31)","v":""},":",{"$f":"D31","v":""},"",""]
["3.",{"$f":"IF(TYPE(VLOOKUP($A32,FB_1,2,0))=16,\"\",VLOOKUP($A32,FB_1,2,0))&IF(TYPE(VLOOKUP($A32,FB_2,2,0))=16,\"\",VLOOKUP($A32,FB_2,2,0))&IF(TYPE(VLOOKUP($A32,FB_3,2,0))=16,\"\",VLOOKUP($A32,FB_3,2,0))&IF(TYPE(VLOOKUP($A32,FB_4,2,0))=16,\"\",VLOOKUP($A32,FB_4,2,0))&IF(TYPE(VLOOKUP($A32,FB_5,2,0))=16,\"\",VLOOKUP($A32,FB_5,2,0))&IF(TYPE(VLOOKUP($A32,FB_6,2,0))=16,\"\",VLOOKUP($A32,FB_6,2,0))&IF(TYPE(VLOOKUP($A32,FB_7,2,0))=16,\"\",VLOOKUP($A32,FB_7,2,0))&IF(TYPE(VLOOKUP($A32,FB_8,2,0))=16,\"\",VLOOKUP($A32,FB_8,2,0))&IF(TYPE(VLOOKUP($A32,FB_9,2,0))=16,\"\",VLOOKUP($A32,FB_9,2,0))&IF(TYPE(VLOOKUP($A32,FB_10,2,0))=16,\"\",VLOOKUP($A32,FB_10,2,0))&IF(TYPE(VLOOKUP($A32,FB_11,2,0))=16,\"\",VLOOKUP($A32,FB_11,2,0))&IF(TYPE(VLOOKUP($A32,FB_12,2,0))=16,\"\",VLOOKUP($A32,FB_12,2,0))&IF(TYPE(VLOOKUP($A32,FB_13,2,0))=16,\"\",VLOOKUP($A32,FB_13,2,0))&IF(TYPE(VLOOKUP($A32,FB_14,2,0))=16,\"\",VLOOKUP($A32,FB_14,2,0))&IF(TYPE(VLOOKUP($A32,FB_15,2,0))=16,\"\",VLOOKUP($A32,FB_15,2,0))&IF(TYPE(VLOOKUP($A32,FB_16,2,0))=16,\"\",VLOOKUP($A32,FB_16,2,0))&IF(TYPE(VLOOKUP($A32,FB_17,2,0))=16,\"\",VLOOKUP($A32,FB_17,2,0))&IF(TYPE(VLOOKUP($A32,FB_18,2,0))=16,\"\",VLOOKUP($A32,FB_18,2,0))&IF(TYPE(VLOOKUP($A32,FB_19,2,0))=16,\"\",VLOOKUP($A32,FB_19,2,0))&IF(TYPE(VLOOKUP($A32,FB_20,2,0))=16,\"\",VLOOKUP($A32,FB_20,2,0))&IF(TYPE(VLOOKUP($A32,FB_21,2,0))=16,\"\",VLOOKUP($A32,FB_21,2,0))&IF(TYPE(VLOOKUP($A32,FB_22,2,0))=16,\"\",VLOOKUP($A32,FB_22,2,0))&IF(TYPE(VLOOKUP($A32,FB_23,2,0))=16,\"\",VLOOKUP($A32,FB_23,2,0))&IF(TYPE(VLOOKUP($A32,FB_24,2,0))=16,\"\",VLOOKUP($A32,FB_24,2,0))&IF(TYPE(VLOOKUP($A32,FB_25,2,0))=16,\"\",VLOOKUP($A32,FB_25,2,0))&IF(TYPE(VLOOKUP($A32,FB_26,2,0))=16,\"\",VLOOKUP($A32,FB_26,2,0))&IF(TYPE(VLOOKUP($A32,FB_27,2,0))=16,\"\",VLOOKUP($A32,FB_27,2,0))&IF(TYPE(VLOOKUP($A32,FB_28,2,0))=16,\"\",VLOOKUP($A32,FB_28,2,0))&IF(TYPE(VLOOKUP($A32,FB_29,2,0))=16,\"\",VLOOKUP($A32,FB_29,2,0))&IF(TYPE(VLOOKUP($A32,FB_30,2,0))=16,\"\",VLOOKUP($A32,FB_30,2,0))","v":""},null,{"$f":"IF($B32=\"\",\"\",_xlfn.NUMBERVALUE(IF(TYPE(VLOOKUP($A32,FB_1,P$5,0))=16,\"\",VLOOKUP($A32,FB_1,P$5,0))&IF(TYPE(VLOOKUP($A32,FB_2,P$5,0))=16,\"\",VLOOKUP($A32,FB_2,P$5,0))&IF(TYPE(VLOOKUP($A32,FB_3,P$5,0))=16,\"\",VLOOKUP($A32,FB_3,P$5,0))&IF(TYPE(VLOOKUP($A32,FB_4,P$5,0))=16,\"\",VLOOKUP($A32,FB_4,P$5,0))&IF(TYPE(VLOOKUP($A32,FB_5,P$5,0))=16,\"\",VLOOKUP($A32,FB_5,P$5,0))&IF(TYPE(VLOOKUP($A32,FB_6,P$5,0))=16,\"\",VLOOKUP($A32,FB_6,P$5,0))&IF(TYPE(VLOOKUP($A32,FB_7,P$5,0))=16,\"\",VLOOKUP($A32,FB_7,P$5,0))&IF(TYPE(VLOOKUP($A32,FB_8,P$5,0))=16,\"\",VLOOKUP($A32,FB_8,P$5,0))&IF(TYPE(VLOOKUP($A32,FB_9,P$5,0))=16,\"\",VLOOKUP($A32,FB_9,P$5,0))&IF(TYPE(VLOOKUP($A32,FB_10,P$5,0))=16,\"\",VLOOKUP($A32,FB_10,P$5,0))&IF(TYPE(VLOOKUP($A32,FB_11,P$5,0))=16,\"\",VLOOKUP($A32,FB_11,P$5,0))&IF(TYPE(VLOOKUP($A32,FB_12,P$5,0))=16,\"\",VLOOKUP($A32,FB_12,P$5,0))&IF(TYPE(VLOOKUP($A32,FB_13,P$5,0))=16,\"\",VLOOKUP($A32,FB_13,P$5,0))&IF(TYPE(VLOOKUP($A32,FB_14,P$5,0))=16,\"\",VLOOKUP($A32,FB_14,P$5,0))&IF(TYPE(VLOOKUP($A32,FB_15,P$5,0))=16,\"\",VLOOKUP($A32,FB_15,P$5,0))&IF(TYPE(VLOOKUP($A32,FB_16,P$5,0))=16,\"\",VLOOKUP($A32,FB_16,P$5,0))&IF(TYPE(VLOOKUP($A32,FB_17,P$5,0))=16,\"\",VLOOKUP($A32,FB_17,P$5,0))&IF(TYPE(VLOOKUP($A32,FB_18,P$5,0))=16,\"\",VLOOKUP($A32,FB_18,P$5,0))&IF(TYPE(VLOOKUP($A32,FB_19,P$5,0))=16,\"\",VLOOKUP($A32,FB_19,P$5,0))&IF(TYPE(VLOOKUP($A32,FB_20,P$5,0))=16,\"\",VLOOKUP($A32,FB_20,P$5,0))&IF(TYPE(VLOOKUP($A32,FB_21,P$5,0))=16,\"\",VLOOKUP($A32,FB_21,P$5,0))&IF(TYPE(VLOOKUP($A32,FB_22,P$5,0))=16,\"\",VLOOKUP($A32,FB_22,P$5,0))&IF(TYPE(VLOOKUP($A32,FB_23,P$5,0))=16,\"\",VLOOKUP($A32,FB_23,P$5,0))&IF(TYPE(VLOOKUP($A32,FB_24,P$5,0))=16,\"\",VLOOKUP($A32,FB_24,P$5,0))&IF(TYPE(VLOOKUP($A32,FB_25,P$5,0))=16,\"\",VLOOKUP($A32,FB_25,P$5,0))&IF(TYPE(VLOOKUP($A32,FB_26,P$5,0))=16,\"\",VLOOKUP($A32,FB_26,P$5,0))&IF(TYPE(VLOOKUP($A32,FB_27,P$5,0))=16,\"\",VLOOKUP($A32,FB_27,P$5,0))&IF(TYPE(VLOOKUP($A32,FB_28,P$5,0))=16,\"\",VLOOKUP($A32,FB_28,P$5,0))&IF(TYPE(VLOOKUP($A32,FB_29,P$5,0))=16,\"\",VLOOKUP($A32,FB_29,P$5,0))&IF(TYPE(VLOOKUP($A32,FB_30,P$5,0))=16,\"\",VLOOKUP($A32,FB_30,P$5,0))))","v":""},"",{"$f":"IF($B32=\"\",\"\",_xlfn.NUMBERVALUE(IF(TYPE(VLOOKUP($A32,FB_1,R$5,0))=16,\"\",VLOOKUP($A32,FB_1,R$5,0))&IF(TYPE(VLOOKUP($A32,FB_2,R$5,0))=16,\"\",VLOOKUP($A32,FB_2,R$5,0))&IF(TYPE(VLOOKUP($A32,FB_3,R$5,0))=16,\"\",VLOOKUP($A32,FB_3,R$5,0))&IF(TYPE(VLOOKUP($A32,FB_4,R$5,0))=16,\"\",VLOOKUP($A32,FB_4,R$5,0))&IF(TYPE(VLOOKUP($A32,FB_5,R$5,0))=16,\"\",VLOOKUP($A32,FB_5,R$5,0))&IF(TYPE(VLOOKUP($A32,FB_6,R$5,0))=16,\"\",VLOOKUP($A32,FB_6,R$5,0))&IF(TYPE(VLOOKUP($A32,FB_7,R$5,0))=16,\"\",VLOOKUP($A32,FB_7,R$5,0))&IF(TYPE(VLOOKUP($A32,FB_8,R$5,0))=16,\"\",VLOOKUP($A32,FB_8,R$5,0))&IF(TYPE(VLOOKUP($A32,FB_9,R$5,0))=16,\"\",VLOOKUP($A32,FB_9,R$5,0))&IF(TYPE(VLOOKUP($A32,FB_10,R$5,0))=16,\"\",VLOOKUP($A32,FB_10,R$5,0))&IF(TYPE(VLOOKUP($A32,FB_11,R$5,0))=16,\"\",VLOOKUP($A32,FB_11,R$5,0))&IF(TYPE(VLOOKUP($A32,FB_12,R$5,0))=16,\"\",VLOOKUP($A32,FB_12,R$5,0))&IF(TYPE(VLOOKUP($A32,FB_13,R$5,0))=16,\"\",VLOOKUP($A32,FB_13,R$5,0))&IF(TYPE(VLOOKUP($A32,FB_14,R$5,0))=16,\"\",VLOOKUP($A32,FB_14,R$5,0))&IF(TYPE(VLOOKUP($A32,FB_15,R$5,0))=16,\"\",VLOOKUP($A32,FB_15,R$5,0))&IF(TYPE(VLOOKUP($A32,FB_16,R$5,0))=16,\"\",VLOOKUP($A32,FB_16,R$5,0))&IF(TYPE(VLOOKUP($A32,FB_17,R$5,0))=16,\"\",VLOOKUP($A32,FB_17,R$5,0))&IF(TYPE(VLOOKUP($A32,FB_18,R$5,0))=16,\"\",VLOOKUP($A32,FB_18,R$5,0))&IF(TYPE(VLOOKUP($A32,FB_19,R$5,0))=16,\"\",VLOOKUP($A32,FB_19,R$5,0))&IF(TYPE(VLOOKUP($A32,FB_20,R$5,0))=16,\"\",VLOOKUP($A32,FB_20,R$5,0))&IF(TYPE(VLOOKUP($A32,FB_21,R$5,0))=16,\"\",VLOOKUP($A32,FB_21,R$5,0))&IF(TYPE(VLOOKUP($A32,FB_22,R$5,0))=16,\"\",VLOOKUP($A32,FB_22,R$5,0))&IF(TYPE(VLOOKUP($A32,FB_23,R$5,0))=16,\"\",VLOOKUP($A32,FB_23,R$5,0))&IF(TYPE(VLOOKUP($A32,FB_24,R$5,0))=16,\"\",VLOOKUP($A32,FB_24,R$5,0))&IF(TYPE(VLOOKUP($A32,FB_25,R$5,0))=16,\"\",VLOOKUP($A32,FB_25,R$5,0))&IF(TYPE(VLOOKUP($A32,FB_26,R$5,0))=16,\"\",VLOOKUP($A32,FB_26,R$5,0))&IF(TYPE(VLOOKUP($A32,FB_27,R$5,0))=16,\"\",VLOOKUP($A32,FB_27,R$5,0))&IF(TYPE(VLOOKUP($A32,FB_28,R$5,0))=16,\"\",VLOOKUP($A32,FB_28,R$5,0))&IF(TYPE(VLOOKUP($A32,FB_29,R$5,0))=16,\"\",VLOOKUP($A32,FB_29,R$5,0))&IF(TYPE(VLOOKUP($A32,FB_30,R$5,0))=16,\"\",VLOOKUP($A32,FB_30,R$5,0))))","v":""},{"$f":"IF($B32=\"\",\"\",IF(TYPE(VLOOKUP($A32,FB_1,S$5,0))=16,\"\",VLOOKUP($A32,FB_1,S$5,0))&IF(TYPE(VLOOKUP($A32,FB_2,S$5,0))=16,\"\",VLOOKUP($A32,FB_2,S$5,0))&IF(TYPE(VLOOKUP($A32,FB_3,S$5,0))=16,\"\",VLOOKUP($A32,FB_3,S$5,0))&IF(TYPE(VLOOKUP($A32,FB_4,S$5,0))=16,\"\",VLOOKUP($A32,FB_4,S$5,0))&IF(TYPE(VLOOKUP($A32,FB_5,S$5,0))=16,\"\",VLOOKUP($A32,FB_5,S$5,0))&IF(TYPE(VLOOKUP($A32,FB_6,S$5,0))=16,\"\",VLOOKUP($A32,FB_6,S$5,0))&IF(TYPE(VLOOKUP($A32,FB_7,S$5,0))=16,\"\",VLOOKUP($A32,FB_7,S$5,0))&IF(TYPE(VLOOKUP($A32,FB_8,S$5,0))=16,\"\",VLOOKUP($A32,FB_8,S$5,0))&IF(TYPE(VLOOKUP($A32,FB_9,S$5,0))=16,\"\",VLOOKUP($A32,FB_9,S$5,0))&IF(TYPE(VLOOKUP($A32,FB_10,S$5,0))=16,\"\",VLOOKUP($A32,FB_10,S$5,0))&IF(TYPE(VLOOKUP($A32,FB_11,S$5,0))=16,\"\",VLOOKUP($A32,FB_11,S$5,0))&IF(TYPE(VLOOKUP($A32,FB_12,S$5,0))=16,\"\",VLOOKUP($A32,FB_12,S$5,0))&IF(TYPE(VLOOKUP($A32,FB_13,S$5,0))=16,\"\",VLOOKUP($A32,FB_13,S$5,0))&IF(TYPE(VLOOKUP($A32,FB_14,S$5,0))=16,\"\",VLOOKUP($A32,FB_14,S$5,0))&IF(TYPE(VLOOKUP($A32,FB_15,S$5,0))=16,\"\",VLOOKUP($A32,FB_15,S$5,0))&IF(TYPE(VLOOKUP($A32,FB_16,S$5,0))=16,\"\",VLOOKUP($A32,FB_16,S$5,0))&IF(TYPE(VLOOKUP($A32,FB_17,S$5,0))=16,\"\",VLOOKUP($A32,FB_17,S$5,0))&IF(TYPE(VLOOKUP($A32,FB_18,S$5,0))=16,\"\",VLOOKUP($A32,FB_18,S$5,0))&IF(TYPE(VLOOKUP($A32,FB_19,S$5,0))=16,\"\",VLOOKUP($A32,FB_19,S$5,0))&IF(TYPE(VLOOKUP($A32,FB_20,S$5,0))=16,\"\",VLOOKUP($A32,FB_20,S$5,0))&IF(TYPE(VLOOKUP($A32,FB_21,S$5,0))=16,\"\",VLOOKUP($A32,FB_21,S$5,0))&IF(TYPE(VLOOKUP($A32,FB_22,S$5,0))=16,\"\",VLOOKUP($A32,FB_22,S$5,0))&IF(TYPE(VLOOKUP($A32,FB_23,S$5,0))=16,\"\",VLOOKUP($A32,FB_23,S$5,0))&IF(TYPE(VLOOKUP($A32,FB_24,S$5,0))=16,\"\",VLOOKUP($A32,FB_24,S$5,0))&IF(TYPE(VLOOKUP($A32,FB_25,S$5,0))=16,\"\",VLOOKUP($A32,FB_25,S$5,0))&IF(TYPE(VLOOKUP($A32,FB_26,S$5,0))=16,\"\",VLOOKUP($A32,FB_26,S$5,0))&IF(TYPE(VLOOKUP($A32,FB_27,S$5,0))=16,\"\",VLOOKUP($A32,FB_27,S$5,0))&IF(TYPE(VLOOKUP($A32,FB_28,S$5,0))=16,\"\",VLOOKUP($A32,FB_28,S$5,0))&IF(TYPE(VLOOKUP($A32,FB_29,S$5,0))=16,\"\",VLOOKUP($A32,FB_29,S$5,0))&IF(TYPE(VLOOKUP($A32,FB_30,S$5,0))=16,\"\",VLOOKUP($A32,FB_30,S$5,0)))","v":""},null,null,null,null,null,null,null,null,null,null,null,null,null,null,null,null,"",":","","",""]
["4.",{"$f":"IF(TYPE(VLOOKUP($A33,FB_1,2,0))=16,\"\",VLOOKUP($A33,FB_1,2,0))&IF(TYPE(VLOOKUP($A33,FB_2,2,0))=16,\"\",VLOOKUP($A33,FB_2,2,0))&IF(TYPE(VLOOKUP($A33,FB_3,2,0))=16,\"\",VLOOKUP($A33,FB_3,2,0))&IF(TYPE(VLOOKUP($A33,FB_4,2,0))=16,\"\",VLOOKUP($A33,FB_4,2,0))&IF(TYPE(VLOOKUP($A33,FB_5,2,0))=16,\"\",VLOOKUP($A33,FB_5,2,0))&IF(TYPE(VLOOKUP($A33,FB_6,2,0))=16,\"\",VLOOKUP($A33,FB_6,2,0))&IF(TYPE(VLOOKUP($A33,FB_7,2,0))=16,\"\",VLOOKUP($A33,FB_7,2,0))&IF(TYPE(VLOOKUP($A33,FB_8,2,0))=16,\"\",VLOOKUP($A33,FB_8,2,0))&IF(TYPE(VLOOKUP($A33,FB_9,2,0))=16,\"\",VLOOKUP($A33,FB_9,2,0))&IF(TYPE(VLOOKUP($A33,FB_10,2,0))=16,\"\",VLOOKUP($A33,FB_10,2,0))&IF(TYPE(VLOOKUP($A33,FB_11,2,0))=16,\"\",VLOOKUP($A33,FB_11,2,0))&IF(TYPE(VLOOKUP($A33,FB_12,2,0))=16,\"\",VLOOKUP($A33,FB_12,2,0))&IF(TYPE(VLOOKUP($A33,FB_13,2,0))=16,\"\",VLOOKUP($A33,FB_13,2,0))&IF(TYPE(VLOOKUP($A33,FB_14,2,0))=16,\"\",VLOOKUP($A33,FB_14,2,0))&IF(TYPE(VLOOKUP($A33,FB_15,2,0))=16,\"\",VLOOKUP($A33,FB_15,2,0))&IF(TYPE(VLOOKUP($A33,FB_16,2,0))=16,\"\",VLOOKUP($A33,FB_16,2,0))&IF(TYPE(VLOOKUP($A33,FB_17,2,0))=16,\"\",VLOOKUP($A33,FB_17,2,0))&IF(TYPE(VLOOKUP($A33,FB_18,2,0))=16,\"\",VLOOKUP($A33,FB_18,2,0))&IF(TYPE(VLOOKUP($A33,FB_19,2,0))=16,\"\",VLOOKUP($A33,FB_19,2,0))&IF(TYPE(VLOOKUP($A33,FB_20,2,0))=16,\"\",VLOOKUP($A33,FB_20,2,0))&IF(TYPE(VLOOKUP($A33,FB_21,2,0))=16,\"\",VLOOKUP($A33,FB_21,2,0))&IF(TYPE(VLOOKUP($A33,FB_22,2,0))=16,\"\",VLOOKUP($A33,FB_22,2,0))&IF(TYPE(VLOOKUP($A33,FB_23,2,0))=16,\"\",VLOOKUP($A33,FB_23,2,0))&IF(TYPE(VLOOKUP($A33,FB_24,2,0))=16,\"\",VLOOKUP($A33,FB_24,2,0))&IF(TYPE(VLOOKUP($A33,FB_25,2,0))=16,\"\",VLOOKUP($A33,FB_25,2,0))&IF(TYPE(VLOOKUP($A33,FB_26,2,0))=16,\"\",VLOOKUP($A33,FB_26,2,0))&IF(TYPE(VLOOKUP($A33,FB_27,2,0))=16,\"\",VLOOKUP($A33,FB_27,2,0))&IF(TYPE(VLOOKUP($A33,FB_28,2,0))=16,\"\",VLOOKUP($A33,FB_28,2,0))&IF(TYPE(VLOOKUP($A33,FB_29,2,0))=16,\"\",VLOOKUP($A33,FB_29,2,0))&IF(TYPE(VLOOKUP($A33,FB_30,2,0))=16,\"\",VLOOKUP($A33,FB_30,2,0))","v":""},null,{"$f":"IF($B33=\"\",\"\",_xlfn.NUMBERVALUE(IF(TYPE(VLOOKUP($A33,FB_1,P$5,0))=16,\"\",VLOOKUP($A33,FB_1,P$5,0))&IF(TYPE(VLOOKUP($A33,FB_2,P$5,0))=16,\"\",VLOOKUP($A33,FB_2,P$5,0))&IF(TYPE(VLOOKUP($A33,FB_3,P$5,0))=16,\"\",VLOOKUP($A33,FB_3,P$5,0))&IF(TYPE(VLOOKUP($A33,FB_4,P$5,0))=16,\"\",VLOOKUP($A33,FB_4,P$5,0))&IF(TYPE(VLOOKUP($A33,FB_5,P$5,0))=16,\"\",VLOOKUP($A33,FB_5,P$5,0))&IF(TYPE(VLOOKUP($A33,FB_6,P$5,0))=16,\"\",VLOOKUP($A33,FB_6,P$5,0))&IF(TYPE(VLOOKUP($A33,FB_7,P$5,0))=16,\"\",VLOOKUP($A33,FB_7,P$5,0))&IF(TYPE(VLOOKUP($A33,FB_8,P$5,0))=16,\"\",VLOOKUP($A33,FB_8,P$5,0))&IF(TYPE(VLOOKUP($A33,FB_9,P$5,0))=16,\"\",VLOOKUP($A33,FB_9,P$5,0))&IF(TYPE(VLOOKUP($A33,FB_10,P$5,0))=16,\"\",VLOOKUP($A33,FB_10,P$5,0))&IF(TYPE(VLOOKUP($A33,FB_11,P$5,0))=16,\"\",VLOOKUP($A33,FB_11,P$5,0))&IF(TYPE(VLOOKUP($A33,FB_12,P$5,0))=16,\"\",VLOOKUP($A33,FB_12,P$5,0))&IF(TYPE(VLOOKUP($A33,FB_13,P$5,0))=16,\"\",VLOOKUP($A33,FB_13,P$5,0))&IF(TYPE(VLOOKUP($A33,FB_14,P$5,0))=16,\"\",VLOOKUP($A33,FB_14,P$5,0))&IF(TYPE(VLOOKUP($A33,FB_15,P$5,0))=16,\"\",VLOOKUP($A33,FB_15,P$5,0))&IF(TYPE(VLOOKUP($A33,FB_16,P$5,0))=16,\"\",VLOOKUP($A33,FB_16,P$5,0))&IF(TYPE(VLOOKUP($A33,FB_17,P$5,0))=16,\"\",VLOOKUP($A33,FB_17,P$5,0))&IF(TYPE(VLOOKUP($A33,FB_18,P$5,0))=16,\"\",VLOOKUP($A33,FB_18,P$5,0))&IF(TYPE(VLOOKUP($A33,FB_19,P$5,0))=16,\"\",VLOOKUP($A33,FB_19,P$5,0))&IF(TYPE(VLOOKUP($A33,FB_20,P$5,0))=16,\"\",VLOOKUP($A33,FB_20,P$5,0))&IF(TYPE(VLOOKUP($A33,FB_21,P$5,0))=16,\"\",VLOOKUP($A33,FB_21,P$5,0))&IF(TYPE(VLOOKUP($A33,FB_22,P$5,0))=16,\"\",VLOOKUP($A33,FB_22,P$5,0))&IF(TYPE(VLOOKUP($A33,FB_23,P$5,0))=16,\"\",VLOOKUP($A33,FB_23,P$5,0))&IF(TYPE(VLOOKUP($A33,FB_24,P$5,0))=16,\"\",VLOOKUP($A33,FB_24,P$5,0))&IF(TYPE(VLOOKUP($A33,FB_25,P$5,0))=16,\"\",VLOOKUP($A33,FB_25,P$5,0))&IF(TYPE(VLOOKUP($A33,FB_26,P$5,0))=16,\"\",VLOOKUP($A33,FB_26,P$5,0))&IF(TYPE(VLOOKUP($A33,FB_27,P$5,0))=16,\"\",VLOOKUP($A33,FB_27,P$5,0))&IF(TYPE(VLOOKUP($A33,FB_28,P$5,0))=16,\"\",VLOOKUP($A33,FB_28,P$5,0))&IF(TYPE(VLOOKUP($A33,FB_29,P$5,0))=16,\"\",VLOOKUP($A33,FB_29,P$5,0))&IF(TYPE(VLOOKUP($A33,FB_30,P$5,0))=16,\"\",VLOOKUP($A33,FB_30,P$5,0))))","v":""},"",{"$f":"IF($B33=\"\",\"\",_xlfn.NUMBERVALUE(IF(TYPE(VLOOKUP($A33,FB_1,R$5,0))=16,\"\",VLOOKUP($A33,FB_1,R$5,0))&IF(TYPE(VLOOKUP($A33,FB_2,R$5,0))=16,\"\",VLOOKUP($A33,FB_2,R$5,0))&IF(TYPE(VLOOKUP($A33,FB_3,R$5,0))=16,\"\",VLOOKUP($A33,FB_3,R$5,0))&IF(TYPE(VLOOKUP($A33,FB_4,R$5,0))=16,\"\",VLOOKUP($A33,FB_4,R$5,0))&IF(TYPE(VLOOKUP($A33,FB_5,R$5,0))=16,\"\",VLOOKUP($A33,FB_5,R$5,0))&IF(TYPE(VLOOKUP($A33,FB_6,R$5,0))=16,\"\",VLOOKUP($A33,FB_6,R$5,0))&IF(TYPE(VLOOKUP($A33,FB_7,R$5,0))=16,\"\",VLOOKUP($A33,FB_7,R$5,0))&IF(TYPE(VLOOKUP($A33,FB_8,R$5,0))=16,\"\",VLOOKUP($A33,FB_8,R$5,0))&IF(TYPE(VLOOKUP($A33,FB_9,R$5,0))=16,\"\",VLOOKUP($A33,FB_9,R$5,0))&IF(TYPE(VLOOKUP($A33,FB_10,R$5,0))=16,\"\",VLOOKUP($A33,FB_10,R$5,0))&IF(TYPE(VLOOKUP($A33,FB_11,R$5,0))=16,\"\",VLOOKUP($A33,FB_11,R$5,0))&IF(TYPE(VLOOKUP($A33,FB_12,R$5,0))=16,\"\",VLOOKUP($A33,FB_12,R$5,0))&IF(TYPE(VLOOKUP($A33,FB_13,R$5,0))=16,\"\",VLOOKUP($A33,FB_13,R$5,0))&IF(TYPE(VLOOKUP($A33,FB_14,R$5,0))=16,\"\",VLOOKUP($A33,FB_14,R$5,0))&IF(TYPE(VLOOKUP($A33,FB_15,R$5,0))=16,\"\",VLOOKUP($A33,FB_15,R$5,0))&IF(TYPE(VLOOKUP($A33,FB_16,R$5,0))=16,\"\",VLOOKUP($A33,FB_16,R$5,0))&IF(TYPE(VLOOKUP($A33,FB_17,R$5,0))=16,\"\",VLOOKUP($A33,FB_17,R$5,0))&IF(TYPE(VLOOKUP($A33,FB_18,R$5,0))=16,\"\",VLOOKUP($A33,FB_18,R$5,0))&IF(TYPE(VLOOKUP($A33,FB_19,R$5,0))=16,\"\",VLOOKUP($A33,FB_19,R$5,0))&IF(TYPE(VLOOKUP($A33,FB_20,R$5,0))=16,\"\",VLOOKUP($A33,FB_20,R$5,0))&IF(TYPE(VLOOKUP($A33,FB_21,R$5,0))=16,\"\",VLOOKUP($A33,FB_21,R$5,0))&IF(TYPE(VLOOKUP($A33,FB_22,R$5,0))=16,\"\",VLOOKUP($A33,FB_22,R$5,0))&IF(TYPE(VLOOKUP($A33,FB_23,R$5,0))=16,\"\",VLOOKUP($A33,FB_23,R$5,0))&IF(TYPE(VLOOKUP($A33,FB_24,R$5,0))=16,\"\",VLOOKUP($A33,FB_24,R$5,0))&IF(TYPE(VLOOKUP($A33,FB_25,R$5,0))=16,\"\",VLOOKUP($A33,FB_25,R$5,0))&IF(TYPE(VLOOKUP($A33,FB_26,R$5,0))=16,\"\",VLOOKUP($A33,FB_26,R$5,0))&IF(TYPE(VLOOKUP($A33,FB_27,R$5,0))=16,\"\",VLOOKUP($A33,FB_27,R$5,0))&IF(TYPE(VLOOKUP($A33,FB_28,R$5,0))=16,\"\",VLOOKUP($A33,FB_28,R$5,0))&IF(TYPE(VLOOKUP($A33,FB_29,R$5,0))=16,\"\",VLOOKUP($A33,FB_29,R$5,0))&IF(TYPE(VLOOKUP($A33,FB_30,R$5,0))=16,\"\",VLOOKUP($A33,FB_30,R$5,0))))","v":""},{"$f":"IF($B33=\"\",\"\",IF(TYPE(VLOOKUP($A33,FB_1,S$5,0))=16,\"\",VLOOKUP($A33,FB_1,S$5,0))&IF(TYPE(VLOOKUP($A33,FB_2,S$5,0))=16,\"\",VLOOKUP($A33,FB_2,S$5,0))&IF(TYPE(VLOOKUP($A33,FB_3,S$5,0))=16,\"\",VLOOKUP($A33,FB_3,S$5,0))&IF(TYPE(VLOOKUP($A33,FB_4,S$5,0))=16,\"\",VLOOKUP($A33,FB_4,S$5,0))&IF(TYPE(VLOOKUP($A33,FB_5,S$5,0))=16,\"\",VLOOKUP($A33,FB_5,S$5,0))&IF(TYPE(VLOOKUP($A33,FB_6,S$5,0))=16,\"\",VLOOKUP($A33,FB_6,S$5,0))&IF(TYPE(VLOOKUP($A33,FB_7,S$5,0))=16,\"\",VLOOKUP($A33,FB_7,S$5,0))&IF(TYPE(VLOOKUP($A33,FB_8,S$5,0))=16,\"\",VLOOKUP($A33,FB_8,S$5,0))&IF(TYPE(VLOOKUP($A33,FB_9,S$5,0))=16,\"\",VLOOKUP($A33,FB_9,S$5,0))&IF(TYPE(VLOOKUP($A33,FB_10,S$5,0))=16,\"\",VLOOKUP($A33,FB_10,S$5,0))&IF(TYPE(VLOOKUP($A33,FB_11,S$5,0))=16,\"\",VLOOKUP($A33,FB_11,S$5,0))&IF(TYPE(VLOOKUP($A33,FB_12,S$5,0))=16,\"\",VLOOKUP($A33,FB_12,S$5,0))&IF(TYPE(VLOOKUP($A33,FB_13,S$5,0))=16,\"\",VLOOKUP($A33,FB_13,S$5,0))&IF(TYPE(VLOOKUP($A33,FB_14,S$5,0))=16,\"\",VLOOKUP($A33,FB_14,S$5,0))&IF(TYPE(VLOOKUP($A33,FB_15,S$5,0))=16,\"\",VLOOKUP($A33,FB_15,S$5,0))&IF(TYPE(VLOOKUP($A33,FB_16,S$5,0))=16,\"\",VLOOKUP($A33,FB_16,S$5,0))&IF(TYPE(VLOOKUP($A33,FB_17,S$5,0))=16,\"\",VLOOKUP($A33,FB_17,S$5,0))&IF(TYPE(VLOOKUP($A33,FB_18,S$5,0))=16,\"\",VLOOKUP($A33,FB_18,S$5,0))&IF(TYPE(VLOOKUP($A33,FB_19,S$5,0))=16,\"\",VLOOKUP($A33,FB_19,S$5,0))&IF(TYPE(VLOOKUP($A33,FB_20,S$5,0))=16,\"\",VLOOKUP($A33,FB_20,S$5,0))&IF(TYPE(VLOOKUP($A33,FB_21,S$5,0))=16,\"\",VLOOKUP($A33,FB_21,S$5,0))&IF(TYPE(VLOOKUP($A33,FB_22,S$5,0))=16,\"\",VLOOKUP($A33,FB_22,S$5,0))&IF(TYPE(VLOOKUP($A33,FB_23,S$5,0))=16,\"\",VLOOKUP($A33,FB_23,S$5,0))&IF(TYPE(VLOOKUP($A33,FB_24,S$5,0))=16,\"\",VLOOKUP($A33,FB_24,S$5,0))&IF(TYPE(VLOOKUP($A33,FB_25,S$5,0))=16,\"\",VLOOKUP($A33,FB_25,S$5,0))&IF(TYPE(VLOOKUP($A33,FB_26,S$5,0))=16,\"\",VLOOKUP($A33,FB_26,S$5,0))&IF(TYPE(VLOOKUP($A33,FB_27,S$5,0))=16,\"\",VLOOKUP($A33,FB_27,S$5,0))&IF(TYPE(VLOOKUP($A33,FB_28,S$5,0))=16,\"\",VLOOKUP($A33,FB_28,S$5,0))&IF(TYPE(VLOOKUP($A33,FB_29,S$5,0))=16,\"\",VLOOKUP($A33,FB_29,S$5,0))&IF(TYPE(VLOOKUP($A33,FB_30,S$5,0))=16,\"\",VLOOKUP($A33,FB_30,S$5,0)))","v":""},null,null,null,null,null,null,null,null,null,null,null,null,null,null,null,null,"",":","","",""]
["5.",{"$f":"IF(TYPE(VLOOKUP($A34,FB_1,2,0))=16,\"\",VLOOKUP($A34,FB_1,2,0))&IF(TYPE(VLOOKUP($A34,FB_2,2,0))=16,\"\",VLOOKUP($A34,FB_2,2,0))&IF(TYPE(VLOOKUP($A34,FB_3,2,0))=16,\"\",VLOOKUP($A34,FB_3,2,0))&IF(TYPE(VLOOKUP($A34,FB_4,2,0))=16,\"\",VLOOKUP($A34,FB_4,2,0))&IF(TYPE(VLOOKUP($A34,FB_5,2,0))=16,\"\",VLOOKUP($A34,FB_5,2,0))&IF(TYPE(VLOOKUP($A34,FB_6,2,0))=16,\"\",VLOOKUP($A34,FB_6,2,0))&IF(TYPE(VLOOKUP($A34,FB_7,2,0))=16,\"\",VLOOKUP($A34,FB_7,2,0))&IF(TYPE(VLOOKUP($A34,FB_8,2,0))=16,\"\",VLOOKUP($A34,FB_8,2,0))&IF(TYPE(VLOOKUP($A34,FB_9,2,0))=16,\"\",VLOOKUP($A34,FB_9,2,0))&IF(TYPE(VLOOKUP($A34,FB_10,2,0))=16,\"\",VLOOKUP($A34,FB_10,2,0))&IF(TYPE(VLOOKUP($A34,FB_11,2,0))=16,\"\",VLOOKUP($A34,FB_11,2,0))&IF(TYPE(VLOOKUP($A34,FB_12,2,0))=16,\"\",VLOOKUP($A34,FB_12,2,0))&IF(TYPE(VLOOKUP($A34,FB_13,2,0))=16,\"\",VLOOKUP($A34,FB_13,2,0))&IF(TYPE(VLOOKUP($A34,FB_14,2,0))=16,\"\",VLOOKUP($A34,FB_14,2,0))&IF(TYPE(VLOOKUP($A34,FB_15,2,0))=16,\"\",VLOOKUP($A34,FB_15,2,0))&IF(TYPE(VLOOKUP($A34,FB_16,2,0))=16,\"\",VLOOKUP($A34,FB_16,2,0))&IF(TYPE(VLOOKUP($A34,FB_17,2,0))=16,\"\",VLOOKUP($A34,FB_17,2,0))&IF(TYPE(VLOOKUP($A34,FB_18,2,0))=16,\"\",VLOOKUP($A34,FB_18,2,0))&IF(TYPE(VLOOKUP($A34,FB_19,2,0))=16,\"\",VLOOKUP($A34,FB_19,2,0))&IF(TYPE(VLOOKUP($A34,FB_20,2,0))=16,\"\",VLOOKUP($A34,FB_20,2,0))&IF(TYPE(VLOOKUP($A34,FB_21,2,0))=16,\"\",VLOOKUP($A34,FB_21,2,0))&IF(TYPE(VLOOKUP($A34,FB_22,2,0))=16,\"\",VLOOKUP($A34,FB_22,2,0))&IF(TYPE(VLOOKUP($A34,FB_23,2,0))=16,\"\",VLOOKUP($A34,FB_23,2,0))&IF(TYPE(VLOOKUP($A34,FB_24,2,0))=16,\"\",VLOOKUP($A34,FB_24,2,0))&IF(TYPE(VLOOKUP($A34,FB_25,2,0))=16,\"\",VLOOKUP($A34,FB_25,2,0))&IF(TYPE(VLOOKUP($A34,FB_26,2,0))=16,\"\",VLOOKUP($A34,FB_26,2,0))&IF(TYPE(VLOOKUP($A34,FB_27,2,0))=16,\"\",VLOOKUP($A34,FB_27,2,0))&IF(TYPE(VLOOKUP($A34,FB_28,2,0))=16,\"\",VLOOKUP($A34,FB_28,2,0))&IF(TYPE(VLOOKUP($A34,FB_29,2,0))=16,\"\",VLOOKUP($A34,FB_29,2,0))&IF(TYPE(VLOOKUP($A34,FB_30,2,0))=16,\"\",VLOOKUP($A34,FB_30,2,0))","v":""},null,{"$f":"IF($B34=\"\",\"\",_xlfn.NUMBERVALUE(IF(TYPE(VLOOKUP($A34,FB_1,P$5,0))=16,\"\",VLOOKUP($A34,FB_1,P$5,0))&IF(TYPE(VLOOKUP($A34,FB_2,P$5,0))=16,\"\",VLOOKUP($A34,FB_2,P$5,0))&IF(TYPE(VLOOKUP($A34,FB_3,P$5,0))=16,\"\",VLOOKUP($A34,FB_3,P$5,0))&IF(TYPE(VLOOKUP($A34,FB_4,P$5,0))=16,\"\",VLOOKUP($A34,FB_4,P$5,0))&IF(TYPE(VLOOKUP($A34,FB_5,P$5,0))=16,\"\",VLOOKUP($A34,FB_5,P$5,0))&IF(TYPE(VLOOKUP($A34,FB_6,P$5,0))=16,\"\",VLOOKUP($A34,FB_6,P$5,0))&IF(TYPE(VLOOKUP($A34,FB_7,P$5,0))=16,\"\",VLOOKUP($A34,FB_7,P$5,0))&IF(TYPE(VLOOKUP($A34,FB_8,P$5,0))=16,\"\",VLOOKUP($A34,FB_8,P$5,0))&IF(TYPE(VLOOKUP($A34,FB_9,P$5,0))=16,\"\",VLOOKUP($A34,FB_9,P$5,0))&IF(TYPE(VLOOKUP($A34,FB_10,P$5,0))=16,\"\",VLOOKUP($A34,FB_10,P$5,0))&IF(TYPE(VLOOKUP($A34,FB_11,P$5,0))=16,\"\",VLOOKUP($A34,FB_11,P$5,0))&IF(TYPE(VLOOKUP($A34,FB_12,P$5,0))=16,\"\",VLOOKUP($A34,FB_12,P$5,0))&IF(TYPE(VLOOKUP($A34,FB_13,P$5,0))=16,\"\",VLOOKUP($A34,FB_13,P$5,0))&IF(TYPE(VLOOKUP($A34,FB_14,P$5,0))=16,\"\",VLOOKUP($A34,FB_14,P$5,0))&IF(TYPE(VLOOKUP($A34,FB_15,P$5,0))=16,\"\",VLOOKUP($A34,FB_15,P$5,0))&IF(TYPE(VLOOKUP($A34,FB_16,P$5,0))=16,\"\",VLOOKUP($A34,FB_16,P$5,0))&IF(TYPE(VLOOKUP($A34,FB_17,P$5,0))=16,\"\",VLOOKUP($A34,FB_17,P$5,0))&IF(TYPE(VLOOKUP($A34,FB_18,P$5,0))=16,\"\",VLOOKUP($A34,FB_18,P$5,0))&IF(TYPE(VLOOKUP($A34,FB_19,P$5,0))=16,\"\",VLOOKUP($A34,FB_19,P$5,0))&IF(TYPE(VLOOKUP($A34,FB_20,P$5,0))=16,\"\",VLOOKUP($A34,FB_20,P$5,0))&IF(TYPE(VLOOKUP($A34,FB_21,P$5,0))=16,\"\",VLOOKUP($A34,FB_21,P$5,0))&IF(TYPE(VLOOKUP($A34,FB_22,P$5,0))=16,\"\",VLOOKUP($A34,FB_22,P$5,0))&IF(TYPE(VLOOKUP($A34,FB_23,P$5,0))=16,\"\",VLOOKUP($A34,FB_23,P$5,0))&IF(TYPE(VLOOKUP($A34,FB_24,P$5,0))=16,\"\",VLOOKUP($A34,FB_24,P$5,0))&IF(TYPE(VLOOKUP($A34,FB_25,P$5,0))=16,\"\",VLOOKUP($A34,FB_25,P$5,0))&IF(TYPE(VLOOKUP($A34,FB_26,P$5,0))=16,\"\",VLOOKUP($A34,FB_26,P$5,0))&IF(TYPE(VLOOKUP($A34,FB_27,P$5,0))=16,\"\",VLOOKUP($A34,FB_27,P$5,0))&IF(TYPE(VLOOKUP($A34,FB_28,P$5,0))=16,\"\",VLOOKUP($A34,FB_28,P$5,0))&IF(TYPE(VLOOKUP($A34,FB_29,P$5,0))=16,\"\",VLOOKUP($A34,FB_29,P$5,0))&IF(TYPE(VLOOKUP($A34,FB_30,P$5,0))=16,\"\",VLOOKUP($A34,FB_30,P$5,0))))","v":""},"",{"$f":"IF($B34=\"\",\"\",_xlfn.NUMBERVALUE(IF(TYPE(VLOOKUP($A34,FB_1,R$5,0))=16,\"\",VLOOKUP($A34,FB_1,R$5,0))&IF(TYPE(VLOOKUP($A34,FB_2,R$5,0))=16,\"\",VLOOKUP($A34,FB_2,R$5,0))&IF(TYPE(VLOOKUP($A34,FB_3,R$5,0))=16,\"\",VLOOKUP($A34,FB_3,R$5,0))&IF(TYPE(VLOOKUP($A34,FB_4,R$5,0))=16,\"\",VLOOKUP($A34,FB_4,R$5,0))&IF(TYPE(VLOOKUP($A34,FB_5,R$5,0))=16,\"\",VLOOKUP($A34,FB_5,R$5,0))&IF(TYPE(VLOOKUP($A34,FB_6,R$5,0))=16,\"\",VLOOKUP($A34,FB_6,R$5,0))&IF(TYPE(VLOOKUP($A34,FB_7,R$5,0))=16,\"\",VLOOKUP($A34,FB_7,R$5,0))&IF(TYPE(VLOOKUP($A34,FB_8,R$5,0))=16,\"\",VLOOKUP($A34,FB_8,R$5,0))&IF(TYPE(VLOOKUP($A34,FB_9,R$5,0))=16,\"\",VLOOKUP($A34,FB_9,R$5,0))&IF(TYPE(VLOOKUP($A34,FB_10,R$5,0))=16,\"\",VLOOKUP($A34,FB_10,R$5,0))&IF(TYPE(VLOOKUP($A34,FB_11,R$5,0))=16,\"\",VLOOKUP($A34,FB_11,R$5,0))&IF(TYPE(VLOOKUP($A34,FB_12,R$5,0))=16,\"\",VLOOKUP($A34,FB_12,R$5,0))&IF(TYPE(VLOOKUP($A34,FB_13,R$5,0))=16,\"\",VLOOKUP($A34,FB_13,R$5,0))&IF(TYPE(VLOOKUP($A34,FB_14,R$5,0))=16,\"\",VLOOKUP($A34,FB_14,R$5,0))&IF(TYPE(VLOOKUP($A34,FB_15,R$5,0))=16,\"\",VLOOKUP($A34,FB_15,R$5,0))&IF(TYPE(VLOOKUP($A34,FB_16,R$5,0))=16,\"\",VLOOKUP($A34,FB_16,R$5,0))&IF(TYPE(VLOOKUP($A34,FB_17,R$5,0))=16,\"\",VLOOKUP($A34,FB_17,R$5,0))&IF(TYPE(VLOOKUP($A34,FB_18,R$5,0))=16,\"\",VLOOKUP($A34,FB_18,R$5,0))&IF(TYPE(VLOOKUP($A34,FB_19,R$5,0))=16,\"\",VLOOKUP($A34,FB_19,R$5,0))&IF(TYPE(VLOOKUP($A34,FB_20,R$5,0))=16,\"\",VLOOKUP($A34,FB_20,R$5,0))&IF(TYPE(VLOOKUP($A34,FB_21,R$5,0))=16,\"\",VLOOKUP($A34,FB_21,R$5,0))&IF(TYPE(VLOOKUP($A34,FB_22,R$5,0))=16,\"\",VLOOKUP($A34,FB_22,R$5,0))&IF(TYPE(VLOOKUP($A34,FB_23,R$5,0))=16,\"\",VLOOKUP($A34,FB_23,R$5,0))&IF(TYPE(VLOOKUP($A34,FB_24,R$5,0))=16,\"\",VLOOKUP($A34,FB_24,R$5,0))&IF(TYPE(VLOOKUP($A34,FB_25,R$5,0))=16,\"\",VLOOKUP($A34,FB_25,R$5,0))&IF(TYPE(VLOOKUP($A34,FB_26,R$5,0))=16,\"\",VLOOKUP($A34,FB_26,R$5,0))&IF(TYPE(VLOOKUP($A34,FB_27,R$5,0))=16,\"\",VLOOKUP($A34,FB_27,R$5,0))&IF(TYPE(VLOOKUP($A34,FB_28,R$5,0))=16,\"\",VLOOKUP($A34,FB_28,R$5,0))&IF(TYPE(VLOOKUP($A34,FB_29,R$5,0))=16,\"\",VLOOKUP($A34,FB_29,R$5,0))&IF(TYPE(VLOOKUP($A34,FB_30,R$5,0))=16,\"\",VLOOKUP($A34,FB_30,R$5,0))))","v":""},{"$f":"IF($B34=\"\",\"\",IF(TYPE(VLOOKUP($A34,FB_1,S$5,0))=16,\"\",VLOOKUP($A34,FB_1,S$5,0))&IF(TYPE(VLOOKUP($A34,FB_2,S$5,0))=16,\"\",VLOOKUP($A34,FB_2,S$5,0))&IF(TYPE(VLOOKUP($A34,FB_3,S$5,0))=16,\"\",VLOOKUP($A34,FB_3,S$5,0))&IF(TYPE(VLOOKUP($A34,FB_4,S$5,0))=16,\"\",VLOOKUP($A34,FB_4,S$5,0))&IF(TYPE(VLOOKUP($A34,FB_5,S$5,0))=16,\"\",VLOOKUP($A34,FB_5,S$5,0))&IF(TYPE(VLOOKUP($A34,FB_6,S$5,0))=16,\"\",VLOOKUP($A34,FB_6,S$5,0))&IF(TYPE(VLOOKUP($A34,FB_7,S$5,0))=16,\"\",VLOOKUP($A34,FB_7,S$5,0))&IF(TYPE(VLOOKUP($A34,FB_8,S$5,0))=16,\"\",VLOOKUP($A34,FB_8,S$5,0))&IF(TYPE(VLOOKUP($A34,FB_9,S$5,0))=16,\"\",VLOOKUP($A34,FB_9,S$5,0))&IF(TYPE(VLOOKUP($A34,FB_10,S$5,0))=16,\"\",VLOOKUP($A34,FB_10,S$5,0))&IF(TYPE(VLOOKUP($A34,FB_11,S$5,0))=16,\"\",VLOOKUP($A34,FB_11,S$5,0))&IF(TYPE(VLOOKUP($A34,FB_12,S$5,0))=16,\"\",VLOOKUP($A34,FB_12,S$5,0))&IF(TYPE(VLOOKUP($A34,FB_13,S$5,0))=16,\"\",VLOOKUP($A34,FB_13,S$5,0))&IF(TYPE(VLOOKUP($A34,FB_14,S$5,0))=16,\"\",VLOOKUP($A34,FB_14,S$5,0))&IF(TYPE(VLOOKUP($A34,FB_15,S$5,0))=16,\"\",VLOOKUP($A34,FB_15,S$5,0))&IF(TYPE(VLOOKUP($A34,FB_16,S$5,0))=16,\"\",VLOOKUP($A34,FB_16,S$5,0))&IF(TYPE(VLOOKUP($A34,FB_17,S$5,0))=16,\"\",VLOOKUP($A34,FB_17,S$5,0))&IF(TYPE(VLOOKUP($A34,FB_18,S$5,0))=16,\"\",VLOOKUP($A34,FB_18,S$5,0))&IF(TYPE(VLOOKUP($A34,FB_19,S$5,0))=16,\"\",VLOOKUP($A34,FB_19,S$5,0))&IF(TYPE(VLOOKUP($A34,FB_20,S$5,0))=16,\"\",VLOOKUP($A34,FB_20,S$5,0))&IF(TYPE(VLOOKUP($A34,FB_21,S$5,0))=16,\"\",VLOOKUP($A34,FB_21,S$5,0))&IF(TYPE(VLOOKUP($A34,FB_22,S$5,0))=16,\"\",VLOOKUP($A34,FB_22,S$5,0))&IF(TYPE(VLOOKUP($A34,FB_23,S$5,0))=16,\"\",VLOOKUP($A34,FB_23,S$5,0))&IF(TYPE(VLOOKUP($A34,FB_24,S$5,0))=16,\"\",VLOOKUP($A34,FB_24,S$5,0))&IF(TYPE(VLOOKUP($A34,FB_25,S$5,0))=16,\"\",VLOOKUP($A34,FB_25,S$5,0))&IF(TYPE(VLOOKUP($A34,FB_26,S$5,0))=16,\"\",VLOOKUP($A34,FB_26,S$5,0))&IF(TYPE(VLOOKUP($A34,FB_27,S$5,0))=16,\"\",VLOOKUP($A34,FB_27,S$5,0))&IF(TYPE(VLOOKUP($A34,FB_28,S$5,0))=16,\"\",VLOOKUP($A34,FB_28,S$5,0))&IF(TYPE(VLOOKUP($A34,FB_29,S$5,0))=16,\"\",VLOOKUP($A34,FB_29,S$5,0))&IF(TYPE(VLOOKUP($A34,FB_30,S$5,0))=16,\"\",VLOOKUP($A34,FB_30,S$5,0)))","v":""},null,null,null,null,null,null,null,null,null,null,null,null,null,null,null,null,"",":","","",""]
["6.",{"$f":"IF(TYPE(VLOOKUP($A35,FB_1,2,0))=16,\"\",VLOOKUP($A35,FB_1,2,0))&IF(TYPE(VLOOKUP($A35,FB_2,2,0))=16,\"\",VLOOKUP($A35,FB_2,2,0))&IF(TYPE(VLOOKUP($A35,FB_3,2,0))=16,\"\",VLOOKUP($A35,FB_3,2,0))&IF(TYPE(VLOOKUP($A35,FB_4,2,0))=16,\"\",VLOOKUP($A35,FB_4,2,0))&IF(TYPE(VLOOKUP($A35,FB_5,2,0))=16,\"\",VLOOKUP($A35,FB_5,2,0))&IF(TYPE(VLOOKUP($A35,FB_6,2,0))=16,\"\",VLOOKUP($A35,FB_6,2,0))&IF(TYPE(VLOOKUP($A35,FB_7,2,0))=16,\"\",VLOOKUP($A35,FB_7,2,0))&IF(TYPE(VLOOKUP($A35,FB_8,2,0))=16,\"\",VLOOKUP($A35,FB_8,2,0))&IF(TYPE(VLOOKUP($A35,FB_9,2,0))=16,\"\",VLOOKUP($A35,FB_9,2,0))&IF(TYPE(VLOOKUP($A35,FB_10,2,0))=16,\"\",VLOOKUP($A35,FB_10,2,0))&IF(TYPE(VLOOKUP($A35,FB_11,2,0))=16,\"\",VLOOKUP($A35,FB_11,2,0))&IF(TYPE(VLOOKUP($A35,FB_12,2,0))=16,\"\",VLOOKUP($A35,FB_12,2,0))&IF(TYPE(VLOOKUP($A35,FB_13,2,0))=16,\"\",VLOOKUP($A35,FB_13,2,0))&IF(TYPE(VLOOKUP($A35,FB_14,2,0))=16,\"\",VLOOKUP($A35,FB_14,2,0))&IF(TYPE(VLOOKUP($A35,FB_15,2,0))=16,\"\",VLOOKUP($A35,FB_15,2,0))&IF(TYPE(VLOOKUP($A35,FB_16,2,0))=16,\"\",VLOOKUP($A35,FB_16,2,0))&IF(TYPE(VLOOKUP($A35,FB_17,2,0))=16,\"\",VLOOKUP($A35,FB_17,2,0))&IF(TYPE(VLOOKUP($A35,FB_18,2,0))=16,\"\",VLOOKUP($A35,FB_18,2,0))&IF(TYPE(VLOOKUP($A35,FB_19,2,0))=16,\"\",VLOOKUP($A35,FB_19,2,0))&IF(TYPE(VLOOKUP($A35,FB_20,2,0))=16,\"\",VLOOKUP($A35,FB_20,2,0))&IF(TYPE(VLOOKUP($A35,FB_21,2,0))=16,\"\",VLOOKUP($A35,FB_21,2,0))&IF(TYPE(VLOOKUP($A35,FB_22,2,0))=16,\"\",VLOOKUP($A35,FB_22,2,0))&IF(TYPE(VLOOKUP($A35,FB_23,2,0))=16,\"\",VLOOKUP($A35,FB_23,2,0))&IF(TYPE(VLOOKUP($A35,FB_24,2,0))=16,\"\",VLOOKUP($A35,FB_24,2,0))&IF(TYPE(VLOOKUP($A35,FB_25,2,0))=16,\"\",VLOOKUP($A35,FB_25,2,0))&IF(TYPE(VLOOKUP($A35,FB_26,2,0))=16,\"\",VLOOKUP($A35,FB_26,2,0))&IF(TYPE(VLOOKUP($A35,FB_27,2,0))=16,\"\",VLOOKUP($A35,FB_27,2,0))&IF(TYPE(VLOOKUP($A35,FB_28,2,0))=16,\"\",VLOOKUP($A35,FB_28,2,0))&IF(TYPE(VLOOKUP($A35,FB_29,2,0))=16,\"\",VLOOKUP($A35,FB_29,2,0))&IF(TYPE(VLOOKUP($A35,FB_30,2,0))=16,\"\",VLOOKUP($A35,FB_30,2,0))","v":""},null,{"$f":"IF($B35=\"\",\"\",_xlfn.NUMBERVALUE(IF(TYPE(VLOOKUP($A35,FB_1,P$5,0))=16,\"\",VLOOKUP($A35,FB_1,P$5,0))&IF(TYPE(VLOOKUP($A35,FB_2,P$5,0))=16,\"\",VLOOKUP($A35,FB_2,P$5,0))&IF(TYPE(VLOOKUP($A35,FB_3,P$5,0))=16,\"\",VLOOKUP($A35,FB_3,P$5,0))&IF(TYPE(VLOOKUP($A35,FB_4,P$5,0))=16,\"\",VLOOKUP($A35,FB_4,P$5,0))&IF(TYPE(VLOOKUP($A35,FB_5,P$5,0))=16,\"\",VLOOKUP($A35,FB_5,P$5,0))&IF(TYPE(VLOOKUP($A35,FB_6,P$5,0))=16,\"\",VLOOKUP($A35,FB_6,P$5,0))&IF(TYPE(VLOOKUP($A35,FB_7,P$5,0))=16,\"\",VLOOKUP($A35,FB_7,P$5,0))&IF(TYPE(VLOOKUP($A35,FB_8,P$5,0))=16,\"\",VLOOKUP($A35,FB_8,P$5,0))&IF(TYPE(VLOOKUP($A35,FB_9,P$5,0))=16,\"\",VLOOKUP($A35,FB_9,P$5,0))&IF(TYPE(VLOOKUP($A35,FB_10,P$5,0))=16,\"\",VLOOKUP($A35,FB_10,P$5,0))&IF(TYPE(VLOOKUP($A35,FB_11,P$5,0))=16,\"\",VLOOKUP($A35,FB_11,P$5,0))&IF(TYPE(VLOOKUP($A35,FB_12,P$5,0))=16,\"\",VLOOKUP($A35,FB_12,P$5,0))&IF(TYPE(VLOOKUP($A35,FB_13,P$5,0))=16,\"\",VLOOKUP($A35,FB_13,P$5,0))&IF(TYPE(VLOOKUP($A35,FB_14,P$5,0))=16,\"\",VLOOKUP($A35,FB_14,P$5,0))&IF(TYPE(VLOOKUP($A35,FB_15,P$5,0))=16,\"\",VLOOKUP($A35,FB_15,P$5,0))&IF(TYPE(VLOOKUP($A35,FB_16,P$5,0))=16,\"\",VLOOKUP($A35,FB_16,P$5,0))&IF(TYPE(VLOOKUP($A35,FB_17,P$5,0))=16,\"\",VLOOKUP($A35,FB_17,P$5,0))&IF(TYPE(VLOOKUP($A35,FB_18,P$5,0))=16,\"\",VLOOKUP($A35,FB_18,P$5,0))&IF(TYPE(VLOOKUP($A35,FB_19,P$5,0))=16,\"\",VLOOKUP($A35,FB_19,P$5,0))&IF(TYPE(VLOOKUP($A35,FB_20,P$5,0))=16,\"\",VLOOKUP($A35,FB_20,P$5,0))&IF(TYPE(VLOOKUP($A35,FB_21,P$5,0))=16,\"\",VLOOKUP($A35,FB_21,P$5,0))&IF(TYPE(VLOOKUP($A35,FB_22,P$5,0))=16,\"\",VLOOKUP($A35,FB_22,P$5,0))&IF(TYPE(VLOOKUP($A35,FB_23,P$5,0))=16,\"\",VLOOKUP($A35,FB_23,P$5,0))&IF(TYPE(VLOOKUP($A35,FB_24,P$5,0))=16,\"\",VLOOKUP($A35,FB_24,P$5,0))&IF(TYPE(VLOOKUP($A35,FB_25,P$5,0))=16,\"\",VLOOKUP($A35,FB_25,P$5,0))&IF(TYPE(VLOOKUP($A35,FB_26,P$5,0))=16,\"\",VLOOKUP($A35,FB_26,P$5,0))&IF(TYPE(VLOOKUP($A35,FB_27,P$5,0))=16,\"\",VLOOKUP($A35,FB_27,P$5,0))&IF(TYPE(VLOOKUP($A35,FB_28,P$5,0))=16,\"\",VLOOKUP($A35,FB_28,P$5,0))&IF(TYPE(VLOOKUP($A35,FB_29,P$5,0))=16,\"\",VLOOKUP($A35,FB_29,P$5,0))&IF(TYPE(VLOOKUP($A35,FB_30,P$5,0))=16,\"\",VLOOKUP($A35,FB_30,P$5,0))))","v":""},"",{"$f":"IF($B35=\"\",\"\",_xlfn.NUMBERVALUE(IF(TYPE(VLOOKUP($A35,FB_1,R$5,0))=16,\"\",VLOOKUP($A35,FB_1,R$5,0))&IF(TYPE(VLOOKUP($A35,FB_2,R$5,0))=16,\"\",VLOOKUP($A35,FB_2,R$5,0))&IF(TYPE(VLOOKUP($A35,FB_3,R$5,0))=16,\"\",VLOOKUP($A35,FB_3,R$5,0))&IF(TYPE(VLOOKUP($A35,FB_4,R$5,0))=16,\"\",VLOOKUP($A35,FB_4,R$5,0))&IF(TYPE(VLOOKUP($A35,FB_5,R$5,0))=16,\"\",VLOOKUP($A35,FB_5,R$5,0))&IF(TYPE(VLOOKUP($A35,FB_6,R$5,0))=16,\"\",VLOOKUP($A35,FB_6,R$5,0))&IF(TYPE(VLOOKUP($A35,FB_7,R$5,0))=16,\"\",VLOOKUP($A35,FB_7,R$5,0))&IF(TYPE(VLOOKUP($A35,FB_8,R$5,0))=16,\"\",VLOOKUP($A35,FB_8,R$5,0))&IF(TYPE(VLOOKUP($A35,FB_9,R$5,0))=16,\"\",VLOOKUP($A35,FB_9,R$5,0))&IF(TYPE(VLOOKUP($A35,FB_10,R$5,0))=16,\"\",VLOOKUP($A35,FB_10,R$5,0))&IF(TYPE(VLOOKUP($A35,FB_11,R$5,0))=16,\"\",VLOOKUP($A35,FB_11,R$5,0))&IF(TYPE(VLOOKUP($A35,FB_12,R$5,0))=16,\"\",VLOOKUP($A35,FB_12,R$5,0))&IF(TYPE(VLOOKUP($A35,FB_13,R$5,0))=16,\"\",VLOOKUP($A35,FB_13,R$5,0))&IF(TYPE(VLOOKUP($A35,FB_14,R$5,0))=16,\"\",VLOOKUP($A35,FB_14,R$5,0))&IF(TYPE(VLOOKUP($A35,FB_15,R$5,0))=16,\"\",VLOOKUP($A35,FB_15,R$5,0))&IF(TYPE(VLOOKUP($A35,FB_16,R$5,0))=16,\"\",VLOOKUP($A35,FB_16,R$5,0))&IF(TYPE(VLOOKUP($A35,FB_17,R$5,0))=16,\"\",VLOOKUP($A35,FB_17,R$5,0))&IF(TYPE(VLOOKUP($A35,FB_18,R$5,0))=16,\"\",VLOOKUP($A35,FB_18,R$5,0))&IF(TYPE(VLOOKUP($A35,FB_19,R$5,0))=16,\"\",VLOOKUP($A35,FB_19,R$5,0))&IF(TYPE(VLOOKUP($A35,FB_20,R$5,0))=16,\"\",VLOOKUP($A35,FB_20,R$5,0))&IF(TYPE(VLOOKUP($A35,FB_21,R$5,0))=16,\"\",VLOOKUP($A35,FB_21,R$5,0))&IF(TYPE(VLOOKUP($A35,FB_22,R$5,0))=16,\"\",VLOOKUP($A35,FB_22,R$5,0))&IF(TYPE(VLOOKUP($A35,FB_23,R$5,0))=16,\"\",VLOOKUP($A35,FB_23,R$5,0))&IF(TYPE(VLOOKUP($A35,FB_24,R$5,0))=16,\"\",VLOOKUP($A35,FB_24,R$5,0))&IF(TYPE(VLOOKUP($A35,FB_25,R$5,0))=16,\"\",VLOOKUP($A35,FB_25,R$5,0))&IF(TYPE(VLOOKUP($A35,FB_26,R$5,0))=16,\"\",VLOOKUP($A35,FB_26,R$5,0))&IF(TYPE(VLOOKUP($A35,FB_27,R$5,0))=16,\"\",VLOOKUP($A35,FB_27,R$5,0))&IF(TYPE(VLOOKUP($A35,FB_28,R$5,0))=16,\"\",VLOOKUP($A35,FB_28,R$5,0))&IF(TYPE(VLOOKUP($A35,FB_29,R$5,0))=16,\"\",VLOOKUP($A35,FB_29,R$5,0))&IF(TYPE(VLOOKUP($A35,FB_30,R$5,0))=16,\"\",VLOOKUP($A35,FB_30,R$5,0))))","v":""},{"$f":"IF($B35=\"\",\"\",IF(TYPE(VLOOKUP($A35,FB_1,S$5,0))=16,\"\",VLOOKUP($A35,FB_1,S$5,0))&IF(TYPE(VLOOKUP($A35,FB_2,S$5,0))=16,\"\",VLOOKUP($A35,FB_2,S$5,0))&IF(TYPE(VLOOKUP($A35,FB_3,S$5,0))=16,\"\",VLOOKUP($A35,FB_3,S$5,0))&IF(TYPE(VLOOKUP($A35,FB_4,S$5,0))=16,\"\",VLOOKUP($A35,FB_4,S$5,0))&IF(TYPE(VLOOKUP($A35,FB_5,S$5,0))=16,\"\",VLOOKUP($A35,FB_5,S$5,0))&IF(TYPE(VLOOKUP($A35,FB_6,S$5,0))=16,\"\",VLOOKUP($A35,FB_6,S$5,0))&IF(TYPE(VLOOKUP($A35,FB_7,S$5,0))=16,\"\",VLOOKUP($A35,FB_7,S$5,0))&IF(TYPE(VLOOKUP($A35,FB_8,S$5,0))=16,\"\",VLOOKUP($A35,FB_8,S$5,0))&IF(TYPE(VLOOKUP($A35,FB_9,S$5,0))=16,\"\",VLOOKUP($A35,FB_9,S$5,0))&IF(TYPE(VLOOKUP($A35,FB_10,S$5,0))=16,\"\",VLOOKUP($A35,FB_10,S$5,0))&IF(TYPE(VLOOKUP($A35,FB_11,S$5,0))=16,\"\",VLOOKUP($A35,FB_11,S$5,0))&IF(TYPE(VLOOKUP($A35,FB_12,S$5,0))=16,\"\",VLOOKUP($A35,FB_12,S$5,0))&IF(TYPE(VLOOKUP($A35,FB_13,S$5,0))=16,\"\",VLOOKUP($A35,FB_13,S$5,0))&IF(TYPE(VLOOKUP($A35,FB_14,S$5,0))=16,\"\",VLOOKUP($A35,FB_14,S$5,0))&IF(TYPE(VLOOKUP($A35,FB_15,S$5,0))=16,\"\",VLOOKUP($A35,FB_15,S$5,0))&IF(TYPE(VLOOKUP($A35,FB_16,S$5,0))=16,\"\",VLOOKUP($A35,FB_16,S$5,0))&IF(TYPE(VLOOKUP($A35,FB_17,S$5,0))=16,\"\",VLOOKUP($A35,FB_17,S$5,0))&IF(TYPE(VLOOKUP($A35,FB_18,S$5,0))=16,\"\",VLOOKUP($A35,FB_18,S$5,0))&IF(TYPE(VLOOKUP($A35,FB_19,S$5,0))=16,\"\",VLOOKUP($A35,FB_19,S$5,0))&IF(TYPE(VLOOKUP($A35,FB_20,S$5,0))=16,\"\",VLOOKUP($A35,FB_20,S$5,0))&IF(TYPE(VLOOKUP($A35,FB_21,S$5,0))=16,\"\",VLOOKUP($A35,FB_21,S$5,0))&IF(TYPE(VLOOKUP($A35,FB_22,S$5,0))=16,\"\",VLOOKUP($A35,FB_22,S$5,0))&IF(TYPE(VLOOKUP($A35,FB_23,S$5,0))=16,\"\",VLOOKUP($A35,FB_23,S$5,0))&IF(TYPE(VLOOKUP($A35,FB_24,S$5,0))=16,\"\",VLOOKUP($A35,FB_24,S$5,0))&IF(TYPE(VLOOKUP($A35,FB_25,S$5,0))=16,\"\",VLOOKUP($A35,FB_25,S$5,0))&IF(TYPE(VLOOKUP($A35,FB_26,S$5,0))=16,\"\",VLOOKUP($A35,FB_26,S$5,0))&IF(TYPE(VLOOKUP($A35,FB_27,S$5,0))=16,\"\",VLOOKUP($A35,FB_27,S$5,0))&IF(TYPE(VLOOKUP($A35,FB_28,S$5,0))=16,\"\",VLOOKUP($A35,FB_28,S$5,0))&IF(TYPE(VLOOKUP($A35,FB_29,S$5,0))=16,\"\",VLOOKUP($A35,FB_29,S$5,0))&IF(TYPE(VLOOKUP($A35,FB_30,S$5,0))=16,\"\",VLOOKUP($A35,FB_30,S$5,0)))","v":""},null,null,null,null,null,null,null,null,null,null,null,null,null,null,null,null,"",":","","",""]
["7.",{"$f":"IF(TYPE(VLOOKUP($A36,FB_1,2,0))=16,\"\",VLOOKUP($A36,FB_1,2,0))&IF(TYPE(VLOOKUP($A36,FB_2,2,0))=16,\"\",VLOOKUP($A36,FB_2,2,0))&IF(TYPE(VLOOKUP($A36,FB_3,2,0))=16,\"\",VLOOKUP($A36,FB_3,2,0))&IF(TYPE(VLOOKUP($A36,FB_4,2,0))=16,\"\",VLOOKUP($A36,FB_4,2,0))&IF(TYPE(VLOOKUP($A36,FB_5,2,0))=16,\"\",VLOOKUP($A36,FB_5,2,0))&IF(TYPE(VLOOKUP($A36,FB_6,2,0))=16,\"\",VLOOKUP($A36,FB_6,2,0))&IF(TYPE(VLOOKUP($A36,FB_7,2,0))=16,\"\",VLOOKUP($A36,FB_7,2,0))&IF(TYPE(VLOOKUP($A36,FB_8,2,0))=16,\"\",VLOOKUP($A36,FB_8,2,0))&IF(TYPE(VLOOKUP($A36,FB_9,2,0))=16,\"\",VLOOKUP($A36,FB_9,2,0))&IF(TYPE(VLOOKUP($A36,FB_10,2,0))=16,\"\",VLOOKUP($A36,FB_10,2,0))&IF(TYPE(VLOOKUP($A36,FB_11,2,0))=16,\"\",VLOOKUP($A36,FB_11,2,0))&IF(TYPE(VLOOKUP($A36,FB_12,2,0))=16,\"\",VLOOKUP($A36,FB_12,2,0))&IF(TYPE(VLOOKUP($A36,FB_13,2,0))=16,\"\",VLOOKUP($A36,FB_13,2,0))&IF(TYPE(VLOOKUP($A36,FB_14,2,0))=16,\"\",VLOOKUP($A36,FB_14,2,0))&IF(TYPE(VLOOKUP($A36,FB_15,2,0))=16,\"\",VLOOKUP($A36,FB_15,2,0))&IF(TYPE(VLOOKUP($A36,FB_16,2,0))=16,\"\",VLOOKUP($A36,FB_16,2,0))&IF(TYPE(VLOOKUP($A36,FB_17,2,0))=16,\"\",VLOOKUP($A36,FB_17,2,0))&IF(TYPE(VLOOKUP($A36,FB_18,2,0))=16,\"\",VLOOKUP($A36,FB_18,2,0))&IF(TYPE(VLOOKUP($A36,FB_19,2,0))=16,\"\",VLOOKUP($A36,FB_19,2,0))&IF(TYPE(VLOOKUP($A36,FB_20,2,0))=16,\"\",VLOOKUP($A36,FB_20,2,0))&IF(TYPE(VLOOKUP($A36,FB_21,2,0))=16,\"\",VLOOKUP($A36,FB_21,2,0))&IF(TYPE(VLOOKUP($A36,FB_22,2,0))=16,\"\",VLOOKUP($A36,FB_22,2,0))&IF(TYPE(VLOOKUP($A36,FB_23,2,0))=16,\"\",VLOOKUP($A36,FB_23,2,0))&IF(TYPE(VLOOKUP($A36,FB_24,2,0))=16,\"\",VLOOKUP($A36,FB_24,2,0))&IF(TYPE(VLOOKUP($A36,FB_25,2,0))=16,\"\",VLOOKUP($A36,FB_25,2,0))&IF(TYPE(VLOOKUP($A36,FB_26,2,0))=16,\"\",VLOOKUP($A36,FB_26,2,0))&IF(TYPE(VLOOKUP($A36,FB_27,2,0))=16,\"\",VLOOKUP($A36,FB_27,2,0))&IF(TYPE(VLOOKUP($A36,FB_28,2,0))=16,\"\",VLOOKUP($A36,FB_28,2,0))&IF(TYPE(VLOOKUP($A36,FB_29,2,0))=16,\"\",VLOOKUP($A36,FB_29,2,0))&IF(TYPE(VLOOKUP($A36,FB_30,2,0))=16,\"\",VLOOKUP($A36,FB_30,2,0))","v":""},null,{"$f":"IF($B36=\"\",\"\",_xlfn.NUMBERVALUE(IF(TYPE(VLOOKUP($A36,FB_1,P$5,0))=16,\"\",VLOOKUP($A36,FB_1,P$5,0))&IF(TYPE(VLOOKUP($A36,FB_2,P$5,0))=16,\"\",VLOOKUP($A36,FB_2,P$5,0))&IF(TYPE(VLOOKUP($A36,FB_3,P$5,0))=16,\"\",VLOOKUP($A36,FB_3,P$5,0))&IF(TYPE(VLOOKUP($A36,FB_4,P$5,0))=16,\"\",VLOOKUP($A36,FB_4,P$5,0))&IF(TYPE(VLOOKUP($A36,FB_5,P$5,0))=16,\"\",VLOOKUP($A36,FB_5,P$5,0))&IF(TYPE(VLOOKUP($A36,FB_6,P$5,0))=16,\"\",VLOOKUP($A36,FB_6,P$5,0))&IF(TYPE(VLOOKUP($A36,FB_7,P$5,0))=16,\"\",VLOOKUP($A36,FB_7,P$5,0))&IF(TYPE(VLOOKUP($A36,FB_8,P$5,0))=16,\"\",VLOOKUP($A36,FB_8,P$5,0))&IF(TYPE(VLOOKUP($A36,FB_9,P$5,0))=16,\"\",VLOOKUP($A36,FB_9,P$5,0))&IF(TYPE(VLOOKUP($A36,FB_10,P$5,0))=16,\"\",VLOOKUP($A36,FB_10,P$5,0))&IF(TYPE(VLOOKUP($A36,FB_11,P$5,0))=16,\"\",VLOOKUP($A36,FB_11,P$5,0))&IF(TYPE(VLOOKUP($A36,FB_12,P$5,0))=16,\"\",VLOOKUP($A36,FB_12,P$5,0))&IF(TYPE(VLOOKUP($A36,FB_13,P$5,0))=16,\"\",VLOOKUP($A36,FB_13,P$5,0))&IF(TYPE(VLOOKUP($A36,FB_14,P$5,0))=16,\"\",VLOOKUP($A36,FB_14,P$5,0))&IF(TYPE(VLOOKUP($A36,FB_15,P$5,0))=16,\"\",VLOOKUP($A36,FB_15,P$5,0))&IF(TYPE(VLOOKUP($A36,FB_16,P$5,0))=16,\"\",VLOOKUP($A36,FB_16,P$5,0))&IF(TYPE(VLOOKUP($A36,FB_17,P$5,0))=16,\"\",VLOOKUP($A36,FB_17,P$5,0))&IF(TYPE(VLOOKUP($A36,FB_18,P$5,0))=16,\"\",VLOOKUP($A36,FB_18,P$5,0))&IF(TYPE(VLOOKUP($A36,FB_19,P$5,0))=16,\"\",VLOOKUP($A36,FB_19,P$5,0))&IF(TYPE(VLOOKUP($A36,FB_20,P$5,0))=16,\"\",VLOOKUP($A36,FB_20,P$5,0))&IF(TYPE(VLOOKUP($A36,FB_21,P$5,0))=16,\"\",VLOOKUP($A36,FB_21,P$5,0))&IF(TYPE(VLOOKUP($A36,FB_22,P$5,0))=16,\"\",VLOOKUP($A36,FB_22,P$5,0))&IF(TYPE(VLOOKUP($A36,FB_23,P$5,0))=16,\"\",VLOOKUP($A36,FB_23,P$5,0))&IF(TYPE(VLOOKUP($A36,FB_24,P$5,0))=16,\"\",VLOOKUP($A36,FB_24,P$5,0))&IF(TYPE(VLOOKUP($A36,FB_25,P$5,0))=16,\"\",VLOOKUP($A36,FB_25,P$5,0))&IF(TYPE(VLOOKUP($A36,FB_26,P$5,0))=16,\"\",VLOOKUP($A36,FB_26,P$5,0))&IF(TYPE(VLOOKUP($A36,FB_27,P$5,0))=16,\"\",VLOOKUP($A36,FB_27,P$5,0))&IF(TYPE(VLOOKUP($A36,FB_28,P$5,0))=16,\"\",VLOOKUP($A36,FB_28,P$5,0))&IF(TYPE(VLOOKUP($A36,FB_29,P$5,0))=16,\"\",VLOOKUP($A36,FB_29,P$5,0))&IF(TYPE(VLOOKUP($A36,FB_30,P$5,0))=16,\"\",VLOOKUP($A36,FB_30,P$5,0))))","v":""},"",{"$f":"IF($B36=\"\",\"\",_xlfn.NUMBERVALUE(IF(TYPE(VLOOKUP($A36,FB_1,R$5,0))=16,\"\",VLOOKUP($A36,FB_1,R$5,0))&IF(TYPE(VLOOKUP($A36,FB_2,R$5,0))=16,\"\",VLOOKUP($A36,FB_2,R$5,0))&IF(TYPE(VLOOKUP($A36,FB_3,R$5,0))=16,\"\",VLOOKUP($A36,FB_3,R$5,0))&IF(TYPE(VLOOKUP($A36,FB_4,R$5,0))=16,\"\",VLOOKUP($A36,FB_4,R$5,0))&IF(TYPE(VLOOKUP($A36,FB_5,R$5,0))=16,\"\",VLOOKUP($A36,FB_5,R$5,0))&IF(TYPE(VLOOKUP($A36,FB_6,R$5,0))=16,\"\",VLOOKUP($A36,FB_6,R$5,0))&IF(TYPE(VLOOKUP($A36,FB_7,R$5,0))=16,\"\",VLOOKUP($A36,FB_7,R$5,0))&IF(TYPE(VLOOKUP($A36,FB_8,R$5,0))=16,\"\",VLOOKUP($A36,FB_8,R$5,0))&IF(TYPE(VLOOKUP($A36,FB_9,R$5,0))=16,\"\",VLOOKUP($A36,FB_9,R$5,0))&IF(TYPE(VLOOKUP($A36,FB_10,R$5,0))=16,\"\",VLOOKUP($A36,FB_10,R$5,0))&IF(TYPE(VLOOKUP($A36,FB_11,R$5,0))=16,\"\",VLOOKUP($A36,FB_11,R$5,0))&IF(TYPE(VLOOKUP($A36,FB_12,R$5,0))=16,\"\",VLOOKUP($A36,FB_12,R$5,0))&IF(TYPE(VLOOKUP($A36,FB_13,R$5,0))=16,\"\",VLOOKUP($A36,FB_13,R$5,0))&IF(TYPE(VLOOKUP($A36,FB_14,R$5,0))=16,\"\",VLOOKUP($A36,FB_14,R$5,0))&IF(TYPE(VLOOKUP($A36,FB_15,R$5,0))=16,\"\",VLOOKUP($A36,FB_15,R$5,0))&IF(TYPE(VLOOKUP($A36,FB_16,R$5,0))=16,\"\",VLOOKUP($A36,FB_16,R$5,0))&IF(TYPE(VLOOKUP($A36,FB_17,R$5,0))=16,\"\",VLOOKUP($A36,FB_17,R$5,0))&IF(TYPE(VLOOKUP($A36,FB_18,R$5,0))=16,\"\",VLOOKUP($A36,FB_18,R$5,0))&IF(TYPE(VLOOKUP($A36,FB_19,R$5,0))=16,\"\",VLOOKUP($A36,FB_19,R$5,0))&IF(TYPE(VLOOKUP($A36,FB_20,R$5,0))=16,\"\",VLOOKUP($A36,FB_20,R$5,0))&IF(TYPE(VLOOKUP($A36,FB_21,R$5,0))=16,\"\",VLOOKUP($A36,FB_21,R$5,0))&IF(TYPE(VLOOKUP($A36,FB_22,R$5,0))=16,\"\",VLOOKUP($A36,FB_22,R$5,0))&IF(TYPE(VLOOKUP($A36,FB_23,R$5,0))=16,\"\",VLOOKUP($A36,FB_23,R$5,0))&IF(TYPE(VLOOKUP($A36,FB_24,R$5,0))=16,\"\",VLOOKUP($A36,FB_24,R$5,0))&IF(TYPE(VLOOKUP($A36,FB_25,R$5,0))=16,\"\",VLOOKUP($A36,FB_25,R$5,0))&IF(TYPE(VLOOKUP($A36,FB_26,R$5,0))=16,\"\",VLOOKUP($A36,FB_26,R$5,0))&IF(TYPE(VLOOKUP($A36,FB_27,R$5,0))=16,\"\",VLOOKUP($A36,FB_27,R$5,0))&IF(TYPE(VLOOKUP($A36,FB_28,R$5,0))=16,\"\",VLOOKUP($A36,FB_28,R$5,0))&IF(TYPE(VLOOKUP($A36,FB_29,R$5,0))=16,\"\",VLOOKUP($A36,FB_29,R$5,0))&IF(TYPE(VLOOKUP($A36,FB_30,R$5,0))=16,\"\",VLOOKUP($A36,FB_30,R$5,0))))","v":""},{"$f":"IF($B36=\"\",\"\",IF(TYPE(VLOOKUP($A36,FB_1,S$5,0))=16,\"\",VLOOKUP($A36,FB_1,S$5,0))&IF(TYPE(VLOOKUP($A36,FB_2,S$5,0))=16,\"\",VLOOKUP($A36,FB_2,S$5,0))&IF(TYPE(VLOOKUP($A36,FB_3,S$5,0))=16,\"\",VLOOKUP($A36,FB_3,S$5,0))&IF(TYPE(VLOOKUP($A36,FB_4,S$5,0))=16,\"\",VLOOKUP($A36,FB_4,S$5,0))&IF(TYPE(VLOOKUP($A36,FB_5,S$5,0))=16,\"\",VLOOKUP($A36,FB_5,S$5,0))&IF(TYPE(VLOOKUP($A36,FB_6,S$5,0))=16,\"\",VLOOKUP($A36,FB_6,S$5,0))&IF(TYPE(VLOOKUP($A36,FB_7,S$5,0))=16,\"\",VLOOKUP($A36,FB_7,S$5,0))&IF(TYPE(VLOOKUP($A36,FB_8,S$5,0))=16,\"\",VLOOKUP($A36,FB_8,S$5,0))&IF(TYPE(VLOOKUP($A36,FB_9,S$5,0))=16,\"\",VLOOKUP($A36,FB_9,S$5,0))&IF(TYPE(VLOOKUP($A36,FB_10,S$5,0))=16,\"\",VLOOKUP($A36,FB_10,S$5,0))&IF(TYPE(VLOOKUP($A36,FB_11,S$5,0))=16,\"\",VLOOKUP($A36,FB_11,S$5,0))&IF(TYPE(VLOOKUP($A36,FB_12,S$5,0))=16,\"\",VLOOKUP($A36,FB_12,S$5,0))&IF(TYPE(VLOOKUP($A36,FB_13,S$5,0))=16,\"\",VLOOKUP($A36,FB_13,S$5,0))&IF(TYPE(VLOOKUP($A36,FB_14,S$5,0))=16,\"\",VLOOKUP($A36,FB_14,S$5,0))&IF(TYPE(VLOOKUP($A36,FB_15,S$5,0))=16,\"\",VLOOKUP($A36,FB_15,S$5,0))&IF(TYPE(VLOOKUP($A36,FB_16,S$5,0))=16,\"\",VLOOKUP($A36,FB_16,S$5,0))&IF(TYPE(VLOOKUP($A36,FB_17,S$5,0))=16,\"\",VLOOKUP($A36,FB_17,S$5,0))&IF(TYPE(VLOOKUP($A36,FB_18,S$5,0))=16,\"\",VLOOKUP($A36,FB_18,S$5,0))&IF(TYPE(VLOOKUP($A36,FB_19,S$5,0))=16,\"\",VLOOKUP($A36,FB_19,S$5,0))&IF(TYPE(VLOOKUP($A36,FB_20,S$5,0))=16,\"\",VLOOKUP($A36,FB_20,S$5,0))&IF(TYPE(VLOOKUP($A36,FB_21,S$5,0))=16,\"\",VLOOKUP($A36,FB_21,S$5,0))&IF(TYPE(VLOOKUP($A36,FB_22,S$5,0))=16,\"\",VLOOKUP($A36,FB_22,S$5,0))&IF(TYPE(VLOOKUP($A36,FB_23,S$5,0))=16,\"\",VLOOKUP($A36,FB_23,S$5,0))&IF(TYPE(VLOOKUP($A36,FB_24,S$5,0))=16,\"\",VLOOKUP($A36,FB_24,S$5,0))&IF(TYPE(VLOOKUP($A36,FB_25,S$5,0))=16,\"\",VLOOKUP($A36,FB_25,S$5,0))&IF(TYPE(VLOOKUP($A36,FB_26,S$5,0))=16,\"\",VLOOKUP($A36,FB_26,S$5,0))&IF(TYPE(VLOOKUP($A36,FB_27,S$5,0))=16,\"\",VLOOKUP($A36,FB_27,S$5,0))&IF(TYPE(VLOOKUP($A36,FB_28,S$5,0))=16,\"\",VLOOKUP($A36,FB_28,S$5,0))&IF(TYPE(VLOOKUP($A36,FB_29,S$5,0))=16,\"\",VLOOKUP($A36,FB_29,S$5,0))&IF(TYPE(VLOOKUP($A36,FB_30,S$5,0))=16,\"\",VLOOKUP($A36,FB_30,S$5,0)))","v":""},null,null,null,null,null,null,null,null,null,null,null,null,null,null,null,null,"",":","","",""]
["8.",{"$f":"IF(TYPE(VLOOKUP($A37,FB_1,2,0))=16,\"\",VLOOKUP($A37,FB_1,2,0))&IF(TYPE(VLOOKUP($A37,FB_2,2,0))=16,\"\",VLOOKUP($A37,FB_2,2,0))&IF(TYPE(VLOOKUP($A37,FB_3,2,0))=16,\"\",VLOOKUP($A37,FB_3,2,0))&IF(TYPE(VLOOKUP($A37,FB_4,2,0))=16,\"\",VLOOKUP($A37,FB_4,2,0))&IF(TYPE(VLOOKUP($A37,FB_5,2,0))=16,\"\",VLOOKUP($A37,FB_5,2,0))&IF(TYPE(VLOOKUP($A37,FB_6,2,0))=16,\"\",VLOOKUP($A37,FB_6,2,0))&IF(TYPE(VLOOKUP($A37,FB_7,2,0))=16,\"\",VLOOKUP($A37,FB_7,2,0))&IF(TYPE(VLOOKUP($A37,FB_8,2,0))=16,\"\",VLOOKUP($A37,FB_8,2,0))&IF(TYPE(VLOOKUP($A37,FB_9,2,0))=16,\"\",VLOOKUP($A37,FB_9,2,0))&IF(TYPE(VLOOKUP($A37,FB_10,2,0))=16,\"\",VLOOKUP($A37,FB_10,2,0))&IF(TYPE(VLOOKUP($A37,FB_11,2,0))=16,\"\",VLOOKUP($A37,FB_11,2,0))&IF(TYPE(VLOOKUP($A37,FB_12,2,0))=16,\"\",VLOOKUP($A37,FB_12,2,0))&IF(TYPE(VLOOKUP($A37,FB_13,2,0))=16,\"\",VLOOKUP($A37,FB_13,2,0))&IF(TYPE(VLOOKUP($A37,FB_14,2,0))=16,\"\",VLOOKUP($A37,FB_14,2,0))&IF(TYPE(VLOOKUP($A37,FB_15,2,0))=16,\"\",VLOOKUP($A37,FB_15,2,0))&IF(TYPE(VLOOKUP($A37,FB_16,2,0))=16,\"\",VLOOKUP($A37,FB_16,2,0))&IF(TYPE(VLOOKUP($A37,FB_17,2,0))=16,\"\",VLOOKUP($A37,FB_17,2,0))&IF(TYPE(VLOOKUP($A37,FB_18,2,0))=16,\"\",VLOOKUP($A37,FB_18,2,0))&IF(TYPE(VLOOKUP($A37,FB_19,2,0))=16,\"\",VLOOKUP($A37,FB_19,2,0))&IF(TYPE(VLOOKUP($A37,FB_20,2,0))=16,\"\",VLOOKUP($A37,FB_20,2,0))&IF(TYPE(VLOOKUP($A37,FB_21,2,0))=16,\"\",VLOOKUP($A37,FB_21,2,0))&IF(TYPE(VLOOKUP($A37,FB_22,2,0))=16,\"\",VLOOKUP($A37,FB_22,2,0))&IF(TYPE(VLOOKUP($A37,FB_23,2,0))=16,\"\",VLOOKUP($A37,FB_23,2,0))&IF(TYPE(VLOOKUP($A37,FB_24,2,0))=16,\"\",VLOOKUP($A37,FB_24,2,0))&IF(TYPE(VLOOKUP($A37,FB_25,2,0))=16,\"\",VLOOKUP($A37,FB_25,2,0))&IF(TYPE(VLOOKUP($A37,FB_26,2,0))=16,\"\",VLOOKUP($A37,FB_26,2,0))&IF(TYPE(VLOOKUP($A37,FB_27,2,0))=16,\"\",VLOOKUP($A37,FB_27,2,0))&IF(TYPE(VLOOKUP($A37,FB_28,2,0))=16,\"\",VLOOKUP($A37,FB_28,2,0))&IF(TYPE(VLOOKUP($A37,FB_29,2,0))=16,\"\",VLOOKUP($A37,FB_29,2,0))&IF(TYPE(VLOOKUP($A37,FB_30,2,0))=16,\"\",VLOOKUP($A37,FB_30,2,0))","v":""},null,{"$f":"IF($B37=\"\",\"\",_xlfn.NUMBERVALUE(IF(TYPE(VLOOKUP($A37,FB_1,P$5,0))=16,\"\",VLOOKUP($A37,FB_1,P$5,0))&IF(TYPE(VLOOKUP($A37,FB_2,P$5,0))=16,\"\",VLOOKUP($A37,FB_2,P$5,0))&IF(TYPE(VLOOKUP($A37,FB_3,P$5,0))=16,\"\",VLOOKUP($A37,FB_3,P$5,0))&IF(TYPE(VLOOKUP($A37,FB_4,P$5,0))=16,\"\",VLOOKUP($A37,FB_4,P$5,0))&IF(TYPE(VLOOKUP($A37,FB_5,P$5,0))=16,\"\",VLOOKUP($A37,FB_5,P$5,0))&IF(TYPE(VLOOKUP($A37,FB_6,P$5,0))=16,\"\",VLOOKUP($A37,FB_6,P$5,0))&IF(TYPE(VLOOKUP($A37,FB_7,P$5,0))=16,\"\",VLOOKUP($A37,FB_7,P$5,0))&IF(TYPE(VLOOKUP($A37,FB_8,P$5,0))=16,\"\",VLOOKUP($A37,FB_8,P$5,0))&IF(TYPE(VLOOKUP($A37,FB_9,P$5,0))=16,\"\",VLOOKUP($A37,FB_9,P$5,0))&IF(TYPE(VLOOKUP($A37,FB_10,P$5,0))=16,\"\",VLOOKUP($A37,FB_10,P$5,0))&IF(TYPE(VLOOKUP($A37,FB_11,P$5,0))=16,\"\",VLOOKUP($A37,FB_11,P$5,0))&IF(TYPE(VLOOKUP($A37,FB_12,P$5,0))=16,\"\",VLOOKUP($A37,FB_12,P$5,0))&IF(TYPE(VLOOKUP($A37,FB_13,P$5,0))=16,\"\",VLOOKUP($A37,FB_13,P$5,0))&IF(TYPE(VLOOKUP($A37,FB_14,P$5,0))=16,\"\",VLOOKUP($A37,FB_14,P$5,0))&IF(TYPE(VLOOKUP($A37,FB_15,P$5,0))=16,\"\",VLOOKUP($A37,FB_15,P$5,0))&IF(TYPE(VLOOKUP($A37,FB_16,P$5,0))=16,\"\",VLOOKUP($A37,FB_16,P$5,0))&IF(TYPE(VLOOKUP($A37,FB_17,P$5,0))=16,\"\",VLOOKUP($A37,FB_17,P$5,0))&IF(TYPE(VLOOKUP($A37,FB_18,P$5,0))=16,\"\",VLOOKUP($A37,FB_18,P$5,0))&IF(TYPE(VLOOKUP($A37,FB_19,P$5,0))=16,\"\",VLOOKUP($A37,FB_19,P$5,0))&IF(TYPE(VLOOKUP($A37,FB_20,P$5,0))=16,\"\",VLOOKUP($A37,FB_20,P$5,0))&IF(TYPE(VLOOKUP($A37,FB_21,P$5,0))=16,\"\",VLOOKUP($A37,FB_21,P$5,0))&IF(TYPE(VLOOKUP($A37,FB_22,P$5,0))=16,\"\",VLOOKUP($A37,FB_22,P$5,0))&IF(TYPE(VLOOKUP($A37,FB_23,P$5,0))=16,\"\",VLOOKUP($A37,FB_23,P$5,0))&IF(TYPE(VLOOKUP($A37,FB_24,P$5,0))=16,\"\",VLOOKUP($A37,FB_24,P$5,0))&IF(TYPE(VLOOKUP($A37,FB_25,P$5,0))=16,\"\",VLOOKUP($A37,FB_25,P$5,0))&IF(TYPE(VLOOKUP($A37,FB_26,P$5,0))=16,\"\",VLOOKUP($A37,FB_26,P$5,0))&IF(TYPE(VLOOKUP($A37,FB_27,P$5,0))=16,\"\",VLOOKUP($A37,FB_27,P$5,0))&IF(TYPE(VLOOKUP($A37,FB_28,P$5,0))=16,\"\",VLOOKUP($A37,FB_28,P$5,0))&IF(TYPE(VLOOKUP($A37,FB_29,P$5,0))=16,\"\",VLOOKUP($A37,FB_29,P$5,0))&IF(TYPE(VLOOKUP($A37,FB_30,P$5,0))=16,\"\",VLOOKUP($A37,FB_30,P$5,0))))","v":""},"",{"$f":"IF($B37=\"\",\"\",_xlfn.NUMBERVALUE(IF(TYPE(VLOOKUP($A37,FB_1,R$5,0))=16,\"\",VLOOKUP($A37,FB_1,R$5,0))&IF(TYPE(VLOOKUP($A37,FB_2,R$5,0))=16,\"\",VLOOKUP($A37,FB_2,R$5,0))&IF(TYPE(VLOOKUP($A37,FB_3,R$5,0))=16,\"\",VLOOKUP($A37,FB_3,R$5,0))&IF(TYPE(VLOOKUP($A37,FB_4,R$5,0))=16,\"\",VLOOKUP($A37,FB_4,R$5,0))&IF(TYPE(VLOOKUP($A37,FB_5,R$5,0))=16,\"\",VLOOKUP($A37,FB_5,R$5,0))&IF(TYPE(VLOOKUP($A37,FB_6,R$5,0))=16,\"\",VLOOKUP($A37,FB_6,R$5,0))&IF(TYPE(VLOOKUP($A37,FB_7,R$5,0))=16,\"\",VLOOKUP($A37,FB_7,R$5,0))&IF(TYPE(VLOOKUP($A37,FB_8,R$5,0))=16,\"\",VLOOKUP($A37,FB_8,R$5,0))&IF(TYPE(VLOOKUP($A37,FB_9,R$5,0))=16,\"\",VLOOKUP($A37,FB_9,R$5,0))&IF(TYPE(VLOOKUP($A37,FB_10,R$5,0))=16,\"\",VLOOKUP($A37,FB_10,R$5,0))&IF(TYPE(VLOOKUP($A37,FB_11,R$5,0))=16,\"\",VLOOKUP($A37,FB_11,R$5,0))&IF(TYPE(VLOOKUP($A37,FB_12,R$5,0))=16,\"\",VLOOKUP($A37,FB_12,R$5,0))&IF(TYPE(VLOOKUP($A37,FB_13,R$5,0))=16,\"\",VLOOKUP($A37,FB_13,R$5,0))&IF(TYPE(VLOOKUP($A37,FB_14,R$5,0))=16,\"\",VLOOKUP($A37,FB_14,R$5,0))&IF(TYPE(VLOOKUP($A37,FB_15,R$5,0))=16,\"\",VLOOKUP($A37,FB_15,R$5,0))&IF(TYPE(VLOOKUP($A37,FB_16,R$5,0))=16,\"\",VLOOKUP($A37,FB_16,R$5,0))&IF(TYPE(VLOOKUP($A37,FB_17,R$5,0))=16,\"\",VLOOKUP($A37,FB_17,R$5,0))&IF(TYPE(VLOOKUP($A37,FB_18,R$5,0))=16,\"\",VLOOKUP($A37,FB_18,R$5,0))&IF(TYPE(VLOOKUP($A37,FB_19,R$5,0))=16,\"\",VLOOKUP($A37,FB_19,R$5,0))&IF(TYPE(VLOOKUP($A37,FB_20,R$5,0))=16,\"\",VLOOKUP($A37,FB_20,R$5,0))&IF(TYPE(VLOOKUP($A37,FB_21,R$5,0))=16,\"\",VLOOKUP($A37,FB_21,R$5,0))&IF(TYPE(VLOOKUP($A37,FB_22,R$5,0))=16,\"\",VLOOKUP($A37,FB_22,R$5,0))&IF(TYPE(VLOOKUP($A37,FB_23,R$5,0))=16,\"\",VLOOKUP($A37,FB_23,R$5,0))&IF(TYPE(VLOOKUP($A37,FB_24,R$5,0))=16,\"\",VLOOKUP($A37,FB_24,R$5,0))&IF(TYPE(VLOOKUP($A37,FB_25,R$5,0))=16,\"\",VLOOKUP($A37,FB_25,R$5,0))&IF(TYPE(VLOOKUP($A37,FB_26,R$5,0))=16,\"\",VLOOKUP($A37,FB_26,R$5,0))&IF(TYPE(VLOOKUP($A37,FB_27,R$5,0))=16,\"\",VLOOKUP($A37,FB_27,R$5,0))&IF(TYPE(VLOOKUP($A37,FB_28,R$5,0))=16,\"\",VLOOKUP($A37,FB_28,R$5,0))&IF(TYPE(VLOOKUP($A37,FB_29,R$5,0))=16,\"\",VLOOKUP($A37,FB_29,R$5,0))&IF(TYPE(VLOOKUP($A37,FB_30,R$5,0))=16,\"\",VLOOKUP($A37,FB_30,R$5,0))))","v":""},{"$f":"IF($B37=\"\",\"\",IF(TYPE(VLOOKUP($A37,FB_1,S$5,0))=16,\"\",VLOOKUP($A37,FB_1,S$5,0))&IF(TYPE(VLOOKUP($A37,FB_2,S$5,0))=16,\"\",VLOOKUP($A37,FB_2,S$5,0))&IF(TYPE(VLOOKUP($A37,FB_3,S$5,0))=16,\"\",VLOOKUP($A37,FB_3,S$5,0))&IF(TYPE(VLOOKUP($A37,FB_4,S$5,0))=16,\"\",VLOOKUP($A37,FB_4,S$5,0))&IF(TYPE(VLOOKUP($A37,FB_5,S$5,0))=16,\"\",VLOOKUP($A37,FB_5,S$5,0))&IF(TYPE(VLOOKUP($A37,FB_6,S$5,0))=16,\"\",VLOOKUP($A37,FB_6,S$5,0))&IF(TYPE(VLOOKUP($A37,FB_7,S$5,0))=16,\"\",VLOOKUP($A37,FB_7,S$5,0))&IF(TYPE(VLOOKUP($A37,FB_8,S$5,0))=16,\"\",VLOOKUP($A37,FB_8,S$5,0))&IF(TYPE(VLOOKUP($A37,FB_9,S$5,0))=16,\"\",VLOOKUP($A37,FB_9,S$5,0))&IF(TYPE(VLOOKUP($A37,FB_10,S$5,0))=16,\"\",VLOOKUP($A37,FB_10,S$5,0))&IF(TYPE(VLOOKUP($A37,FB_11,S$5,0))=16,\"\",VLOOKUP($A37,FB_11,S$5,0))&IF(TYPE(VLOOKUP($A37,FB_12,S$5,0))=16,\"\",VLOOKUP($A37,FB_12,S$5,0))&IF(TYPE(VLOOKUP($A37,FB_13,S$5,0))=16,\"\",VLOOKUP($A37,FB_13,S$5,0))&IF(TYPE(VLOOKUP($A37,FB_14,S$5,0))=16,\"\",VLOOKUP($A37,FB_14,S$5,0))&IF(TYPE(VLOOKUP($A37,FB_15,S$5,0))=16,\"\",VLOOKUP($A37,FB_15,S$5,0))&IF(TYPE(VLOOKUP($A37,FB_16,S$5,0))=16,\"\",VLOOKUP($A37,FB_16,S$5,0))&IF(TYPE(VLOOKUP($A37,FB_17,S$5,0))=16,\"\",VLOOKUP($A37,FB_17,S$5,0))&IF(TYPE(VLOOKUP($A37,FB_18,S$5,0))=16,\"\",VLOOKUP($A37,FB_18,S$5,0))&IF(TYPE(VLOOKUP($A37,FB_19,S$5,0))=16,\"\",VLOOKUP($A37,FB_19,S$5,0))&IF(TYPE(VLOOKUP($A37,FB_20,S$5,0))=16,\"\",VLOOKUP($A37,FB_20,S$5,0))&IF(TYPE(VLOOKUP($A37,FB_21,S$5,0))=16,\"\",VLOOKUP($A37,FB_21,S$5,0))&IF(TYPE(VLOOKUP($A37,FB_22,S$5,0))=16,\"\",VLOOKUP($A37,FB_22,S$5,0))&IF(TYPE(VLOOKUP($A37,FB_23,S$5,0))=16,\"\",VLOOKUP($A37,FB_23,S$5,0))&IF(TYPE(VLOOKUP($A37,FB_24,S$5,0))=16,\"\",VLOOKUP($A37,FB_24,S$5,0))&IF(TYPE(VLOOKUP($A37,FB_25,S$5,0))=16,\"\",VLOOKUP($A37,FB_25,S$5,0))&IF(TYPE(VLOOKUP($A37,FB_26,S$5,0))=16,\"\",VLOOKUP($A37,FB_26,S$5,0))&IF(TYPE(VLOOKUP($A37,FB_27,S$5,0))=16,\"\",VLOOKUP($A37,FB_27,S$5,0))&IF(TYPE(VLOOKUP($A37,FB_28,S$5,0))=16,\"\",VLOOKUP($A37,FB_28,S$5,0))&IF(TYPE(VLOOKUP($A37,FB_29,S$5,0))=16,\"\",VLOOKUP($A37,FB_29,S$5,0))&IF(TYPE(VLOOKUP($A37,FB_30,S$5,0))=16,\"\",VLOOKUP($A37,FB_30,S$5,0)))","v":""},null,null,null,null,null,null,null,null,null,null,null,null,null,null,null,null,"",":","","",""]
["9.",{"$f":"IF(TYPE(VLOOKUP($A38,FB_1,2,0))=16,\"\",VLOOKUP($A38,FB_1,2,0))&IF(TYPE(VLOOKUP($A38,FB_2,2,0))=16,\"\",VLOOKUP($A38,FB_2,2,0))&IF(TYPE(VLOOKUP($A38,FB_3,2,0))=16,\"\",VLOOKUP($A38,FB_3,2,0))&IF(TYPE(VLOOKUP($A38,FB_4,2,0))=16,\"\",VLOOKUP($A38,FB_4,2,0))&IF(TYPE(VLOOKUP($A38,FB_5,2,0))=16,\"\",VLOOKUP($A38,FB_5,2,0))&IF(TYPE(VLOOKUP($A38,FB_6,2,0))=16,\"\",VLOOKUP($A38,FB_6,2,0))&IF(TYPE(VLOOKUP($A38,FB_7,2,0))=16,\"\",VLOOKUP($A38,FB_7,2,0))&IF(TYPE(VLOOKUP($A38,FB_8,2,0))=16,\"\",VLOOKUP($A38,FB_8,2,0))&IF(TYPE(VLOOKUP($A38,FB_9,2,0))=16,\"\",VLOOKUP($A38,FB_9,2,0))&IF(TYPE(VLOOKUP($A38,FB_10,2,0))=16,\"\",VLOOKUP($A38,FB_10,2,0))&IF(TYPE(VLOOKUP($A38,FB_11,2,0))=16,\"\",VLOOKUP($A38,FB_11,2,0))&IF(TYPE(VLOOKUP($A38,FB_12,2,0))=16,\"\",VLOOKUP($A38,FB_12,2,0))&IF(TYPE(VLOOKUP($A38,FB_13,2,0))=16,\"\",VLOOKUP($A38,FB_13,2,0))&IF(TYPE(VLOOKUP($A38,FB_14,2,0))=16,\"\",VLOOKUP($A38,FB_14,2,0))&IF(TYPE(VLOOKUP($A38,FB_15,2,0))=16,\"\",VLOOKUP($A38,FB_15,2,0))&IF(TYPE(VLOOKUP($A38,FB_16,2,0))=16,\"\",VLOOKUP($A38,FB_16,2,0))&IF(TYPE(VLOOKUP($A38,FB_17,2,0))=16,\"\",VLOOKUP($A38,FB_17,2,0))&IF(TYPE(VLOOKUP($A38,FB_18,2,0))=16,\"\",VLOOKUP($A38,FB_18,2,0))&IF(TYPE(VLOOKUP($A38,FB_19,2,0))=16,\"\",VLOOKUP($A38,FB_19,2,0))&IF(TYPE(VLOOKUP($A38,FB_20,2,0))=16,\"\",VLOOKUP($A38,FB_20,2,0))&IF(TYPE(VLOOKUP($A38,FB_21,2,0))=16,\"\",VLOOKUP($A38,FB_21,2,0))&IF(TYPE(VLOOKUP($A38,FB_22,2,0))=16,\"\",VLOOKUP($A38,FB_22,2,0))&IF(TYPE(VLOOKUP($A38,FB_23,2,0))=16,\"\",VLOOKUP($A38,FB_23,2,0))&IF(TYPE(VLOOKUP($A38,FB_24,2,0))=16,\"\",VLOOKUP($A38,FB_24,2,0))&IF(TYPE(VLOOKUP($A38,FB_25,2,0))=16,\"\",VLOOKUP($A38,FB_25,2,0))&IF(TYPE(VLOOKUP($A38,FB_26,2,0))=16,\"\",VLOOKUP($A38,FB_26,2,0))&IF(TYPE(VLOOKUP($A38,FB_27,2,0))=16,\"\",VLOOKUP($A38,FB_27,2,0))&IF(TYPE(VLOOKUP($A38,FB_28,2,0))=16,\"\",VLOOKUP($A38,FB_28,2,0))&IF(TYPE(VLOOKUP($A38,FB_29,2,0))=16,\"\",VLOOKUP($A38,FB_29,2,0))&IF(TYPE(VLOOKUP($A38,FB_30,2,0))=16,\"\",VLOOKUP($A38,FB_30,2,0))","v":""},null,{"$f":"IF($B38=\"\",\"\",_xlfn.NUMBERVALUE(IF(TYPE(VLOOKUP($A38,FB_1,P$5,0))=16,\"\",VLOOKUP($A38,FB_1,P$5,0))&IF(TYPE(VLOOKUP($A38,FB_2,P$5,0))=16,\"\",VLOOKUP($A38,FB_2,P$5,0))&IF(TYPE(VLOOKUP($A38,FB_3,P$5,0))=16,\"\",VLOOKUP($A38,FB_3,P$5,0))&IF(TYPE(VLOOKUP($A38,FB_4,P$5,0))=16,\"\",VLOOKUP($A38,FB_4,P$5,0))&IF(TYPE(VLOOKUP($A38,FB_5,P$5,0))=16,\"\",VLOOKUP($A38,FB_5,P$5,0))&IF(TYPE(VLOOKUP($A38,FB_6,P$5,0))=16,\"\",VLOOKUP($A38,FB_6,P$5,0))&IF(TYPE(VLOOKUP($A38,FB_7,P$5,0))=16,\"\",VLOOKUP($A38,FB_7,P$5,0))&IF(TYPE(VLOOKUP($A38,FB_8,P$5,0))=16,\"\",VLOOKUP($A38,FB_8,P$5,0))&IF(TYPE(VLOOKUP($A38,FB_9,P$5,0))=16,\"\",VLOOKUP($A38,FB_9,P$5,0))&IF(TYPE(VLOOKUP($A38,FB_10,P$5,0))=16,\"\",VLOOKUP($A38,FB_10,P$5,0))&IF(TYPE(VLOOKUP($A38,FB_11,P$5,0))=16,\"\",VLOOKUP($A38,FB_11,P$5,0))&IF(TYPE(VLOOKUP($A38,FB_12,P$5,0))=16,\"\",VLOOKUP($A38,FB_12,P$5,0))&IF(TYPE(VLOOKUP($A38,FB_13,P$5,0))=16,\"\",VLOOKUP($A38,FB_13,P$5,0))&IF(TYPE(VLOOKUP($A38,FB_14,P$5,0))=16,\"\",VLOOKUP($A38,FB_14,P$5,0))&IF(TYPE(VLOOKUP($A38,FB_15,P$5,0))=16,\"\",VLOOKUP($A38,FB_15,P$5,0))&IF(TYPE(VLOOKUP($A38,FB_16,P$5,0))=16,\"\",VLOOKUP($A38,FB_16,P$5,0))&IF(TYPE(VLOOKUP($A38,FB_17,P$5,0))=16,\"\",VLOOKUP($A38,FB_17,P$5,0))&IF(TYPE(VLOOKUP($A38,FB_18,P$5,0))=16,\"\",VLOOKUP($A38,FB_18,P$5,0))&IF(TYPE(VLOOKUP($A38,FB_19,P$5,0))=16,\"\",VLOOKUP($A38,FB_19,P$5,0))&IF(TYPE(VLOOKUP($A38,FB_20,P$5,0))=16,\"\",VLOOKUP($A38,FB_20,P$5,0))&IF(TYPE(VLOOKUP($A38,FB_21,P$5,0))=16,\"\",VLOOKUP($A38,FB_21,P$5,0))&IF(TYPE(VLOOKUP($A38,FB_22,P$5,0))=16,\"\",VLOOKUP($A38,FB_22,P$5,0))&IF(TYPE(VLOOKUP($A38,FB_23,P$5,0))=16,\"\",VLOOKUP($A38,FB_23,P$5,0))&IF(TYPE(VLOOKUP($A38,FB_24,P$5,0))=16,\"\",VLOOKUP($A38,FB_24,P$5,0))&IF(TYPE(VLOOKUP($A38,FB_25,P$5,0))=16,\"\",VLOOKUP($A38,FB_25,P$5,0))&IF(TYPE(VLOOKUP($A38,FB_26,P$5,0))=16,\"\",VLOOKUP($A38,FB_26,P$5,0))&IF(TYPE(VLOOKUP($A38,FB_27,P$5,0))=16,\"\",VLOOKUP($A38,FB_27,P$5,0))&IF(TYPE(VLOOKUP($A38,FB_28,P$5,0))=16,\"\",VLOOKUP($A38,FB_28,P$5,0))&IF(TYPE(VLOOKUP($A38,FB_29,P$5,0))=16,\"\",VLOOKUP($A38,FB_29,P$5,0))&IF(TYPE(VLOOKUP($A38,FB_30,P$5,0))=16,\"\",VLOOKUP($A38,FB_30,P$5,0))))","v":""},"",{"$f":"IF($B38=\"\",\"\",_xlfn.NUMBERVALUE(IF(TYPE(VLOOKUP($A38,FB_1,R$5,0))=16,\"\",VLOOKUP($A38,FB_1,R$5,0))&IF(TYPE(VLOOKUP($A38,FB_2,R$5,0))=16,\"\",VLOOKUP($A38,FB_2,R$5,0))&IF(TYPE(VLOOKUP($A38,FB_3,R$5,0))=16,\"\",VLOOKUP($A38,FB_3,R$5,0))&IF(TYPE(VLOOKUP($A38,FB_4,R$5,0))=16,\"\",VLOOKUP($A38,FB_4,R$5,0))&IF(TYPE(VLOOKUP($A38,FB_5,R$5,0))=16,\"\",VLOOKUP($A38,FB_5,R$5,0))&IF(TYPE(VLOOKUP($A38,FB_6,R$5,0))=16,\"\",VLOOKUP($A38,FB_6,R$5,0))&IF(TYPE(VLOOKUP($A38,FB_7,R$5,0))=16,\"\",VLOOKUP($A38,FB_7,R$5,0))&IF(TYPE(VLOOKUP($A38,FB_8,R$5,0))=16,\"\",VLOOKUP($A38,FB_8,R$5,0))&IF(TYPE(VLOOKUP($A38,FB_9,R$5,0))=16,\"\",VLOOKUP($A38,FB_9,R$5,0))&IF(TYPE(VLOOKUP($A38,FB_10,R$5,0))=16,\"\",VLOOKUP($A38,FB_10,R$5,0))&IF(TYPE(VLOOKUP($A38,FB_11,R$5,0))=16,\"\",VLOOKUP($A38,FB_11,R$5,0))&IF(TYPE(VLOOKUP($A38,FB_12,R$5,0))=16,\"\",VLOOKUP($A38,FB_12,R$5,0))&IF(TYPE(VLOOKUP($A38,FB_13,R$5,0))=16,\"\",VLOOKUP($A38,FB_13,R$5,0))&IF(TYPE(VLOOKUP($A38,FB_14,R$5,0))=16,\"\",VLOOKUP($A38,FB_14,R$5,0))&IF(TYPE(VLOOKUP($A38,FB_15,R$5,0))=16,\"\",VLOOKUP($A38,FB_15,R$5,0))&IF(TYPE(VLOOKUP($A38,FB_16,R$5,0))=16,\"\",VLOOKUP($A38,FB_16,R$5,0))&IF(TYPE(VLOOKUP($A38,FB_17,R$5,0))=16,\"\",VLOOKUP($A38,FB_17,R$5,0))&IF(TYPE(VLOOKUP($A38,FB_18,R$5,0))=16,\"\",VLOOKUP($A38,FB_18,R$5,0))&IF(TYPE(VLOOKUP($A38,FB_19,R$5,0))=16,\"\",VLOOKUP($A38,FB_19,R$5,0))&IF(TYPE(VLOOKUP($A38,FB_20,R$5,0))=16,\"\",VLOOKUP($A38,FB_20,R$5,0))&IF(TYPE(VLOOKUP($A38,FB_21,R$5,0))=16,\"\",VLOOKUP($A38,FB_21,R$5,0))&IF(TYPE(VLOOKUP($A38,FB_22,R$5,0))=16,\"\",VLOOKUP($A38,FB_22,R$5,0))&IF(TYPE(VLOOKUP($A38,FB_23,R$5,0))=16,\"\",VLOOKUP($A38,FB_23,R$5,0))&IF(TYPE(VLOOKUP($A38,FB_24,R$5,0))=16,\"\",VLOOKUP($A38,FB_24,R$5,0))&IF(TYPE(VLOOKUP($A38,FB_25,R$5,0))=16,\"\",VLOOKUP($A38,FB_25,R$5,0))&IF(TYPE(VLOOKUP($A38,FB_26,R$5,0))=16,\"\",VLOOKUP($A38,FB_26,R$5,0))&IF(TYPE(VLOOKUP($A38,FB_27,R$5,0))=16,\"\",VLOOKUP($A38,FB_27,R$5,0))&IF(TYPE(VLOOKUP($A38,FB_28,R$5,0))=16,\"\",VLOOKUP($A38,FB_28,R$5,0))&IF(TYPE(VLOOKUP($A38,FB_29,R$5,0))=16,\"\",VLOOKUP($A38,FB_29,R$5,0))&IF(TYPE(VLOOKUP($A38,FB_30,R$5,0))=16,\"\",VLOOKUP($A38,FB_30,R$5,0))))","v":""},{"$f":"IF($B38=\"\",\"\",IF(TYPE(VLOOKUP($A38,FB_1,S$5,0))=16,\"\",VLOOKUP($A38,FB_1,S$5,0))&IF(TYPE(VLOOKUP($A38,FB_2,S$5,0))=16,\"\",VLOOKUP($A38,FB_2,S$5,0))&IF(TYPE(VLOOKUP($A38,FB_3,S$5,0))=16,\"\",VLOOKUP($A38,FB_3,S$5,0))&IF(TYPE(VLOOKUP($A38,FB_4,S$5,0))=16,\"\",VLOOKUP($A38,FB_4,S$5,0))&IF(TYPE(VLOOKUP($A38,FB_5,S$5,0))=16,\"\",VLOOKUP($A38,FB_5,S$5,0))&IF(TYPE(VLOOKUP($A38,FB_6,S$5,0))=16,\"\",VLOOKUP($A38,FB_6,S$5,0))&IF(TYPE(VLOOKUP($A38,FB_7,S$5,0))=16,\"\",VLOOKUP($A38,FB_7,S$5,0))&IF(TYPE(VLOOKUP($A38,FB_8,S$5,0))=16,\"\",VLOOKUP($A38,FB_8,S$5,0))&IF(TYPE(VLOOKUP($A38,FB_9,S$5,0))=16,\"\",VLOOKUP($A38,FB_9,S$5,0))&IF(TYPE(VLOOKUP($A38,FB_10,S$5,0))=16,\"\",VLOOKUP($A38,FB_10,S$5,0))&IF(TYPE(VLOOKUP($A38,FB_11,S$5,0))=16,\"\",VLOOKUP($A38,FB_11,S$5,0))&IF(TYPE(VLOOKUP($A38,FB_12,S$5,0))=16,\"\",VLOOKUP($A38,FB_12,S$5,0))&IF(TYPE(VLOOKUP($A38,FB_13,S$5,0))=16,\"\",VLOOKUP($A38,FB_13,S$5,0))&IF(TYPE(VLOOKUP($A38,FB_14,S$5,0))=16,\"\",VLOOKUP($A38,FB_14,S$5,0))&IF(TYPE(VLOOKUP($A38,FB_15,S$5,0))=16,\"\",VLOOKUP($A38,FB_15,S$5,0))&IF(TYPE(VLOOKUP($A38,FB_16,S$5,0))=16,\"\",VLOOKUP($A38,FB_16,S$5,0))&IF(TYPE(VLOOKUP($A38,FB_17,S$5,0))=16,\"\",VLOOKUP($A38,FB_17,S$5,0))&IF(TYPE(VLOOKUP($A38,FB_18,S$5,0))=16,\"\",VLOOKUP($A38,FB_18,S$5,0))&IF(TYPE(VLOOKUP($A38,FB_19,S$5,0))=16,\"\",VLOOKUP($A38,FB_19,S$5,0))&IF(TYPE(VLOOKUP($A38,FB_20,S$5,0))=16,\"\",VLOOKUP($A38,FB_20,S$5,0))&IF(TYPE(VLOOKUP($A38,FB_21,S$5,0))=16,\"\",VLOOKUP($A38,FB_21,S$5,0))&IF(TYPE(VLOOKUP($A38,FB_22,S$5,0))=16,\"\",VLOOKUP($A38,FB_22,S$5,0))&IF(TYPE(VLOOKUP($A38,FB_23,S$5,0))=16,\"\",VLOOKUP($A38,FB_23,S$5,0))&IF(TYPE(VLOOKUP($A38,FB_24,S$5,0))=16,\"\",VLOOKUP($A38,FB_24,S$5,0))&IF(TYPE(VLOOKUP($A38,FB_25,S$5,0))=16,\"\",VLOOKUP($A38,FB_25,S$5,0))&IF(TYPE(VLOOKUP($A38,FB_26,S$5,0))=16,\"\",VLOOKUP($A38,FB_26,S$5,0))&IF(TYPE(VLOOKUP($A38,FB_27,S$5,0))=16,\"\",VLOOKUP($A38,FB_27,S$5,0))&IF(TYPE(VLOOKUP($A38,FB_28,S$5,0))=16,\"\",VLOOKUP($A38,FB_28,S$5,0))&IF(TYPE(VLOOKUP($A38,FB_29,S$5,0))=16,\"\",VLOOKUP($A38,FB_29,S$5,0))&IF(TYPE(VLOOKUP($A38,FB_30,S$5,0))=16,\"\",VLOOKUP($A38,FB_30,S$5,0)))","v":""},null,null,null,null,null,null,null,null,null,null,null,null,null,null,null,null,"",":","","",""]
["10.",{"$f":"IF(TYPE(VLOOKUP($A39,FB_1,2,0))=16,\"\",VLOOKUP($A39,FB_1,2,0))&IF(TYPE(VLOOKUP($A39,FB_2,2,0))=16,\"\",VLOOKUP($A39,FB_2,2,0))&IF(TYPE(VLOOKUP($A39,FB_3,2,0))=16,\"\",VLOOKUP($A39,FB_3,2,0))&IF(TYPE(VLOOKUP($A39,FB_4,2,0))=16,\"\",VLOOKUP($A39,FB_4,2,0))&IF(TYPE(VLOOKUP($A39,FB_5,2,0))=16,\"\",VLOOKUP($A39,FB_5,2,0))&IF(TYPE(VLOOKUP($A39,FB_6,2,0))=16,\"\",VLOOKUP($A39,FB_6,2,0))&IF(TYPE(VLOOKUP($A39,FB_7,2,0))=16,\"\",VLOOKUP($A39,FB_7,2,0))&IF(TYPE(VLOOKUP($A39,FB_8,2,0))=16,\"\",VLOOKUP($A39,FB_8,2,0))&IF(TYPE(VLOOKUP($A39,FB_9,2,0))=16,\"\",VLOOKUP($A39,FB_9,2,0))&IF(TYPE(VLOOKUP($A39,FB_10,2,0))=16,\"\",VLOOKUP($A39,FB_10,2,0))&IF(TYPE(VLOOKUP($A39,FB_11,2,0))=16,\"\",VLOOKUP($A39,FB_11,2,0))&IF(TYPE(VLOOKUP($A39,FB_12,2,0))=16,\"\",VLOOKUP($A39,FB_12,2,0))&IF(TYPE(VLOOKUP($A39,FB_13,2,0))=16,\"\",VLOOKUP($A39,FB_13,2,0))&IF(TYPE(VLOOKUP($A39,FB_14,2,0))=16,\"\",VLOOKUP($A39,FB_14,2,0))&IF(TYPE(VLOOKUP($A39,FB_15,2,0))=16,\"\",VLOOKUP($A39,FB_15,2,0))&IF(TYPE(VLOOKUP($A39,FB_16,2,0))=16,\"\",VLOOKUP($A39,FB_16,2,0))&IF(TYPE(VLOOKUP($A39,FB_17,2,0))=16,\"\",VLOOKUP($A39,FB_17,2,0))&IF(TYPE(VLOOKUP($A39,FB_18,2,0))=16,\"\",VLOOKUP($A39,FB_18,2,0))&IF(TYPE(VLOOKUP($A39,FB_19,2,0))=16,\"\",VLOOKUP($A39,FB_19,2,0))&IF(TYPE(VLOOKUP($A39,FB_20,2,0))=16,\"\",VLOOKUP($A39,FB_20,2,0))&IF(TYPE(VLOOKUP($A39,FB_21,2,0))=16,\"\",VLOOKUP($A39,FB_21,2,0))&IF(TYPE(VLOOKUP($A39,FB_22,2,0))=16,\"\",VLOOKUP($A39,FB_22,2,0))&IF(TYPE(VLOOKUP($A39,FB_23,2,0))=16,\"\",VLOOKUP($A39,FB_23,2,0))&IF(TYPE(VLOOKUP($A39,FB_24,2,0))=16,\"\",VLOOKUP($A39,FB_24,2,0))&IF(TYPE(VLOOKUP($A39,FB_25,2,0))=16,\"\",VLOOKUP($A39,FB_25,2,0))&IF(TYPE(VLOOKUP($A39,FB_26,2,0))=16,\"\",VLOOKUP($A39,FB_26,2,0))&IF(TYPE(VLOOKUP($A39,FB_27,2,0))=16,\"\",VLOOKUP($A39,FB_27,2,0))&IF(TYPE(VLOOKUP($A39,FB_28,2,0))=16,\"\",VLOOKUP($A39,FB_28,2,0))&IF(TYPE(VLOOKUP($A39,FB_29,2,0))=16,\"\",VLOOKUP($A39,FB_29,2,0))&IF(TYPE(VLOOKUP($A39,FB_30,2,0))=16,\"\",VLOOKUP($A39,FB_30,2,0))","v":""},null,{"$f":"IF($B39=\"\",\"\",_xlfn.NUMBERVALUE(IF(TYPE(VLOOKUP($A39,FB_1,P$5,0))=16,\"\",VLOOKUP($A39,FB_1,P$5,0))&IF(TYPE(VLOOKUP($A39,FB_2,P$5,0))=16,\"\",VLOOKUP($A39,FB_2,P$5,0))&IF(TYPE(VLOOKUP($A39,FB_3,P$5,0))=16,\"\",VLOOKUP($A39,FB_3,P$5,0))&IF(TYPE(VLOOKUP($A39,FB_4,P$5,0))=16,\"\",VLOOKUP($A39,FB_4,P$5,0))&IF(TYPE(VLOOKUP($A39,FB_5,P$5,0))=16,\"\",VLOOKUP($A39,FB_5,P$5,0))&IF(TYPE(VLOOKUP($A39,FB_6,P$5,0))=16,\"\",VLOOKUP($A39,FB_6,P$5,0))&IF(TYPE(VLOOKUP($A39,FB_7,P$5,0))=16,\"\",VLOOKUP($A39,FB_7,P$5,0))&IF(TYPE(VLOOKUP($A39,FB_8,P$5,0))=16,\"\",VLOOKUP($A39,FB_8,P$5,0))&IF(TYPE(VLOOKUP($A39,FB_9,P$5,0))=16,\"\",VLOOKUP($A39,FB_9,P$5,0))&IF(TYPE(VLOOKUP($A39,FB_10,P$5,0))=16,\"\",VLOOKUP($A39,FB_10,P$5,0))&IF(TYPE(VLOOKUP($A39,FB_11,P$5,0))=16,\"\",VLOOKUP($A39,FB_11,P$5,0))&IF(TYPE(VLOOKUP($A39,FB_12,P$5,0))=16,\"\",VLOOKUP($A39,FB_12,P$5,0))&IF(TYPE(VLOOKUP($A39,FB_13,P$5,0))=16,\"\",VLOOKUP($A39,FB_13,P$5,0))&IF(TYPE(VLOOKUP($A39,FB_14,P$5,0))=16,\"\",VLOOKUP($A39,FB_14,P$5,0))&IF(TYPE(VLOOKUP($A39,FB_15,P$5,0))=16,\"\",VLOOKUP($A39,FB_15,P$5,0))&IF(TYPE(VLOOKUP($A39,FB_16,P$5,0))=16,\"\",VLOOKUP($A39,FB_16,P$5,0))&IF(TYPE(VLOOKUP($A39,FB_17,P$5,0))=16,\"\",VLOOKUP($A39,FB_17,P$5,0))&IF(TYPE(VLOOKUP($A39,FB_18,P$5,0))=16,\"\",VLOOKUP($A39,FB_18,P$5,0))&IF(TYPE(VLOOKUP($A39,FB_19,P$5,0))=16,\"\",VLOOKUP($A39,FB_19,P$5,0))&IF(TYPE(VLOOKUP($A39,FB_20,P$5,0))=16,\"\",VLOOKUP($A39,FB_20,P$5,0))&IF(TYPE(VLOOKUP($A39,FB_21,P$5,0))=16,\"\",VLOOKUP($A39,FB_21,P$5,0))&IF(TYPE(VLOOKUP($A39,FB_22,P$5,0))=16,\"\",VLOOKUP($A39,FB_22,P$5,0))&IF(TYPE(VLOOKUP($A39,FB_23,P$5,0))=16,\"\",VLOOKUP($A39,FB_23,P$5,0))&IF(TYPE(VLOOKUP($A39,FB_24,P$5,0))=16,\"\",VLOOKUP($A39,FB_24,P$5,0))&IF(TYPE(VLOOKUP($A39,FB_25,P$5,0))=16,\"\",VLOOKUP($A39,FB_25,P$5,0))&IF(TYPE(VLOOKUP($A39,FB_26,P$5,0))=16,\"\",VLOOKUP($A39,FB_26,P$5,0))&IF(TYPE(VLOOKUP($A39,FB_27,P$5,0))=16,\"\",VLOOKUP($A39,FB_27,P$5,0))&IF(TYPE(VLOOKUP($A39,FB_28,P$5,0))=16,\"\",VLOOKUP($A39,FB_28,P$5,0))&IF(TYPE(VLOOKUP($A39,FB_29,P$5,0))=16,\"\",VLOOKUP($A39,FB_29,P$5,0))&IF(TYPE(VLOOKUP($A39,FB_30,P$5,0))=16,\"\",VLOOKUP($A39,FB_30,P$5,0))))","v":""},"",{"$f":"IF($B39=\"\",\"\",_xlfn.NUMBERVALUE(IF(TYPE(VLOOKUP($A39,FB_1,R$5,0))=16,\"\",VLOOKUP($A39,FB_1,R$5,0))&IF(TYPE(VLOOKUP($A39,FB_2,R$5,0))=16,\"\",VLOOKUP($A39,FB_2,R$5,0))&IF(TYPE(VLOOKUP($A39,FB_3,R$5,0))=16,\"\",VLOOKUP($A39,FB_3,R$5,0))&IF(TYPE(VLOOKUP($A39,FB_4,R$5,0))=16,\"\",VLOOKUP($A39,FB_4,R$5,0))&IF(TYPE(VLOOKUP($A39,FB_5,R$5,0))=16,\"\",VLOOKUP($A39,FB_5,R$5,0))&IF(TYPE(VLOOKUP($A39,FB_6,R$5,0))=16,\"\",VLOOKUP($A39,FB_6,R$5,0))&IF(TYPE(VLOOKUP($A39,FB_7,R$5,0))=16,\"\",VLOOKUP($A39,FB_7,R$5,0))&IF(TYPE(VLOOKUP($A39,FB_8,R$5,0))=16,\"\",VLOOKUP($A39,FB_8,R$5,0))&IF(TYPE(VLOOKUP($A39,FB_9,R$5,0))=16,\"\",VLOOKUP($A39,FB_9,R$5,0))&IF(TYPE(VLOOKUP($A39,FB_10,R$5,0))=16,\"\",VLOOKUP($A39,FB_10,R$5,0))&IF(TYPE(VLOOKUP($A39,FB_11,R$5,0))=16,\"\",VLOOKUP($A39,FB_11,R$5,0))&IF(TYPE(VLOOKUP($A39,FB_12,R$5,0))=16,\"\",VLOOKUP($A39,FB_12,R$5,0))&IF(TYPE(VLOOKUP($A39,FB_13,R$5,0))=16,\"\",VLOOKUP($A39,FB_13,R$5,0))&IF(TYPE(VLOOKUP($A39,FB_14,R$5,0))=16,\"\",VLOOKUP($A39,FB_14,R$5,0))&IF(TYPE(VLOOKUP($A39,FB_15,R$5,0))=16,\"\",VLOOKUP($A39,FB_15,R$5,0))&IF(TYPE(VLOOKUP($A39,FB_16,R$5,0))=16,\"\",VLOOKUP($A39,FB_16,R$5,0))&IF(TYPE(VLOOKUP($A39,FB_17,R$5,0))=16,\"\",VLOOKUP($A39,FB_17,R$5,0))&IF(TYPE(VLOOKUP($A39,FB_18,R$5,0))=16,\"\",VLOOKUP($A39,FB_18,R$5,0))&IF(TYPE(VLOOKUP($A39,FB_19,R$5,0))=16,\"\",VLOOKUP($A39,FB_19,R$5,0))&IF(TYPE(VLOOKUP($A39,FB_20,R$5,0))=16,\"\",VLOOKUP($A39,FB_20,R$5,0))&IF(TYPE(VLOOKUP($A39,FB_21,R$5,0))=16,\"\",VLOOKUP($A39,FB_21,R$5,0))&IF(TYPE(VLOOKUP($A39,FB_22,R$5,0))=16,\"\",VLOOKUP($A39,FB_22,R$5,0))&IF(TYPE(VLOOKUP($A39,FB_23,R$5,0))=16,\"\",VLOOKUP($A39,FB_23,R$5,0))&IF(TYPE(VLOOKUP($A39,FB_24,R$5,0))=16,\"\",VLOOKUP($A39,FB_24,R$5,0))&IF(TYPE(VLOOKUP($A39,FB_25,R$5,0))=16,\"\",VLOOKUP($A39,FB_25,R$5,0))&IF(TYPE(VLOOKUP($A39,FB_26,R$5,0))=16,\"\",VLOOKUP($A39,FB_26,R$5,0))&IF(TYPE(VLOOKUP($A39,FB_27,R$5,0))=16,\"\",VLOOKUP($A39,FB_27,R$5,0))&IF(TYPE(VLOOKUP($A39,FB_28,R$5,0))=16,\"\",VLOOKUP($A39,FB_28,R$5,0))&IF(TYPE(VLOOKUP($A39,FB_29,R$5,0))=16,\"\",VLOOKUP($A39,FB_29,R$5,0))&IF(TYPE(VLOOKUP($A39,FB_30,R$5,0))=16,\"\",VLOOKUP($A39,FB_30,R$5,0))))","v":""},{"$f":"IF($B39=\"\",\"\",IF(TYPE(VLOOKUP($A39,FB_1,S$5,0))=16,\"\",VLOOKUP($A39,FB_1,S$5,0))&IF(TYPE(VLOOKUP($A39,FB_2,S$5,0))=16,\"\",VLOOKUP($A39,FB_2,S$5,0))&IF(TYPE(VLOOKUP($A39,FB_3,S$5,0))=16,\"\",VLOOKUP($A39,FB_3,S$5,0))&IF(TYPE(VLOOKUP($A39,FB_4,S$5,0))=16,\"\",VLOOKUP($A39,FB_4,S$5,0))&IF(TYPE(VLOOKUP($A39,FB_5,S$5,0))=16,\"\",VLOOKUP($A39,FB_5,S$5,0))&IF(TYPE(VLOOKUP($A39,FB_6,S$5,0))=16,\"\",VLOOKUP($A39,FB_6,S$5,0))&IF(TYPE(VLOOKUP($A39,FB_7,S$5,0))=16,\"\",VLOOKUP($A39,FB_7,S$5,0))&IF(TYPE(VLOOKUP($A39,FB_8,S$5,0))=16,\"\",VLOOKUP($A39,FB_8,S$5,0))&IF(TYPE(VLOOKUP($A39,FB_9,S$5,0))=16,\"\",VLOOKUP($A39,FB_9,S$5,0))&IF(TYPE(VLOOKUP($A39,FB_10,S$5,0))=16,\"\",VLOOKUP($A39,FB_10,S$5,0))&IF(TYPE(VLOOKUP($A39,FB_11,S$5,0))=16,\"\",VLOOKUP($A39,FB_11,S$5,0))&IF(TYPE(VLOOKUP($A39,FB_12,S$5,0))=16,\"\",VLOOKUP($A39,FB_12,S$5,0))&IF(TYPE(VLOOKUP($A39,FB_13,S$5,0))=16,\"\",VLOOKUP($A39,FB_13,S$5,0))&IF(TYPE(VLOOKUP($A39,FB_14,S$5,0))=16,\"\",VLOOKUP($A39,FB_14,S$5,0))&IF(TYPE(VLOOKUP($A39,FB_15,S$5,0))=16,\"\",VLOOKUP($A39,FB_15,S$5,0))&IF(TYPE(VLOOKUP($A39,FB_16,S$5,0))=16,\"\",VLOOKUP($A39,FB_16,S$5,0))&IF(TYPE(VLOOKUP($A39,FB_17,S$5,0))=16,\"\",VLOOKUP($A39,FB_17,S$5,0))&IF(TYPE(VLOOKUP($A39,FB_18,S$5,0))=16,\"\",VLOOKUP($A39,FB_18,S$5,0))&IF(TYPE(VLOOKUP($A39,FB_19,S$5,0))=16,\"\",VLOOKUP($A39,FB_19,S$5,0))&IF(TYPE(VLOOKUP($A39,FB_20,S$5,0))=16,\"\",VLOOKUP($A39,FB_20,S$5,0))&IF(TYPE(VLOOKUP($A39,FB_21,S$5,0))=16,\"\",VLOOKUP($A39,FB_21,S$5,0))&IF(TYPE(VLOOKUP($A39,FB_22,S$5,0))=16,\"\",VLOOKUP($A39,FB_22,S$5,0))&IF(TYPE(VLOOKUP($A39,FB_23,S$5,0))=16,\"\",VLOOKUP($A39,FB_23,S$5,0))&IF(TYPE(VLOOKUP($A39,FB_24,S$5,0))=16,\"\",VLOOKUP($A39,FB_24,S$5,0))&IF(TYPE(VLOOKUP($A39,FB_25,S$5,0))=16,\"\",VLOOKUP($A39,FB_25,S$5,0))&IF(TYPE(VLOOKUP($A39,FB_26,S$5,0))=16,\"\",VLOOKUP($A39,FB_26,S$5,0))&IF(TYPE(VLOOKUP($A39,FB_27,S$5,0))=16,\"\",VLOOKUP($A39,FB_27,S$5,0))&IF(TYPE(VLOOKUP($A39,FB_28,S$5,0))=16,\"\",VLOOKUP($A39,FB_28,S$5,0))&IF(TYPE(VLOOKUP($A39,FB_29,S$5,0))=16,\"\",VLOOKUP($A39,FB_29,S$5,0))&IF(TYPE(VLOOKUP($A39,FB_30,S$5,0))=16,\"\",VLOOKUP($A39,FB_30,S$5,0)))","v":""},null,null,null,null,null,null,null,null,null,null,null,null,null,null,null,null,"",":","","",""]
["11.",{"$f":"IF(TYPE(VLOOKUP($A40,FB_1,2,0))=16,\"\",VLOOKUP($A40,FB_1,2,0))&IF(TYPE(VLOOKUP($A40,FB_2,2,0))=16,\"\",VLOOKUP($A40,FB_2,2,0))&IF(TYPE(VLOOKUP($A40,FB_3,2,0))=16,\"\",VLOOKUP($A40,FB_3,2,0))&IF(TYPE(VLOOKUP($A40,FB_4,2,0))=16,\"\",VLOOKUP($A40,FB_4,2,0))&IF(TYPE(VLOOKUP($A40,FB_5,2,0))=16,\"\",VLOOKUP($A40,FB_5,2,0))&IF(TYPE(VLOOKUP($A40,FB_6,2,0))=16,\"\",VLOOKUP($A40,FB_6,2,0))&IF(TYPE(VLOOKUP($A40,FB_7,2,0))=16,\"\",VLOOKUP($A40,FB_7,2,0))&IF(TYPE(VLOOKUP($A40,FB_8,2,0))=16,\"\",VLOOKUP($A40,FB_8,2,0))&IF(TYPE(VLOOKUP($A40,FB_9,2,0))=16,\"\",VLOOKUP($A40,FB_9,2,0))&IF(TYPE(VLOOKUP($A40,FB_10,2,0))=16,\"\",VLOOKUP($A40,FB_10,2,0))&IF(TYPE(VLOOKUP($A40,FB_11,2,0))=16,\"\",VLOOKUP($A40,FB_11,2,0))&IF(TYPE(VLOOKUP($A40,FB_12,2,0))=16,\"\",VLOOKUP($A40,FB_12,2,0))&IF(TYPE(VLOOKUP($A40,FB_13,2,0))=16,\"\",VLOOKUP($A40,FB_13,2,0))&IF(TYPE(VLOOKUP($A40,FB_14,2,0))=16,\"\",VLOOKUP($A40,FB_14,2,0))&IF(TYPE(VLOOKUP($A40,FB_15,2,0))=16,\"\",VLOOKUP($A40,FB_15,2,0))&IF(TYPE(VLOOKUP($A40,FB_16,2,0))=16,\"\",VLOOKUP($A40,FB_16,2,0))&IF(TYPE(VLOOKUP($A40,FB_17,2,0))=16,\"\",VLOOKUP($A40,FB_17,2,0))&IF(TYPE(VLOOKUP($A40,FB_18,2,0))=16,\"\",VLOOKUP($A40,FB_18,2,0))&IF(TYPE(VLOOKUP($A40,FB_19,2,0))=16,\"\",VLOOKUP($A40,FB_19,2,0))&IF(TYPE(VLOOKUP($A40,FB_20,2,0))=16,\"\",VLOOKUP($A40,FB_20,2,0))&IF(TYPE(VLOOKUP($A40,FB_21,2,0))=16,\"\",VLOOKUP($A40,FB_21,2,0))&IF(TYPE(VLOOKUP($A40,FB_22,2,0))=16,\"\",VLOOKUP($A40,FB_22,2,0))&IF(TYPE(VLOOKUP($A40,FB_23,2,0))=16,\"\",VLOOKUP($A40,FB_23,2,0))&IF(TYPE(VLOOKUP($A40,FB_24,2,0))=16,\"\",VLOOKUP($A40,FB_24,2,0))&IF(TYPE(VLOOKUP($A40,FB_25,2,0))=16,\"\",VLOOKUP($A40,FB_25,2,0))&IF(TYPE(VLOOKUP($A40,FB_26,2,0))=16,\"\",VLOOKUP($A40,FB_26,2,0))&IF(TYPE(VLOOKUP($A40,FB_27,2,0))=16,\"\",VLOOKUP($A40,FB_27,2,0))&IF(TYPE(VLOOKUP($A40,FB_28,2,0))=16,\"\",VLOOKUP($A40,FB_28,2,0))&IF(TYPE(VLOOKUP($A40,FB_29,2,0))=16,\"\",VLOOKUP($A40,FB_29,2,0))&IF(TYPE(VLOOKUP($A40,FB_30,2,0))=16,\"\",VLOOKUP($A40,FB_30,2,0))","v":""},null,{"$f":"IF($B40=\"\",\"\",_xlfn.NUMBERVALUE(IF(TYPE(VLOOKUP($A40,FB_1,P$5,0))=16,\"\",VLOOKUP($A40,FB_1,P$5,0))&IF(TYPE(VLOOKUP($A40,FB_2,P$5,0))=16,\"\",VLOOKUP($A40,FB_2,P$5,0))&IF(TYPE(VLOOKUP($A40,FB_3,P$5,0))=16,\"\",VLOOKUP($A40,FB_3,P$5,0))&IF(TYPE(VLOOKUP($A40,FB_4,P$5,0))=16,\"\",VLOOKUP($A40,FB_4,P$5,0))&IF(TYPE(VLOOKUP($A40,FB_5,P$5,0))=16,\"\",VLOOKUP($A40,FB_5,P$5,0))&IF(TYPE(VLOOKUP($A40,FB_6,P$5,0))=16,\"\",VLOOKUP($A40,FB_6,P$5,0))&IF(TYPE(VLOOKUP($A40,FB_7,P$5,0))=16,\"\",VLOOKUP($A40,FB_7,P$5,0))&IF(TYPE(VLOOKUP($A40,FB_8,P$5,0))=16,\"\",VLOOKUP($A40,FB_8,P$5,0))&IF(TYPE(VLOOKUP($A40,FB_9,P$5,0))=16,\"\",VLOOKUP($A40,FB_9,P$5,0))&IF(TYPE(VLOOKUP($A40,FB_10,P$5,0))=16,\"\",VLOOKUP($A40,FB_10,P$5,0))&IF(TYPE(VLOOKUP($A40,FB_11,P$5,0))=16,\"\",VLOOKUP($A40,FB_11,P$5,0))&IF(TYPE(VLOOKUP($A40,FB_12,P$5,0))=16,\"\",VLOOKUP($A40,FB_12,P$5,0))&IF(TYPE(VLOOKUP($A40,FB_13,P$5,0))=16,\"\",VLOOKUP($A40,FB_13,P$5,0))&IF(TYPE(VLOOKUP($A40,FB_14,P$5,0))=16,\"\",VLOOKUP($A40,FB_14,P$5,0))&IF(TYPE(VLOOKUP($A40,FB_15,P$5,0))=16,\"\",VLOOKUP($A40,FB_15,P$5,0))&IF(TYPE(VLOOKUP($A40,FB_16,P$5,0))=16,\"\",VLOOKUP($A40,FB_16,P$5,0))&IF(TYPE(VLOOKUP($A40,FB_17,P$5,0))=16,\"\",VLOOKUP($A40,FB_17,P$5,0))&IF(TYPE(VLOOKUP($A40,FB_18,P$5,0))=16,\"\",VLOOKUP($A40,FB_18,P$5,0))&IF(TYPE(VLOOKUP($A40,FB_19,P$5,0))=16,\"\",VLOOKUP($A40,FB_19,P$5,0))&IF(TYPE(VLOOKUP($A40,FB_20,P$5,0))=16,\"\",VLOOKUP($A40,FB_20,P$5,0))&IF(TYPE(VLOOKUP($A40,FB_21,P$5,0))=16,\"\",VLOOKUP($A40,FB_21,P$5,0))&IF(TYPE(VLOOKUP($A40,FB_22,P$5,0))=16,\"\",VLOOKUP($A40,FB_22,P$5,0))&IF(TYPE(VLOOKUP($A40,FB_23,P$5,0))=16,\"\",VLOOKUP($A40,FB_23,P$5,0))&IF(TYPE(VLOOKUP($A40,FB_24,P$5,0))=16,\"\",VLOOKUP($A40,FB_24,P$5,0))&IF(TYPE(VLOOKUP($A40,FB_25,P$5,0))=16,\"\",VLOOKUP($A40,FB_25,P$5,0))&IF(TYPE(VLOOKUP($A40,FB_26,P$5,0))=16,\"\",VLOOKUP($A40,FB_26,P$5,0))&IF(TYPE(VLOOKUP($A40,FB_27,P$5,0))=16,\"\",VLOOKUP($A40,FB_27,P$5,0))&IF(TYPE(VLOOKUP($A40,FB_28,P$5,0))=16,\"\",VLOOKUP($A40,FB_28,P$5,0))&IF(TYPE(VLOOKUP($A40,FB_29,P$5,0))=16,\"\",VLOOKUP($A40,FB_29,P$5,0))&IF(TYPE(VLOOKUP($A40,FB_30,P$5,0))=16,\"\",VLOOKUP($A40,FB_30,P$5,0))))","v":""},"",{"$f":"IF($B40=\"\",\"\",_xlfn.NUMBERVALUE(IF(TYPE(VLOOKUP($A40,FB_1,R$5,0))=16,\"\",VLOOKUP($A40,FB_1,R$5,0))&IF(TYPE(VLOOKUP($A40,FB_2,R$5,0))=16,\"\",VLOOKUP($A40,FB_2,R$5,0))&IF(TYPE(VLOOKUP($A40,FB_3,R$5,0))=16,\"\",VLOOKUP($A40,FB_3,R$5,0))&IF(TYPE(VLOOKUP($A40,FB_4,R$5,0))=16,\"\",VLOOKUP($A40,FB_4,R$5,0))&IF(TYPE(VLOOKUP($A40,FB_5,R$5,0))=16,\"\",VLOOKUP($A40,FB_5,R$5,0))&IF(TYPE(VLOOKUP($A40,FB_6,R$5,0))=16,\"\",VLOOKUP($A40,FB_6,R$5,0))&IF(TYPE(VLOOKUP($A40,FB_7,R$5,0))=16,\"\",VLOOKUP($A40,FB_7,R$5,0))&IF(TYPE(VLOOKUP($A40,FB_8,R$5,0))=16,\"\",VLOOKUP($A40,FB_8,R$5,0))&IF(TYPE(VLOOKUP($A40,FB_9,R$5,0))=16,\"\",VLOOKUP($A40,FB_9,R$5,0))&IF(TYPE(VLOOKUP($A40,FB_10,R$5,0))=16,\"\",VLOOKUP($A40,FB_10,R$5,0))&IF(TYPE(VLOOKUP($A40,FB_11,R$5,0))=16,\"\",VLOOKUP($A40,FB_11,R$5,0))&IF(TYPE(VLOOKUP($A40,FB_12,R$5,0))=16,\"\",VLOOKUP($A40,FB_12,R$5,0))&IF(TYPE(VLOOKUP($A40,FB_13,R$5,0))=16,\"\",VLOOKUP($A40,FB_13,R$5,0))&IF(TYPE(VLOOKUP($A40,FB_14,R$5,0))=16,\"\",VLOOKUP($A40,FB_14,R$5,0))&IF(TYPE(VLOOKUP($A40,FB_15,R$5,0))=16,\"\",VLOOKUP($A40,FB_15,R$5,0))&IF(TYPE(VLOOKUP($A40,FB_16,R$5,0))=16,\"\",VLOOKUP($A40,FB_16,R$5,0))&IF(TYPE(VLOOKUP($A40,FB_17,R$5,0))=16,\"\",VLOOKUP($A40,FB_17,R$5,0))&IF(TYPE(VLOOKUP($A40,FB_18,R$5,0))=16,\"\",VLOOKUP($A40,FB_18,R$5,0))&IF(TYPE(VLOOKUP($A40,FB_19,R$5,0))=16,\"\",VLOOKUP($A40,FB_19,R$5,0))&IF(TYPE(VLOOKUP($A40,FB_20,R$5,0))=16,\"\",VLOOKUP($A40,FB_20,R$5,0))&IF(TYPE(VLOOKUP($A40,FB_21,R$5,0))=16,\"\",VLOOKUP($A40,FB_21,R$5,0))&IF(TYPE(VLOOKUP($A40,FB_22,R$5,0))=16,\"\",VLOOKUP($A40,FB_22,R$5,0))&IF(TYPE(VLOOKUP($A40,FB_23,R$5,0))=16,\"\",VLOOKUP($A40,FB_23,R$5,0))&IF(TYPE(VLOOKUP($A40,FB_24,R$5,0))=16,\"\",VLOOKUP($A40,FB_24,R$5,0))&IF(TYPE(VLOOKUP($A40,FB_25,R$5,0))=16,\"\",VLOOKUP($A40,FB_25,R$5,0))&IF(TYPE(VLOOKUP($A40,FB_26,R$5,0))=16,\"\",VLOOKUP($A40,FB_26,R$5,0))&IF(TYPE(VLOOKUP($A40,FB_27,R$5,0))=16,\"\",VLOOKUP($A40,FB_27,R$5,0))&IF(TYPE(VLOOKUP($A40,FB_28,R$5,0))=16,\"\",VLOOKUP($A40,FB_28,R$5,0))&IF(TYPE(VLOOKUP($A40,FB_29,R$5,0))=16,\"\",VLOOKUP($A40,FB_29,R$5,0))&IF(TYPE(VLOOKUP($A40,FB_30,R$5,0))=16,\"\",VLOOKUP($A40,FB_30,R$5,0))))","v":""},{"$f":"IF($B40=\"\",\"\",IF(TYPE(VLOOKUP($A40,FB_1,S$5,0))=16,\"\",VLOOKUP($A40,FB_1,S$5,0))&IF(TYPE(VLOOKUP($A40,FB_2,S$5,0))=16,\"\",VLOOKUP($A40,FB_2,S$5,0))&IF(TYPE(VLOOKUP($A40,FB_3,S$5,0))=16,\"\",VLOOKUP($A40,FB_3,S$5,0))&IF(TYPE(VLOOKUP($A40,FB_4,S$5,0))=16,\"\",VLOOKUP($A40,FB_4,S$5,0))&IF(TYPE(VLOOKUP($A40,FB_5,S$5,0))=16,\"\",VLOOKUP($A40,FB_5,S$5,0))&IF(TYPE(VLOOKUP($A40,FB_6,S$5,0))=16,\"\",VLOOKUP($A40,FB_6,S$5,0))&IF(TYPE(VLOOKUP($A40,FB_7,S$5,0))=16,\"\",VLOOKUP($A40,FB_7,S$5,0))&IF(TYPE(VLOOKUP($A40,FB_8,S$5,0))=16,\"\",VLOOKUP($A40,FB_8,S$5,0))&IF(TYPE(VLOOKUP($A40,FB_9,S$5,0))=16,\"\",VLOOKUP($A40,FB_9,S$5,0))&IF(TYPE(VLOOKUP($A40,FB_10,S$5,0))=16,\"\",VLOOKUP($A40,FB_10,S$5,0))&IF(TYPE(VLOOKUP($A40,FB_11,S$5,0))=16,\"\",VLOOKUP($A40,FB_11,S$5,0))&IF(TYPE(VLOOKUP($A40,FB_12,S$5,0))=16,\"\",VLOOKUP($A40,FB_12,S$5,0))&IF(TYPE(VLOOKUP($A40,FB_13,S$5,0))=16,\"\",VLOOKUP($A40,FB_13,S$5,0))&IF(TYPE(VLOOKUP($A40,FB_14,S$5,0))=16,\"\",VLOOKUP($A40,FB_14,S$5,0))&IF(TYPE(VLOOKUP($A40,FB_15,S$5,0))=16,\"\",VLOOKUP($A40,FB_15,S$5,0))&IF(TYPE(VLOOKUP($A40,FB_16,S$5,0))=16,\"\",VLOOKUP($A40,FB_16,S$5,0))&IF(TYPE(VLOOKUP($A40,FB_17,S$5,0))=16,\"\",VLOOKUP($A40,FB_17,S$5,0))&IF(TYPE(VLOOKUP($A40,FB_18,S$5,0))=16,\"\",VLOOKUP($A40,FB_18,S$5,0))&IF(TYPE(VLOOKUP($A40,FB_19,S$5,0))=16,\"\",VLOOKUP($A40,FB_19,S$5,0))&IF(TYPE(VLOOKUP($A40,FB_20,S$5,0))=16,\"\",VLOOKUP($A40,FB_20,S$5,0))&IF(TYPE(VLOOKUP($A40,FB_21,S$5,0))=16,\"\",VLOOKUP($A40,FB_21,S$5,0))&IF(TYPE(VLOOKUP($A40,FB_22,S$5,0))=16,\"\",VLOOKUP($A40,FB_22,S$5,0))&IF(TYPE(VLOOKUP($A40,FB_23,S$5,0))=16,\"\",VLOOKUP($A40,FB_23,S$5,0))&IF(TYPE(VLOOKUP($A40,FB_24,S$5,0))=16,\"\",VLOOKUP($A40,FB_24,S$5,0))&IF(TYPE(VLOOKUP($A40,FB_25,S$5,0))=16,\"\",VLOOKUP($A40,FB_25,S$5,0))&IF(TYPE(VLOOKUP($A40,FB_26,S$5,0))=16,\"\",VLOOKUP($A40,FB_26,S$5,0))&IF(TYPE(VLOOKUP($A40,FB_27,S$5,0))=16,\"\",VLOOKUP($A40,FB_27,S$5,0))&IF(TYPE(VLOOKUP($A40,FB_28,S$5,0))=16,\"\",VLOOKUP($A40,FB_28,S$5,0))&IF(TYPE(VLOOKUP($A40,FB_29,S$5,0))=16,\"\",VLOOKUP($A40,FB_29,S$5,0))&IF(TYPE(VLOOKUP($A40,FB_30,S$5,0))=16,\"\",VLOOKUP($A40,FB_30,S$5,0)))","v":""},null,null,null,null,null,null,null,null,null,null,null,null,null,null,null,null,"",":","","",""]
["12.",{"$f":"IF(TYPE(VLOOKUP($A41,FB_1,2,0))=16,\"\",VLOOKUP($A41,FB_1,2,0))&IF(TYPE(VLOOKUP($A41,FB_2,2,0))=16,\"\",VLOOKUP($A41,FB_2,2,0))&IF(TYPE(VLOOKUP($A41,FB_3,2,0))=16,\"\",VLOOKUP($A41,FB_3,2,0))&IF(TYPE(VLOOKUP($A41,FB_4,2,0))=16,\"\",VLOOKUP($A41,FB_4,2,0))&IF(TYPE(VLOOKUP($A41,FB_5,2,0))=16,\"\",VLOOKUP($A41,FB_5,2,0))&IF(TYPE(VLOOKUP($A41,FB_6,2,0))=16,\"\",VLOOKUP($A41,FB_6,2,0))&IF(TYPE(VLOOKUP($A41,FB_7,2,0))=16,\"\",VLOOKUP($A41,FB_7,2,0))&IF(TYPE(VLOOKUP($A41,FB_8,2,0))=16,\"\",VLOOKUP($A41,FB_8,2,0))&IF(TYPE(VLOOKUP($A41,FB_9,2,0))=16,\"\",VLOOKUP($A41,FB_9,2,0))&IF(TYPE(VLOOKUP($A41,FB_10,2,0))=16,\"\",VLOOKUP($A41,FB_10,2,0))&IF(TYPE(VLOOKUP($A41,FB_11,2,0))=16,\"\",VLOOKUP($A41,FB_11,2,0))&IF(TYPE(VLOOKUP($A41,FB_12,2,0))=16,\"\",VLOOKUP($A41,FB_12,2,0))&IF(TYPE(VLOOKUP($A41,FB_13,2,0))=16,\"\",VLOOKUP($A41,FB_13,2,0))&IF(TYPE(VLOOKUP($A41,FB_14,2,0))=16,\"\",VLOOKUP($A41,FB_14,2,0))&IF(TYPE(VLOOKUP($A41,FB_15,2,0))=16,\"\",VLOOKUP($A41,FB_15,2,0))&IF(TYPE(VLOOKUP($A41,FB_16,2,0))=16,\"\",VLOOKUP($A41,FB_16,2,0))&IF(TYPE(VLOOKUP($A41,FB_17,2,0))=16,\"\",VLOOKUP($A41,FB_17,2,0))&IF(TYPE(VLOOKUP($A41,FB_18,2,0))=16,\"\",VLOOKUP($A41,FB_18,2,0))&IF(TYPE(VLOOKUP($A41,FB_19,2,0))=16,\"\",VLOOKUP($A41,FB_19,2,0))&IF(TYPE(VLOOKUP($A41,FB_20,2,0))=16,\"\",VLOOKUP($A41,FB_20,2,0))&IF(TYPE(VLOOKUP($A41,FB_21,2,0))=16,\"\",VLOOKUP($A41,FB_21,2,0))&IF(TYPE(VLOOKUP($A41,FB_22,2,0))=16,\"\",VLOOKUP($A41,FB_22,2,0))&IF(TYPE(VLOOKUP($A41,FB_23,2,0))=16,\"\",VLOOKUP($A41,FB_23,2,0))&IF(TYPE(VLOOKUP($A41,FB_24,2,0))=16,\"\",VLOOKUP($A41,FB_24,2,0))&IF(TYPE(VLOOKUP($A41,FB_25,2,0))=16,\"\",VLOOKUP($A41,FB_25,2,0))&IF(TYPE(VLOOKUP($A41,FB_26,2,0))=16,\"\",VLOOKUP($A41,FB_26,2,0))&IF(TYPE(VLOOKUP($A41,FB_27,2,0))=16,\"\",VLOOKUP($A41,FB_27,2,0))&IF(TYPE(VLOOKUP($A41,FB_28,2,0))=16,\"\",VLOOKUP($A41,FB_28,2,0))&IF(TYPE(VLOOKUP($A41,FB_29,2,0))=16,\"\",VLOOKUP($A41,FB_29,2,0))&IF(TYPE(VLOOKUP($A41,FB_30,2,0))=16,\"\",VLOOKUP($A41,FB_30,2,0))","v":""},null,{"$f":"IF($B41=\"\",\"\",_xlfn.NUMBERVALUE(IF(TYPE(VLOOKUP($A41,FB_1,P$5,0))=16,\"\",VLOOKUP($A41,FB_1,P$5,0))&IF(TYPE(VLOOKUP($A41,FB_2,P$5,0))=16,\"\",VLOOKUP($A41,FB_2,P$5,0))&IF(TYPE(VLOOKUP($A41,FB_3,P$5,0))=16,\"\",VLOOKUP($A41,FB_3,P$5,0))&IF(TYPE(VLOOKUP($A41,FB_4,P$5,0))=16,\"\",VLOOKUP($A41,FB_4,P$5,0))&IF(TYPE(VLOOKUP($A41,FB_5,P$5,0))=16,\"\",VLOOKUP($A41,FB_5,P$5,0))&IF(TYPE(VLOOKUP($A41,FB_6,P$5,0))=16,\"\",VLOOKUP($A41,FB_6,P$5,0))&IF(TYPE(VLOOKUP($A41,FB_7,P$5,0))=16,\"\",VLOOKUP($A41,FB_7,P$5,0))&IF(TYPE(VLOOKUP($A41,FB_8,P$5,0))=16,\"\",VLOOKUP($A41,FB_8,P$5,0))&IF(TYPE(VLOOKUP($A41,FB_9,P$5,0))=16,\"\",VLOOKUP($A41,FB_9,P$5,0))&IF(TYPE(VLOOKUP($A41,FB_10,P$5,0))=16,\"\",VLOOKUP($A41,FB_10,P$5,0))&IF(TYPE(VLOOKUP($A41,FB_11,P$5,0))=16,\"\",VLOOKUP($A41,FB_11,P$5,0))&IF(TYPE(VLOOKUP($A41,FB_12,P$5,0))=16,\"\",VLOOKUP($A41,FB_12,P$5,0))&IF(TYPE(VLOOKUP($A41,FB_13,P$5,0))=16,\"\",VLOOKUP($A41,FB_13,P$5,0))&IF(TYPE(VLOOKUP($A41,FB_14,P$5,0))=16,\"\",VLOOKUP($A41,FB_14,P$5,0))&IF(TYPE(VLOOKUP($A41,FB_15,P$5,0))=16,\"\",VLOOKUP($A41,FB_15,P$5,0))&IF(TYPE(VLOOKUP($A41,FB_16,P$5,0))=16,\"\",VLOOKUP($A41,FB_16,P$5,0))&IF(TYPE(VLOOKUP($A41,FB_17,P$5,0))=16,\"\",VLOOKUP($A41,FB_17,P$5,0))&IF(TYPE(VLOOKUP($A41,FB_18,P$5,0))=16,\"\",VLOOKUP($A41,FB_18,P$5,0))&IF(TYPE(VLOOKUP($A41,FB_19,P$5,0))=16,\"\",VLOOKUP($A41,FB_19,P$5,0))&IF(TYPE(VLOOKUP($A41,FB_20,P$5,0))=16,\"\",VLOOKUP($A41,FB_20,P$5,0))&IF(TYPE(VLOOKUP($A41,FB_21,P$5,0))=16,\"\",VLOOKUP($A41,FB_21,P$5,0))&IF(TYPE(VLOOKUP($A41,FB_22,P$5,0))=16,\"\",VLOOKUP($A41,FB_22,P$5,0))&IF(TYPE(VLOOKUP($A41,FB_23,P$5,0))=16,\"\",VLOOKUP($A41,FB_23,P$5,0))&IF(TYPE(VLOOKUP($A41,FB_24,P$5,0))=16,\"\",VLOOKUP($A41,FB_24,P$5,0))&IF(TYPE(VLOOKUP($A41,FB_25,P$5,0))=16,\"\",VLOOKUP($A41,FB_25,P$5,0))&IF(TYPE(VLOOKUP($A41,FB_26,P$5,0))=16,\"\",VLOOKUP($A41,FB_26,P$5,0))&IF(TYPE(VLOOKUP($A41,FB_27,P$5,0))=16,\"\",VLOOKUP($A41,FB_27,P$5,0))&IF(TYPE(VLOOKUP($A41,FB_28,P$5,0))=16,\"\",VLOOKUP($A41,FB_28,P$5,0))&IF(TYPE(VLOOKUP($A41,FB_29,P$5,0))=16,\"\",VLOOKUP($A41,FB_29,P$5,0))&IF(TYPE(VLOOKUP($A41,FB_30,P$5,0))=16,\"\",VLOOKUP($A41,FB_30,P$5,0))))","v":""},"",{"$f":"IF($B41=\"\",\"\",_xlfn.NUMBERVALUE(IF(TYPE(VLOOKUP($A41,FB_1,R$5,0))=16,\"\",VLOOKUP($A41,FB_1,R$5,0))&IF(TYPE(VLOOKUP($A41,FB_2,R$5,0))=16,\"\",VLOOKUP($A41,FB_2,R$5,0))&IF(TYPE(VLOOKUP($A41,FB_3,R$5,0))=16,\"\",VLOOKUP($A41,FB_3,R$5,0))&IF(TYPE(VLOOKUP($A41,FB_4,R$5,0))=16,\"\",VLOOKUP($A41,FB_4,R$5,0))&IF(TYPE(VLOOKUP($A41,FB_5,R$5,0))=16,\"\",VLOOKUP($A41,FB_5,R$5,0))&IF(TYPE(VLOOKUP($A41,FB_6,R$5,0))=16,\"\",VLOOKUP($A41,FB_6,R$5,0))&IF(TYPE(VLOOKUP($A41,FB_7,R$5,0))=16,\"\",VLOOKUP($A41,FB_7,R$5,0))&IF(TYPE(VLOOKUP($A41,FB_8,R$5,0))=16,\"\",VLOOKUP($A41,FB_8,R$5,0))&IF(TYPE(VLOOKUP($A41,FB_9,R$5,0))=16,\"\",VLOOKUP($A41,FB_9,R$5,0))&IF(TYPE(VLOOKUP($A41,FB_10,R$5,0))=16,\"\",VLOOKUP($A41,FB_10,R$5,0))&IF(TYPE(VLOOKUP($A41,FB_11,R$5,0))=16,\"\",VLOOKUP($A41,FB_11,R$5,0))&IF(TYPE(VLOOKUP($A41,FB_12,R$5,0))=16,\"\",VLOOKUP($A41,FB_12,R$5,0))&IF(TYPE(VLOOKUP($A41,FB_13,R$5,0))=16,\"\",VLOOKUP($A41,FB_13,R$5,0))&IF(TYPE(VLOOKUP($A41,FB_14,R$5,0))=16,\"\",VLOOKUP($A41,FB_14,R$5,0))&IF(TYPE(VLOOKUP($A41,FB_15,R$5,0))=16,\"\",VLOOKUP($A41,FB_15,R$5,0))&IF(TYPE(VLOOKUP($A41,FB_16,R$5,0))=16,\"\",VLOOKUP($A41,FB_16,R$5,0))&IF(TYPE(VLOOKUP($A41,FB_17,R$5,0))=16,\"\",VLOOKUP($A41,FB_17,R$5,0))&IF(TYPE(VLOOKUP($A41,FB_18,R$5,0))=16,\"\",VLOOKUP($A41,FB_18,R$5,0))&IF(TYPE(VLOOKUP($A41,FB_19,R$5,0))=16,\"\",VLOOKUP($A41,FB_19,R$5,0))&IF(TYPE(VLOOKUP($A41,FB_20,R$5,0))=16,\"\",VLOOKUP($A41,FB_20,R$5,0))&IF(TYPE(VLOOKUP($A41,FB_21,R$5,0))=16,\"\",VLOOKUP($A41,FB_21,R$5,0))&IF(TYPE(VLOOKUP($A41,FB_22,R$5,0))=16,\"\",VLOOKUP($A41,FB_22,R$5,0))&IF(TYPE(VLOOKUP($A41,FB_23,R$5,0))=16,\"\",VLOOKUP($A41,FB_23,R$5,0))&IF(TYPE(VLOOKUP($A41,FB_24,R$5,0))=16,\"\",VLOOKUP($A41,FB_24,R$5,0))&IF(TYPE(VLOOKUP($A41,FB_25,R$5,0))=16,\"\",VLOOKUP($A41,FB_25,R$5,0))&IF(TYPE(VLOOKUP($A41,FB_26,R$5,0))=16,\"\",VLOOKUP($A41,FB_26,R$5,0))&IF(TYPE(VLOOKUP($A41,FB_27,R$5,0))=16,\"\",VLOOKUP($A41,FB_27,R$5,0))&IF(TYPE(VLOOKUP($A41,FB_28,R$5,0))=16,\"\",VLOOKUP($A41,FB_28,R$5,0))&IF(TYPE(VLOOKUP($A41,FB_29,R$5,0))=16,\"\",VLOOKUP($A41,FB_29,R$5,0))&IF(TYPE(VLOOKUP($A41,FB_30,R$5,0))=16,\"\",VLOOKUP($A41,FB_30,R$5,0))))","v":""},{"$f":"IF($B41=\"\",\"\",IF(TYPE(VLOOKUP($A41,FB_1,S$5,0))=16,\"\",VLOOKUP($A41,FB_1,S$5,0))&IF(TYPE(VLOOKUP($A41,FB_2,S$5,0))=16,\"\",VLOOKUP($A41,FB_2,S$5,0))&IF(TYPE(VLOOKUP($A41,FB_3,S$5,0))=16,\"\",VLOOKUP($A41,FB_3,S$5,0))&IF(TYPE(VLOOKUP($A41,FB_4,S$5,0))=16,\"\",VLOOKUP($A41,FB_4,S$5,0))&IF(TYPE(VLOOKUP($A41,FB_5,S$5,0))=16,\"\",VLOOKUP($A41,FB_5,S$5,0))&IF(TYPE(VLOOKUP($A41,FB_6,S$5,0))=16,\"\",VLOOKUP($A41,FB_6,S$5,0))&IF(TYPE(VLOOKUP($A41,FB_7,S$5,0))=16,\"\",VLOOKUP($A41,FB_7,S$5,0))&IF(TYPE(VLOOKUP($A41,FB_8,S$5,0))=16,\"\",VLOOKUP($A41,FB_8,S$5,0))&IF(TYPE(VLOOKUP($A41,FB_9,S$5,0))=16,\"\",VLOOKUP($A41,FB_9,S$5,0))&IF(TYPE(VLOOKUP($A41,FB_10,S$5,0))=16,\"\",VLOOKUP($A41,FB_10,S$5,0))&IF(TYPE(VLOOKUP($A41,FB_11,S$5,0))=16,\"\",VLOOKUP($A41,FB_11,S$5,0))&IF(TYPE(VLOOKUP($A41,FB_12,S$5,0))=16,\"\",VLOOKUP($A41,FB_12,S$5,0))&IF(TYPE(VLOOKUP($A41,FB_13,S$5,0))=16,\"\",VLOOKUP($A41,FB_13,S$5,0))&IF(TYPE(VLOOKUP($A41,FB_14,S$5,0))=16,\"\",VLOOKUP($A41,FB_14,S$5,0))&IF(TYPE(VLOOKUP($A41,FB_15,S$5,0))=16,\"\",VLOOKUP($A41,FB_15,S$5,0))&IF(TYPE(VLOOKUP($A41,FB_16,S$5,0))=16,\"\",VLOOKUP($A41,FB_16,S$5,0))&IF(TYPE(VLOOKUP($A41,FB_17,S$5,0))=16,\"\",VLOOKUP($A41,FB_17,S$5,0))&IF(TYPE(VLOOKUP($A41,FB_18,S$5,0))=16,\"\",VLOOKUP($A41,FB_18,S$5,0))&IF(TYPE(VLOOKUP($A41,FB_19,S$5,0))=16,\"\",VLOOKUP($A41,FB_19,S$5,0))&IF(TYPE(VLOOKUP($A41,FB_20,S$5,0))=16,\"\",VLOOKUP($A41,FB_20,S$5,0))&IF(TYPE(VLOOKUP($A41,FB_21,S$5,0))=16,\"\",VLOOKUP($A41,FB_21,S$5,0))&IF(TYPE(VLOOKUP($A41,FB_22,S$5,0))=16,\"\",VLOOKUP($A41,FB_22,S$5,0))&IF(TYPE(VLOOKUP($A41,FB_23,S$5,0))=16,\"\",VLOOKUP($A41,FB_23,S$5,0))&IF(TYPE(VLOOKUP($A41,FB_24,S$5,0))=16,\"\",VLOOKUP($A41,FB_24,S$5,0))&IF(TYPE(VLOOKUP($A41,FB_25,S$5,0))=16,\"\",VLOOKUP($A41,FB_25,S$5,0))&IF(TYPE(VLOOKUP($A41,FB_26,S$5,0))=16,\"\",VLOOKUP($A41,FB_26,S$5,0))&IF(TYPE(VLOOKUP($A41,FB_27,S$5,0))=16,\"\",VLOOKUP($A41,FB_27,S$5,0))&IF(TYPE(VLOOKUP($A41,FB_28,S$5,0))=16,\"\",VLOOKUP($A41,FB_28,S$5,0))&IF(TYPE(VLOOKUP($A41,FB_29,S$5,0))=16,\"\",VLOOKUP($A41,FB_29,S$5,0))&IF(TYPE(VLOOKUP($A41,FB_30,S$5,0))=16,\"\",VLOOKUP($A41,FB_30,S$5,0)))","v":""},null,null,null,null,null,null,null,null,null,null,null,null,null,null,null,null,"",":","","",""]
["13.",{"$f":"IF(TYPE(VLOOKUP($A42,FB_1,2,0))=16,\"\",VLOOKUP($A42,FB_1,2,0))&IF(TYPE(VLOOKUP($A42,FB_2,2,0))=16,\"\",VLOOKUP($A42,FB_2,2,0))&IF(TYPE(VLOOKUP($A42,FB_3,2,0))=16,\"\",VLOOKUP($A42,FB_3,2,0))&IF(TYPE(VLOOKUP($A42,FB_4,2,0))=16,\"\",VLOOKUP($A42,FB_4,2,0))&IF(TYPE(VLOOKUP($A42,FB_5,2,0))=16,\"\",VLOOKUP($A42,FB_5,2,0))&IF(TYPE(VLOOKUP($A42,FB_6,2,0))=16,\"\",VLOOKUP($A42,FB_6,2,0))&IF(TYPE(VLOOKUP($A42,FB_7,2,0))=16,\"\",VLOOKUP($A42,FB_7,2,0))&IF(TYPE(VLOOKUP($A42,FB_8,2,0))=16,\"\",VLOOKUP($A42,FB_8,2,0))&IF(TYPE(VLOOKUP($A42,FB_9,2,0))=16,\"\",VLOOKUP($A42,FB_9,2,0))&IF(TYPE(VLOOKUP($A42,FB_10,2,0))=16,\"\",VLOOKUP($A42,FB_10,2,0))&IF(TYPE(VLOOKUP($A42,FB_11,2,0))=16,\"\",VLOOKUP($A42,FB_11,2,0))&IF(TYPE(VLOOKUP($A42,FB_12,2,0))=16,\"\",VLOOKUP($A42,FB_12,2,0))&IF(TYPE(VLOOKUP($A42,FB_13,2,0))=16,\"\",VLOOKUP($A42,FB_13,2,0))&IF(TYPE(VLOOKUP($A42,FB_14,2,0))=16,\"\",VLOOKUP($A42,FB_14,2,0))&IF(TYPE(VLOOKUP($A42,FB_15,2,0))=16,\"\",VLOOKUP($A42,FB_15,2,0))&IF(TYPE(VLOOKUP($A42,FB_16,2,0))=16,\"\",VLOOKUP($A42,FB_16,2,0))&IF(TYPE(VLOOKUP($A42,FB_17,2,0))=16,\"\",VLOOKUP($A42,FB_17,2,0))&IF(TYPE(VLOOKUP($A42,FB_18,2,0))=16,\"\",VLOOKUP($A42,FB_18,2,0))&IF(TYPE(VLOOKUP($A42,FB_19,2,0))=16,\"\",VLOOKUP($A42,FB_19,2,0))&IF(TYPE(VLOOKUP($A42,FB_20,2,0))=16,\"\",VLOOKUP($A42,FB_20,2,0))&IF(TYPE(VLOOKUP($A42,FB_21,2,0))=16,\"\",VLOOKUP($A42,FB_21,2,0))&IF(TYPE(VLOOKUP($A42,FB_22,2,0))=16,\"\",VLOOKUP($A42,FB_22,2,0))&IF(TYPE(VLOOKUP($A42,FB_23,2,0))=16,\"\",VLOOKUP($A42,FB_23,2,0))&IF(TYPE(VLOOKUP($A42,FB_24,2,0))=16,\"\",VLOOKUP($A42,FB_24,2,0))&IF(TYPE(VLOOKUP($A42,FB_25,2,0))=16,\"\",VLOOKUP($A42,FB_25,2,0))&IF(TYPE(VLOOKUP($A42,FB_26,2,0))=16,\"\",VLOOKUP($A42,FB_26,2,0))&IF(TYPE(VLOOKUP($A42,FB_27,2,0))=16,\"\",VLOOKUP($A42,FB_27,2,0))&IF(TYPE(VLOOKUP($A42,FB_28,2,0))=16,\"\",VLOOKUP($A42,FB_28,2,0))&IF(TYPE(VLOOKUP($A42,FB_29,2,0))=16,\"\",VLOOKUP($A42,FB_29,2,0))&IF(TYPE(VLOOKUP($A42,FB_30,2,0))=16,\"\",VLOOKUP($A42,FB_30,2,0))","v":""},null,{"$f":"IF($B42=\"\",\"\",_xlfn.NUMBERVALUE(IF(TYPE(VLOOKUP($A42,FB_1,P$5,0))=16,\"\",VLOOKUP($A42,FB_1,P$5,0))&IF(TYPE(VLOOKUP($A42,FB_2,P$5,0))=16,\"\",VLOOKUP($A42,FB_2,P$5,0))&IF(TYPE(VLOOKUP($A42,FB_3,P$5,0))=16,\"\",VLOOKUP($A42,FB_3,P$5,0))&IF(TYPE(VLOOKUP($A42,FB_4,P$5,0))=16,\"\",VLOOKUP($A42,FB_4,P$5,0))&IF(TYPE(VLOOKUP($A42,FB_5,P$5,0))=16,\"\",VLOOKUP($A42,FB_5,P$5,0))&IF(TYPE(VLOOKUP($A42,FB_6,P$5,0))=16,\"\",VLOOKUP($A42,FB_6,P$5,0))&IF(TYPE(VLOOKUP($A42,FB_7,P$5,0))=16,\"\",VLOOKUP($A42,FB_7,P$5,0))&IF(TYPE(VLOOKUP($A42,FB_8,P$5,0))=16,\"\",VLOOKUP($A42,FB_8,P$5,0))&IF(TYPE(VLOOKUP($A42,FB_9,P$5,0))=16,\"\",VLOOKUP($A42,FB_9,P$5,0))&IF(TYPE(VLOOKUP($A42,FB_10,P$5,0))=16,\"\",VLOOKUP($A42,FB_10,P$5,0))&IF(TYPE(VLOOKUP($A42,FB_11,P$5,0))=16,\"\",VLOOKUP($A42,FB_11,P$5,0))&IF(TYPE(VLOOKUP($A42,FB_12,P$5,0))=16,\"\",VLOOKUP($A42,FB_12,P$5,0))&IF(TYPE(VLOOKUP($A42,FB_13,P$5,0))=16,\"\",VLOOKUP($A42,FB_13,P$5,0))&IF(TYPE(VLOOKUP($A42,FB_14,P$5,0))=16,\"\",VLOOKUP($A42,FB_14,P$5,0))&IF(TYPE(VLOOKUP($A42,FB_15,P$5,0))=16,\"\",VLOOKUP($A42,FB_15,P$5,0))&IF(TYPE(VLOOKUP($A42,FB_16,P$5,0))=16,\"\",VLOOKUP($A42,FB_16,P$5,0))&IF(TYPE(VLOOKUP($A42,FB_17,P$5,0))=16,\"\",VLOOKUP($A42,FB_17,P$5,0))&IF(TYPE(VLOOKUP($A42,FB_18,P$5,0))=16,\"\",VLOOKUP($A42,FB_18,P$5,0))&IF(TYPE(VLOOKUP($A42,FB_19,P$5,0))=16,\"\",VLOOKUP($A42,FB_19,P$5,0))&IF(TYPE(VLOOKUP($A42,FB_20,P$5,0))=16,\"\",VLOOKUP($A42,FB_20,P$5,0))&IF(TYPE(VLOOKUP($A42,FB_21,P$5,0))=16,\"\",VLOOKUP($A42,FB_21,P$5,0))&IF(TYPE(VLOOKUP($A42,FB_22,P$5,0))=16,\"\",VLOOKUP($A42,FB_22,P$5,0))&IF(TYPE(VLOOKUP($A42,FB_23,P$5,0))=16,\"\",VLOOKUP($A42,FB_23,P$5,0))&IF(TYPE(VLOOKUP($A42,FB_24,P$5,0))=16,\"\",VLOOKUP($A42,FB_24,P$5,0))&IF(TYPE(VLOOKUP($A42,FB_25,P$5,0))=16,\"\",VLOOKUP($A42,FB_25,P$5,0))&IF(TYPE(VLOOKUP($A42,FB_26,P$5,0))=16,\"\",VLOOKUP($A42,FB_26,P$5,0))&IF(TYPE(VLOOKUP($A42,FB_27,P$5,0))=16,\"\",VLOOKUP($A42,FB_27,P$5,0))&IF(TYPE(VLOOKUP($A42,FB_28,P$5,0))=16,\"\",VLOOKUP($A42,FB_28,P$5,0))&IF(TYPE(VLOOKUP($A42,FB_29,P$5,0))=16,\"\",VLOOKUP($A42,FB_29,P$5,0))&IF(TYPE(VLOOKUP($A42,FB_30,P$5,0))=16,\"\",VLOOKUP($A42,FB_30,P$5,0))))","v":""},"",{"$f":"IF($B42=\"\",\"\",_xlfn.NUMBERVALUE(IF(TYPE(VLOOKUP($A42,FB_1,R$5,0))=16,\"\",VLOOKUP($A42,FB_1,R$5,0))&IF(TYPE(VLOOKUP($A42,FB_2,R$5,0))=16,\"\",VLOOKUP($A42,FB_2,R$5,0))&IF(TYPE(VLOOKUP($A42,FB_3,R$5,0))=16,\"\",VLOOKUP($A42,FB_3,R$5,0))&IF(TYPE(VLOOKUP($A42,FB_4,R$5,0))=16,\"\",VLOOKUP($A42,FB_4,R$5,0))&IF(TYPE(VLOOKUP($A42,FB_5,R$5,0))=16,\"\",VLOOKUP($A42,FB_5,R$5,0))&IF(TYPE(VLOOKUP($A42,FB_6,R$5,0))=16,\"\",VLOOKUP($A42,FB_6,R$5,0))&IF(TYPE(VLOOKUP($A42,FB_7,R$5,0))=16,\"\",VLOOKUP($A42,FB_7,R$5,0))&IF(TYPE(VLOOKUP($A42,FB_8,R$5,0))=16,\"\",VLOOKUP($A42,FB_8,R$5,0))&IF(TYPE(VLOOKUP($A42,FB_9,R$5,0))=16,\"\",VLOOKUP($A42,FB_9,R$5,0))&IF(TYPE(VLOOKUP($A42,FB_10,R$5,0))=16,\"\",VLOOKUP($A42,FB_10,R$5,0))&IF(TYPE(VLOOKUP($A42,FB_11,R$5,0))=16,\"\",VLOOKUP($A42,FB_11,R$5,0))&IF(TYPE(VLOOKUP($A42,FB_12,R$5,0))=16,\"\",VLOOKUP($A42,FB_12,R$5,0))&IF(TYPE(VLOOKUP($A42,FB_13,R$5,0))=16,\"\",VLOOKUP($A42,FB_13,R$5,0))&IF(TYPE(VLOOKUP($A42,FB_14,R$5,0))=16,\"\",VLOOKUP($A42,FB_14,R$5,0))&IF(TYPE(VLOOKUP($A42,FB_15,R$5,0))=16,\"\",VLOOKUP($A42,FB_15,R$5,0))&IF(TYPE(VLOOKUP($A42,FB_16,R$5,0))=16,\"\",VLOOKUP($A42,FB_16,R$5,0))&IF(TYPE(VLOOKUP($A42,FB_17,R$5,0))=16,\"\",VLOOKUP($A42,FB_17,R$5,0))&IF(TYPE(VLOOKUP($A42,FB_18,R$5,0))=16,\"\",VLOOKUP($A42,FB_18,R$5,0))&IF(TYPE(VLOOKUP($A42,FB_19,R$5,0))=16,\"\",VLOOKUP($A42,FB_19,R$5,0))&IF(TYPE(VLOOKUP($A42,FB_20,R$5,0))=16,\"\",VLOOKUP($A42,FB_20,R$5,0))&IF(TYPE(VLOOKUP($A42,FB_21,R$5,0))=16,\"\",VLOOKUP($A42,FB_21,R$5,0))&IF(TYPE(VLOOKUP($A42,FB_22,R$5,0))=16,\"\",VLOOKUP($A42,FB_22,R$5,0))&IF(TYPE(VLOOKUP($A42,FB_23,R$5,0))=16,\"\",VLOOKUP($A42,FB_23,R$5,0))&IF(TYPE(VLOOKUP($A42,FB_24,R$5,0))=16,\"\",VLOOKUP($A42,FB_24,R$5,0))&IF(TYPE(VLOOKUP($A42,FB_25,R$5,0))=16,\"\",VLOOKUP($A42,FB_25,R$5,0))&IF(TYPE(VLOOKUP($A42,FB_26,R$5,0))=16,\"\",VLOOKUP($A42,FB_26,R$5,0))&IF(TYPE(VLOOKUP($A42,FB_27,R$5,0))=16,\"\",VLOOKUP($A42,FB_27,R$5,0))&IF(TYPE(VLOOKUP($A42,FB_28,R$5,0))=16,\"\",VLOOKUP($A42,FB_28,R$5,0))&IF(TYPE(VLOOKUP($A42,FB_29,R$5,0))=16,\"\",VLOOKUP($A42,FB_29,R$5,0))&IF(TYPE(VLOOKUP($A42,FB_30,R$5,0))=16,\"\",VLOOKUP($A42,FB_30,R$5,0))))","v":""},{"$f":"IF($B42=\"\",\"\",IF(TYPE(VLOOKUP($A42,FB_1,S$5,0))=16,\"\",VLOOKUP($A42,FB_1,S$5,0))&IF(TYPE(VLOOKUP($A42,FB_2,S$5,0))=16,\"\",VLOOKUP($A42,FB_2,S$5,0))&IF(TYPE(VLOOKUP($A42,FB_3,S$5,0))=16,\"\",VLOOKUP($A42,FB_3,S$5,0))&IF(TYPE(VLOOKUP($A42,FB_4,S$5,0))=16,\"\",VLOOKUP($A42,FB_4,S$5,0))&IF(TYPE(VLOOKUP($A42,FB_5,S$5,0))=16,\"\",VLOOKUP($A42,FB_5,S$5,0))&IF(TYPE(VLOOKUP($A42,FB_6,S$5,0))=16,\"\",VLOOKUP($A42,FB_6,S$5,0))&IF(TYPE(VLOOKUP($A42,FB_7,S$5,0))=16,\"\",VLOOKUP($A42,FB_7,S$5,0))&IF(TYPE(VLOOKUP($A42,FB_8,S$5,0))=16,\"\",VLOOKUP($A42,FB_8,S$5,0))&IF(TYPE(VLOOKUP($A42,FB_9,S$5,0))=16,\"\",VLOOKUP($A42,FB_9,S$5,0))&IF(TYPE(VLOOKUP($A42,FB_10,S$5,0))=16,\"\",VLOOKUP($A42,FB_10,S$5,0))&IF(TYPE(VLOOKUP($A42,FB_11,S$5,0))=16,\"\",VLOOKUP($A42,FB_11,S$5,0))&IF(TYPE(VLOOKUP($A42,FB_12,S$5,0))=16,\"\",VLOOKUP($A42,FB_12,S$5,0))&IF(TYPE(VLOOKUP($A42,FB_13,S$5,0))=16,\"\",VLOOKUP($A42,FB_13,S$5,0))&IF(TYPE(VLOOKUP($A42,FB_14,S$5,0))=16,\"\",VLOOKUP($A42,FB_14,S$5,0))&IF(TYPE(VLOOKUP($A42,FB_15,S$5,0))=16,\"\",VLOOKUP($A42,FB_15,S$5,0))&IF(TYPE(VLOOKUP($A42,FB_16,S$5,0))=16,\"\",VLOOKUP($A42,FB_16,S$5,0))&IF(TYPE(VLOOKUP($A42,FB_17,S$5,0))=16,\"\",VLOOKUP($A42,FB_17,S$5,0))&IF(TYPE(VLOOKUP($A42,FB_18,S$5,0))=16,\"\",VLOOKUP($A42,FB_18,S$5,0))&IF(TYPE(VLOOKUP($A42,FB_19,S$5,0))=16,\"\",VLOOKUP($A42,FB_19,S$5,0))&IF(TYPE(VLOOKUP($A42,FB_20,S$5,0))=16,\"\",VLOOKUP($A42,FB_20,S$5,0))&IF(TYPE(VLOOKUP($A42,FB_21,S$5,0))=16,\"\",VLOOKUP($A42,FB_21,S$5,0))&IF(TYPE(VLOOKUP($A42,FB_22,S$5,0))=16,\"\",VLOOKUP($A42,FB_22,S$5,0))&IF(TYPE(VLOOKUP($A42,FB_23,S$5,0))=16,\"\",VLOOKUP($A42,FB_23,S$5,0))&IF(TYPE(VLOOKUP($A42,FB_24,S$5,0))=16,\"\",VLOOKUP($A42,FB_24,S$5,0))&IF(TYPE(VLOOKUP($A42,FB_25,S$5,0))=16,\"\",VLOOKUP($A42,FB_25,S$5,0))&IF(TYPE(VLOOKUP($A42,FB_26,S$5,0))=16,\"\",VLOOKUP($A42,FB_26,S$5,0))&IF(TYPE(VLOOKUP($A42,FB_27,S$5,0))=16,\"\",VLOOKUP($A42,FB_27,S$5,0))&IF(TYPE(VLOOKUP($A42,FB_28,S$5,0))=16,\"\",VLOOKUP($A42,FB_28,S$5,0))&IF(TYPE(VLOOKUP($A42,FB_29,S$5,0))=16,\"\",VLOOKUP($A42,FB_29,S$5,0))&IF(TYPE(VLOOKUP($A42,FB_30,S$5,0))=16,\"\",VLOOKUP($A42,FB_30,S$5,0)))","v":""},null,null,null,null,null,null,null,null,null,null,null,null,null,null,null,null,"",":","","",""]
["14.",{"$f":"IF(TYPE(VLOOKUP($A43,FB_1,2,0))=16,\"\",VLOOKUP($A43,FB_1,2,0))&IF(TYPE(VLOOKUP($A43,FB_2,2,0))=16,\"\",VLOOKUP($A43,FB_2,2,0))&IF(TYPE(VLOOKUP($A43,FB_3,2,0))=16,\"\",VLOOKUP($A43,FB_3,2,0))&IF(TYPE(VLOOKUP($A43,FB_4,2,0))=16,\"\",VLOOKUP($A43,FB_4,2,0))&IF(TYPE(VLOOKUP($A43,FB_5,2,0))=16,\"\",VLOOKUP($A43,FB_5,2,0))&IF(TYPE(VLOOKUP($A43,FB_6,2,0))=16,\"\",VLOOKUP($A43,FB_6,2,0))&IF(TYPE(VLOOKUP($A43,FB_7,2,0))=16,\"\",VLOOKUP($A43,FB_7,2,0))&IF(TYPE(VLOOKUP($A43,FB_8,2,0))=16,\"\",VLOOKUP($A43,FB_8,2,0))&IF(TYPE(VLOOKUP($A43,FB_9,2,0))=16,\"\",VLOOKUP($A43,FB_9,2,0))&IF(TYPE(VLOOKUP($A43,FB_10,2,0))=16,\"\",VLOOKUP($A43,FB_10,2,0))&IF(TYPE(VLOOKUP($A43,FB_11,2,0))=16,\"\",VLOOKUP($A43,FB_11,2,0))&IF(TYPE(VLOOKUP($A43,FB_12,2,0))=16,\"\",VLOOKUP($A43,FB_12,2,0))&IF(TYPE(VLOOKUP($A43,FB_13,2,0))=16,\"\",VLOOKUP($A43,FB_13,2,0))&IF(TYPE(VLOOKUP($A43,FB_14,2,0))=16,\"\",VLOOKUP($A43,FB_14,2,0))&IF(TYPE(VLOOKUP($A43,FB_15,2,0))=16,\"\",VLOOKUP($A43,FB_15,2,0))&IF(TYPE(VLOOKUP($A43,FB_16,2,0))=16,\"\",VLOOKUP($A43,FB_16,2,0))&IF(TYPE(VLOOKUP($A43,FB_17,2,0))=16,\"\",VLOOKUP($A43,FB_17,2,0))&IF(TYPE(VLOOKUP($A43,FB_18,2,0))=16,\"\",VLOOKUP($A43,FB_18,2,0))&IF(TYPE(VLOOKUP($A43,FB_19,2,0))=16,\"\",VLOOKUP($A43,FB_19,2,0))&IF(TYPE(VLOOKUP($A43,FB_20,2,0))=16,\"\",VLOOKUP($A43,FB_20,2,0))&IF(TYPE(VLOOKUP($A43,FB_21,2,0))=16,\"\",VLOOKUP($A43,FB_21,2,0))&IF(TYPE(VLOOKUP($A43,FB_22,2,0))=16,\"\",VLOOKUP($A43,FB_22,2,0))&IF(TYPE(VLOOKUP($A43,FB_23,2,0))=16,\"\",VLOOKUP($A43,FB_23,2,0))&IF(TYPE(VLOOKUP($A43,FB_24,2,0))=16,\"\",VLOOKUP($A43,FB_24,2,0))&IF(TYPE(VLOOKUP($A43,FB_25,2,0))=16,\"\",VLOOKUP($A43,FB_25,2,0))&IF(TYPE(VLOOKUP($A43,FB_26,2,0))=16,\"\",VLOOKUP($A43,FB_26,2,0))&IF(TYPE(VLOOKUP($A43,FB_27,2,0))=16,\"\",VLOOKUP($A43,FB_27,2,0))&IF(TYPE(VLOOKUP($A43,FB_28,2,0))=16,\"\",VLOOKUP($A43,FB_28,2,0))&IF(TYPE(VLOOKUP($A43,FB_29,2,0))=16,\"\",VLOOKUP($A43,FB_29,2,0))&IF(TYPE(VLOOKUP($A43,FB_30,2,0))=16,\"\",VLOOKUP($A43,FB_30,2,0))","v":""},null,{"$f":"IF($B43=\"\",\"\",_xlfn.NUMBERVALUE(IF(TYPE(VLOOKUP($A43,FB_1,P$5,0))=16,\"\",VLOOKUP($A43,FB_1,P$5,0))&IF(TYPE(VLOOKUP($A43,FB_2,P$5,0))=16,\"\",VLOOKUP($A43,FB_2,P$5,0))&IF(TYPE(VLOOKUP($A43,FB_3,P$5,0))=16,\"\",VLOOKUP($A43,FB_3,P$5,0))&IF(TYPE(VLOOKUP($A43,FB_4,P$5,0))=16,\"\",VLOOKUP($A43,FB_4,P$5,0))&IF(TYPE(VLOOKUP($A43,FB_5,P$5,0))=16,\"\",VLOOKUP($A43,FB_5,P$5,0))&IF(TYPE(VLOOKUP($A43,FB_6,P$5,0))=16,\"\",VLOOKUP($A43,FB_6,P$5,0))&IF(TYPE(VLOOKUP($A43,FB_7,P$5,0))=16,\"\",VLOOKUP($A43,FB_7,P$5,0))&IF(TYPE(VLOOKUP($A43,FB_8,P$5,0))=16,\"\",VLOOKUP($A43,FB_8,P$5,0))&IF(TYPE(VLOOKUP($A43,FB_9,P$5,0))=16,\"\",VLOOKUP($A43,FB_9,P$5,0))&IF(TYPE(VLOOKUP($A43,FB_10,P$5,0))=16,\"\",VLOOKUP($A43,FB_10,P$5,0))&IF(TYPE(VLOOKUP($A43,FB_11,P$5,0))=16,\"\",VLOOKUP($A43,FB_11,P$5,0))&IF(TYPE(VLOOKUP($A43,FB_12,P$5,0))=16,\"\",VLOOKUP($A43,FB_12,P$5,0))&IF(TYPE(VLOOKUP($A43,FB_13,P$5,0))=16,\"\",VLOOKUP($A43,FB_13,P$5,0))&IF(TYPE(VLOOKUP($A43,FB_14,P$5,0))=16,\"\",VLOOKUP($A43,FB_14,P$5,0))&IF(TYPE(VLOOKUP($A43,FB_15,P$5,0))=16,\"\",VLOOKUP($A43,FB_15,P$5,0))&IF(TYPE(VLOOKUP($A43,FB_16,P$5,0))=16,\"\",VLOOKUP($A43,FB_16,P$5,0))&IF(TYPE(VLOOKUP($A43,FB_17,P$5,0))=16,\"\",VLOOKUP($A43,FB_17,P$5,0))&IF(TYPE(VLOOKUP($A43,FB_18,P$5,0))=16,\"\",VLOOKUP($A43,FB_18,P$5,0))&IF(TYPE(VLOOKUP($A43,FB_19,P$5,0))=16,\"\",VLOOKUP($A43,FB_19,P$5,0))&IF(TYPE(VLOOKUP($A43,FB_20,P$5,0))=16,\"\",VLOOKUP($A43,FB_20,P$5,0))&IF(TYPE(VLOOKUP($A43,FB_21,P$5,0))=16,\"\",VLOOKUP($A43,FB_21,P$5,0))&IF(TYPE(VLOOKUP($A43,FB_22,P$5,0))=16,\"\",VLOOKUP($A43,FB_22,P$5,0))&IF(TYPE(VLOOKUP($A43,FB_23,P$5,0))=16,\"\",VLOOKUP($A43,FB_23,P$5,0))&IF(TYPE(VLOOKUP($A43,FB_24,P$5,0))=16,\"\",VLOOKUP($A43,FB_24,P$5,0))&IF(TYPE(VLOOKUP($A43,FB_25,P$5,0))=16,\"\",VLOOKUP($A43,FB_25,P$5,0))&IF(TYPE(VLOOKUP($A43,FB_26,P$5,0))=16,\"\",VLOOKUP($A43,FB_26,P$5,0))&IF(TYPE(VLOOKUP($A43,FB_27,P$5,0))=16,\"\",VLOOKUP($A43,FB_27,P$5,0))&IF(TYPE(VLOOKUP($A43,FB_28,P$5,0))=16,\"\",VLOOKUP($A43,FB_28,P$5,0))&IF(TYPE(VLOOKUP($A43,FB_29,P$5,0))=16,\"\",VLOOKUP($A43,FB_29,P$5,0))&IF(TYPE(VLOOKUP($A43,FB_30,P$5,0))=16,\"\",VLOOKUP($A43,FB_30,P$5,0))))","v":""},"",{"$f":"IF($B43=\"\",\"\",_xlfn.NUMBERVALUE(IF(TYPE(VLOOKUP($A43,FB_1,R$5,0))=16,\"\",VLOOKUP($A43,FB_1,R$5,0))&IF(TYPE(VLOOKUP($A43,FB_2,R$5,0))=16,\"\",VLOOKUP($A43,FB_2,R$5,0))&IF(TYPE(VLOOKUP($A43,FB_3,R$5,0))=16,\"\",VLOOKUP($A43,FB_3,R$5,0))&IF(TYPE(VLOOKUP($A43,FB_4,R$5,0))=16,\"\",VLOOKUP($A43,FB_4,R$5,0))&IF(TYPE(VLOOKUP($A43,FB_5,R$5,0))=16,\"\",VLOOKUP($A43,FB_5,R$5,0))&IF(TYPE(VLOOKUP($A43,FB_6,R$5,0))=16,\"\",VLOOKUP($A43,FB_6,R$5,0))&IF(TYPE(VLOOKUP($A43,FB_7,R$5,0))=16,\"\",VLOOKUP($A43,FB_7,R$5,0))&IF(TYPE(VLOOKUP($A43,FB_8,R$5,0))=16,\"\",VLOOKUP($A43,FB_8,R$5,0))&IF(TYPE(VLOOKUP($A43,FB_9,R$5,0))=16,\"\",VLOOKUP($A43,FB_9,R$5,0))&IF(TYPE(VLOOKUP($A43,FB_10,R$5,0))=16,\"\",VLOOKUP($A43,FB_10,R$5,0))&IF(TYPE(VLOOKUP($A43,FB_11,R$5,0))=16,\"\",VLOOKUP($A43,FB_11,R$5,0))&IF(TYPE(VLOOKUP($A43,FB_12,R$5,0))=16,\"\",VLOOKUP($A43,FB_12,R$5,0))&IF(TYPE(VLOOKUP($A43,FB_13,R$5,0))=16,\"\",VLOOKUP($A43,FB_13,R$5,0))&IF(TYPE(VLOOKUP($A43,FB_14,R$5,0))=16,\"\",VLOOKUP($A43,FB_14,R$5,0))&IF(TYPE(VLOOKUP($A43,FB_15,R$5,0))=16,\"\",VLOOKUP($A43,FB_15,R$5,0))&IF(TYPE(VLOOKUP($A43,FB_16,R$5,0))=16,\"\",VLOOKUP($A43,FB_16,R$5,0))&IF(TYPE(VLOOKUP($A43,FB_17,R$5,0))=16,\"\",VLOOKUP($A43,FB_17,R$5,0))&IF(TYPE(VLOOKUP($A43,FB_18,R$5,0))=16,\"\",VLOOKUP($A43,FB_18,R$5,0))&IF(TYPE(VLOOKUP($A43,FB_19,R$5,0))=16,\"\",VLOOKUP($A43,FB_19,R$5,0))&IF(TYPE(VLOOKUP($A43,FB_20,R$5,0))=16,\"\",VLOOKUP($A43,FB_20,R$5,0))&IF(TYPE(VLOOKUP($A43,FB_21,R$5,0))=16,\"\",VLOOKUP($A43,FB_21,R$5,0))&IF(TYPE(VLOOKUP($A43,FB_22,R$5,0))=16,\"\",VLOOKUP($A43,FB_22,R$5,0))&IF(TYPE(VLOOKUP($A43,FB_23,R$5,0))=16,\"\",VLOOKUP($A43,FB_23,R$5,0))&IF(TYPE(VLOOKUP($A43,FB_24,R$5,0))=16,\"\",VLOOKUP($A43,FB_24,R$5,0))&IF(TYPE(VLOOKUP($A43,FB_25,R$5,0))=16,\"\",VLOOKUP($A43,FB_25,R$5,0))&IF(TYPE(VLOOKUP($A43,FB_26,R$5,0))=16,\"\",VLOOKUP($A43,FB_26,R$5,0))&IF(TYPE(VLOOKUP($A43,FB_27,R$5,0))=16,\"\",VLOOKUP($A43,FB_27,R$5,0))&IF(TYPE(VLOOKUP($A43,FB_28,R$5,0))=16,\"\",VLOOKUP($A43,FB_28,R$5,0))&IF(TYPE(VLOOKUP($A43,FB_29,R$5,0))=16,\"\",VLOOKUP($A43,FB_29,R$5,0))&IF(TYPE(VLOOKUP($A43,FB_30,R$5,0))=16,\"\",VLOOKUP($A43,FB_30,R$5,0))))","v":""},{"$f":"IF($B43=\"\",\"\",IF(TYPE(VLOOKUP($A43,FB_1,S$5,0))=16,\"\",VLOOKUP($A43,FB_1,S$5,0))&IF(TYPE(VLOOKUP($A43,FB_2,S$5,0))=16,\"\",VLOOKUP($A43,FB_2,S$5,0))&IF(TYPE(VLOOKUP($A43,FB_3,S$5,0))=16,\"\",VLOOKUP($A43,FB_3,S$5,0))&IF(TYPE(VLOOKUP($A43,FB_4,S$5,0))=16,\"\",VLOOKUP($A43,FB_4,S$5,0))&IF(TYPE(VLOOKUP($A43,FB_5,S$5,0))=16,\"\",VLOOKUP($A43,FB_5,S$5,0))&IF(TYPE(VLOOKUP($A43,FB_6,S$5,0))=16,\"\",VLOOKUP($A43,FB_6,S$5,0))&IF(TYPE(VLOOKUP($A43,FB_7,S$5,0))=16,\"\",VLOOKUP($A43,FB_7,S$5,0))&IF(TYPE(VLOOKUP($A43,FB_8,S$5,0))=16,\"\",VLOOKUP($A43,FB_8,S$5,0))&IF(TYPE(VLOOKUP($A43,FB_9,S$5,0))=16,\"\",VLOOKUP($A43,FB_9,S$5,0))&IF(TYPE(VLOOKUP($A43,FB_10,S$5,0))=16,\"\",VLOOKUP($A43,FB_10,S$5,0))&IF(TYPE(VLOOKUP($A43,FB_11,S$5,0))=16,\"\",VLOOKUP($A43,FB_11,S$5,0))&IF(TYPE(VLOOKUP($A43,FB_12,S$5,0))=16,\"\",VLOOKUP($A43,FB_12,S$5,0))&IF(TYPE(VLOOKUP($A43,FB_13,S$5,0))=16,\"\",VLOOKUP($A43,FB_13,S$5,0))&IF(TYPE(VLOOKUP($A43,FB_14,S$5,0))=16,\"\",VLOOKUP($A43,FB_14,S$5,0))&IF(TYPE(VLOOKUP($A43,FB_15,S$5,0))=16,\"\",VLOOKUP($A43,FB_15,S$5,0))&IF(TYPE(VLOOKUP($A43,FB_16,S$5,0))=16,\"\",VLOOKUP($A43,FB_16,S$5,0))&IF(TYPE(VLOOKUP($A43,FB_17,S$5,0))=16,\"\",VLOOKUP($A43,FB_17,S$5,0))&IF(TYPE(VLOOKUP($A43,FB_18,S$5,0))=16,\"\",VLOOKUP($A43,FB_18,S$5,0))&IF(TYPE(VLOOKUP($A43,FB_19,S$5,0))=16,\"\",VLOOKUP($A43,FB_19,S$5,0))&IF(TYPE(VLOOKUP($A43,FB_20,S$5,0))=16,\"\",VLOOKUP($A43,FB_20,S$5,0))&IF(TYPE(VLOOKUP($A43,FB_21,S$5,0))=16,\"\",VLOOKUP($A43,FB_21,S$5,0))&IF(TYPE(VLOOKUP($A43,FB_22,S$5,0))=16,\"\",VLOOKUP($A43,FB_22,S$5,0))&IF(TYPE(VLOOKUP($A43,FB_23,S$5,0))=16,\"\",VLOOKUP($A43,FB_23,S$5,0))&IF(TYPE(VLOOKUP($A43,FB_24,S$5,0))=16,\"\",VLOOKUP($A43,FB_24,S$5,0))&IF(TYPE(VLOOKUP($A43,FB_25,S$5,0))=16,\"\",VLOOKUP($A43,FB_25,S$5,0))&IF(TYPE(VLOOKUP($A43,FB_26,S$5,0))=16,\"\",VLOOKUP($A43,FB_26,S$5,0))&IF(TYPE(VLOOKUP($A43,FB_27,S$5,0))=16,\"\",VLOOKUP($A43,FB_27,S$5,0))&IF(TYPE(VLOOKUP($A43,FB_28,S$5,0))=16,\"\",VLOOKUP($A43,FB_28,S$5,0))&IF(TYPE(VLOOKUP($A43,FB_29,S$5,0))=16,\"\",VLOOKUP($A43,FB_29,S$5,0))&IF(TYPE(VLOOKUP($A43,FB_30,S$5,0))=16,\"\",VLOOKUP($A43,FB_30,S$5,0)))","v":""},null,null,null,null,null,null,null,null,null,null,null,null,null,null,null,null,"",":","","",""]
["15.",{"$f":"IF(TYPE(VLOOKUP($A44,FB_1,2,0))=16,\"\",VLOOKUP($A44,FB_1,2,0))&IF(TYPE(VLOOKUP($A44,FB_2,2,0))=16,\"\",VLOOKUP($A44,FB_2,2,0))&IF(TYPE(VLOOKUP($A44,FB_3,2,0))=16,\"\",VLOOKUP($A44,FB_3,2,0))&IF(TYPE(VLOOKUP($A44,FB_4,2,0))=16,\"\",VLOOKUP($A44,FB_4,2,0))&IF(TYPE(VLOOKUP($A44,FB_5,2,0))=16,\"\",VLOOKUP($A44,FB_5,2,0))&IF(TYPE(VLOOKUP($A44,FB_6,2,0))=16,\"\",VLOOKUP($A44,FB_6,2,0))&IF(TYPE(VLOOKUP($A44,FB_7,2,0))=16,\"\",VLOOKUP($A44,FB_7,2,0))&IF(TYPE(VLOOKUP($A44,FB_8,2,0))=16,\"\",VLOOKUP($A44,FB_8,2,0))&IF(TYPE(VLOOKUP($A44,FB_9,2,0))=16,\"\",VLOOKUP($A44,FB_9,2,0))&IF(TYPE(VLOOKUP($A44,FB_10,2,0))=16,\"\",VLOOKUP($A44,FB_10,2,0))&IF(TYPE(VLOOKUP($A44,FB_11,2,0))=16,\"\",VLOOKUP($A44,FB_11,2,0))&IF(TYPE(VLOOKUP($A44,FB_12,2,0))=16,\"\",VLOOKUP($A44,FB_12,2,0))&IF(TYPE(VLOOKUP($A44,FB_13,2,0))=16,\"\",VLOOKUP($A44,FB_13,2,0))&IF(TYPE(VLOOKUP($A44,FB_14,2,0))=16,\"\",VLOOKUP($A44,FB_14,2,0))&IF(TYPE(VLOOKUP($A44,FB_15,2,0))=16,\"\",VLOOKUP($A44,FB_15,2,0))&IF(TYPE(VLOOKUP($A44,FB_16,2,0))=16,\"\",VLOOKUP($A44,FB_16,2,0))&IF(TYPE(VLOOKUP($A44,FB_17,2,0))=16,\"\",VLOOKUP($A44,FB_17,2,0))&IF(TYPE(VLOOKUP($A44,FB_18,2,0))=16,\"\",VLOOKUP($A44,FB_18,2,0))&IF(TYPE(VLOOKUP($A44,FB_19,2,0))=16,\"\",VLOOKUP($A44,FB_19,2,0))&IF(TYPE(VLOOKUP($A44,FB_20,2,0))=16,\"\",VLOOKUP($A44,FB_20,2,0))&IF(TYPE(VLOOKUP($A44,FB_21,2,0))=16,\"\",VLOOKUP($A44,FB_21,2,0))&IF(TYPE(VLOOKUP($A44,FB_22,2,0))=16,\"\",VLOOKUP($A44,FB_22,2,0))&IF(TYPE(VLOOKUP($A44,FB_23,2,0))=16,\"\",VLOOKUP($A44,FB_23,2,0))&IF(TYPE(VLOOKUP($A44,FB_24,2,0))=16,\"\",VLOOKUP($A44,FB_24,2,0))&IF(TYPE(VLOOKUP($A44,FB_25,2,0))=16,\"\",VLOOKUP($A44,FB_25,2,0))&IF(TYPE(VLOOKUP($A44,FB_26,2,0))=16,\"\",VLOOKUP($A44,FB_26,2,0))&IF(TYPE(VLOOKUP($A44,FB_27,2,0))=16,\"\",VLOOKUP($A44,FB_27,2,0))&IF(TYPE(VLOOKUP($A44,FB_28,2,0))=16,\"\",VLOOKUP($A44,FB_28,2,0))&IF(TYPE(VLOOKUP($A44,FB_29,2,0))=16,\"\",VLOOKUP($A44,FB_29,2,0))&IF(TYPE(VLOOKUP($A44,FB_30,2,0))=16,\"\",VLOOKUP($A44,FB_30,2,0))","v":""},null,{"$f":"IF($B44=\"\",\"\",_xlfn.NUMBERVALUE(IF(TYPE(VLOOKUP($A44,FB_1,P$5,0))=16,\"\",VLOOKUP($A44,FB_1,P$5,0))&IF(TYPE(VLOOKUP($A44,FB_2,P$5,0))=16,\"\",VLOOKUP($A44,FB_2,P$5,0))&IF(TYPE(VLOOKUP($A44,FB_3,P$5,0))=16,\"\",VLOOKUP($A44,FB_3,P$5,0))&IF(TYPE(VLOOKUP($A44,FB_4,P$5,0))=16,\"\",VLOOKUP($A44,FB_4,P$5,0))&IF(TYPE(VLOOKUP($A44,FB_5,P$5,0))=16,\"\",VLOOKUP($A44,FB_5,P$5,0))&IF(TYPE(VLOOKUP($A44,FB_6,P$5,0))=16,\"\",VLOOKUP($A44,FB_6,P$5,0))&IF(TYPE(VLOOKUP($A44,FB_7,P$5,0))=16,\"\",VLOOKUP($A44,FB_7,P$5,0))&IF(TYPE(VLOOKUP($A44,FB_8,P$5,0))=16,\"\",VLOOKUP($A44,FB_8,P$5,0))&IF(TYPE(VLOOKUP($A44,FB_9,P$5,0))=16,\"\",VLOOKUP($A44,FB_9,P$5,0))&IF(TYPE(VLOOKUP($A44,FB_10,P$5,0))=16,\"\",VLOOKUP($A44,FB_10,P$5,0))&IF(TYPE(VLOOKUP($A44,FB_11,P$5,0))=16,\"\",VLOOKUP($A44,FB_11,P$5,0))&IF(TYPE(VLOOKUP($A44,FB_12,P$5,0))=16,\"\",VLOOKUP($A44,FB_12,P$5,0))&IF(TYPE(VLOOKUP($A44,FB_13,P$5,0))=16,\"\",VLOOKUP($A44,FB_13,P$5,0))&IF(TYPE(VLOOKUP($A44,FB_14,P$5,0))=16,\"\",VLOOKUP($A44,FB_14,P$5,0))&IF(TYPE(VLOOKUP($A44,FB_15,P$5,0))=16,\"\",VLOOKUP($A44,FB_15,P$5,0))&IF(TYPE(VLOOKUP($A44,FB_16,P$5,0))=16,\"\",VLOOKUP($A44,FB_16,P$5,0))&IF(TYPE(VLOOKUP($A44,FB_17,P$5,0))=16,\"\",VLOOKUP($A44,FB_17,P$5,0))&IF(TYPE(VLOOKUP($A44,FB_18,P$5,0))=16,\"\",VLOOKUP($A44,FB_18,P$5,0))&IF(TYPE(VLOOKUP($A44,FB_19,P$5,0))=16,\"\",VLOOKUP($A44,FB_19,P$5,0))&IF(TYPE(VLOOKUP($A44,FB_20,P$5,0))=16,\"\",VLOOKUP($A44,FB_20,P$5,0))&IF(TYPE(VLOOKUP($A44,FB_21,P$5,0))=16,\"\",VLOOKUP($A44,FB_21,P$5,0))&IF(TYPE(VLOOKUP($A44,FB_22,P$5,0))=16,\"\",VLOOKUP($A44,FB_22,P$5,0))&IF(TYPE(VLOOKUP($A44,FB_23,P$5,0))=16,\"\",VLOOKUP($A44,FB_23,P$5,0))&IF(TYPE(VLOOKUP($A44,FB_24,P$5,0))=16,\"\",VLOOKUP($A44,FB_24,P$5,0))&IF(TYPE(VLOOKUP($A44,FB_25,P$5,0))=16,\"\",VLOOKUP($A44,FB_25,P$5,0))&IF(TYPE(VLOOKUP($A44,FB_26,P$5,0))=16,\"\",VLOOKUP($A44,FB_26,P$5,0))&IF(TYPE(VLOOKUP($A44,FB_27,P$5,0))=16,\"\",VLOOKUP($A44,FB_27,P$5,0))&IF(TYPE(VLOOKUP($A44,FB_28,P$5,0))=16,\"\",VLOOKUP($A44,FB_28,P$5,0))&IF(TYPE(VLOOKUP($A44,FB_29,P$5,0))=16,\"\",VLOOKUP($A44,FB_29,P$5,0))&IF(TYPE(VLOOKUP($A44,FB_30,P$5,0))=16,\"\",VLOOKUP($A44,FB_30,P$5,0))))","v":""},"",{"$f":"IF($B44=\"\",\"\",_xlfn.NUMBERVALUE(IF(TYPE(VLOOKUP($A44,FB_1,R$5,0))=16,\"\",VLOOKUP($A44,FB_1,R$5,0))&IF(TYPE(VLOOKUP($A44,FB_2,R$5,0))=16,\"\",VLOOKUP($A44,FB_2,R$5,0))&IF(TYPE(VLOOKUP($A44,FB_3,R$5,0))=16,\"\",VLOOKUP($A44,FB_3,R$5,0))&IF(TYPE(VLOOKUP($A44,FB_4,R$5,0))=16,\"\",VLOOKUP($A44,FB_4,R$5,0))&IF(TYPE(VLOOKUP($A44,FB_5,R$5,0))=16,\"\",VLOOKUP($A44,FB_5,R$5,0))&IF(TYPE(VLOOKUP($A44,FB_6,R$5,0))=16,\"\",VLOOKUP($A44,FB_6,R$5,0))&IF(TYPE(VLOOKUP($A44,FB_7,R$5,0))=16,\"\",VLOOKUP($A44,FB_7,R$5,0))&IF(TYPE(VLOOKUP($A44,FB_8,R$5,0))=16,\"\",VLOOKUP($A44,FB_8,R$5,0))&IF(TYPE(VLOOKUP($A44,FB_9,R$5,0))=16,\"\",VLOOKUP($A44,FB_9,R$5,0))&IF(TYPE(VLOOKUP($A44,FB_10,R$5,0))=16,\"\",VLOOKUP($A44,FB_10,R$5,0))&IF(TYPE(VLOOKUP($A44,FB_11,R$5,0))=16,\"\",VLOOKUP($A44,FB_11,R$5,0))&IF(TYPE(VLOOKUP($A44,FB_12,R$5,0))=16,\"\",VLOOKUP($A44,FB_12,R$5,0))&IF(TYPE(VLOOKUP($A44,FB_13,R$5,0))=16,\"\",VLOOKUP($A44,FB_13,R$5,0))&IF(TYPE(VLOOKUP($A44,FB_14,R$5,0))=16,\"\",VLOOKUP($A44,FB_14,R$5,0))&IF(TYPE(VLOOKUP($A44,FB_15,R$5,0))=16,\"\",VLOOKUP($A44,FB_15,R$5,0))&IF(TYPE(VLOOKUP($A44,FB_16,R$5,0))=16,\"\",VLOOKUP($A44,FB_16,R$5,0))&IF(TYPE(VLOOKUP($A44,FB_17,R$5,0))=16,\"\",VLOOKUP($A44,FB_17,R$5,0))&IF(TYPE(VLOOKUP($A44,FB_18,R$5,0))=16,\"\",VLOOKUP($A44,FB_18,R$5,0))&IF(TYPE(VLOOKUP($A44,FB_19,R$5,0))=16,\"\",VLOOKUP($A44,FB_19,R$5,0))&IF(TYPE(VLOOKUP($A44,FB_20,R$5,0))=16,\"\",VLOOKUP($A44,FB_20,R$5,0))&IF(TYPE(VLOOKUP($A44,FB_21,R$5,0))=16,\"\",VLOOKUP($A44,FB_21,R$5,0))&IF(TYPE(VLOOKUP($A44,FB_22,R$5,0))=16,\"\",VLOOKUP($A44,FB_22,R$5,0))&IF(TYPE(VLOOKUP($A44,FB_23,R$5,0))=16,\"\",VLOOKUP($A44,FB_23,R$5,0))&IF(TYPE(VLOOKUP($A44,FB_24,R$5,0))=16,\"\",VLOOKUP($A44,FB_24,R$5,0))&IF(TYPE(VLOOKUP($A44,FB_25,R$5,0))=16,\"\",VLOOKUP($A44,FB_25,R$5,0))&IF(TYPE(VLOOKUP($A44,FB_26,R$5,0))=16,\"\",VLOOKUP($A44,FB_26,R$5,0))&IF(TYPE(VLOOKUP($A44,FB_27,R$5,0))=16,\"\",VLOOKUP($A44,FB_27,R$5,0))&IF(TYPE(VLOOKUP($A44,FB_28,R$5,0))=16,\"\",VLOOKUP($A44,FB_28,R$5,0))&IF(TYPE(VLOOKUP($A44,FB_29,R$5,0))=16,\"\",VLOOKUP($A44,FB_29,R$5,0))&IF(TYPE(VLOOKUP($A44,FB_30,R$5,0))=16,\"\",VLOOKUP($A44,FB_30,R$5,0))))","v":""},{"$f":"IF($B44=\"\",\"\",IF(TYPE(VLOOKUP($A44,FB_1,S$5,0))=16,\"\",VLOOKUP($A44,FB_1,S$5,0))&IF(TYPE(VLOOKUP($A44,FB_2,S$5,0))=16,\"\",VLOOKUP($A44,FB_2,S$5,0))&IF(TYPE(VLOOKUP($A44,FB_3,S$5,0))=16,\"\",VLOOKUP($A44,FB_3,S$5,0))&IF(TYPE(VLOOKUP($A44,FB_4,S$5,0))=16,\"\",VLOOKUP($A44,FB_4,S$5,0))&IF(TYPE(VLOOKUP($A44,FB_5,S$5,0))=16,\"\",VLOOKUP($A44,FB_5,S$5,0))&IF(TYPE(VLOOKUP($A44,FB_6,S$5,0))=16,\"\",VLOOKUP($A44,FB_6,S$5,0))&IF(TYPE(VLOOKUP($A44,FB_7,S$5,0))=16,\"\",VLOOKUP($A44,FB_7,S$5,0))&IF(TYPE(VLOOKUP($A44,FB_8,S$5,0))=16,\"\",VLOOKUP($A44,FB_8,S$5,0))&IF(TYPE(VLOOKUP($A44,FB_9,S$5,0))=16,\"\",VLOOKUP($A44,FB_9,S$5,0))&IF(TYPE(VLOOKUP($A44,FB_10,S$5,0))=16,\"\",VLOOKUP($A44,FB_10,S$5,0))&IF(TYPE(VLOOKUP($A44,FB_11,S$5,0))=16,\"\",VLOOKUP($A44,FB_11,S$5,0))&IF(TYPE(VLOOKUP($A44,FB_12,S$5,0))=16,\"\",VLOOKUP($A44,FB_12,S$5,0))&IF(TYPE(VLOOKUP($A44,FB_13,S$5,0))=16,\"\",VLOOKUP($A44,FB_13,S$5,0))&IF(TYPE(VLOOKUP($A44,FB_14,S$5,0))=16,\"\",VLOOKUP($A44,FB_14,S$5,0))&IF(TYPE(VLOOKUP($A44,FB_15,S$5,0))=16,\"\",VLOOKUP($A44,FB_15,S$5,0))&IF(TYPE(VLOOKUP($A44,FB_16,S$5,0))=16,\"\",VLOOKUP($A44,FB_16,S$5,0))&IF(TYPE(VLOOKUP($A44,FB_17,S$5,0))=16,\"\",VLOOKUP($A44,FB_17,S$5,0))&IF(TYPE(VLOOKUP($A44,FB_18,S$5,0))=16,\"\",VLOOKUP($A44,FB_18,S$5,0))&IF(TYPE(VLOOKUP($A44,FB_19,S$5,0))=16,\"\",VLOOKUP($A44,FB_19,S$5,0))&IF(TYPE(VLOOKUP($A44,FB_20,S$5,0))=16,\"\",VLOOKUP($A44,FB_20,S$5,0))&IF(TYPE(VLOOKUP($A44,FB_21,S$5,0))=16,\"\",VLOOKUP($A44,FB_21,S$5,0))&IF(TYPE(VLOOKUP($A44,FB_22,S$5,0))=16,\"\",VLOOKUP($A44,FB_22,S$5,0))&IF(TYPE(VLOOKUP($A44,FB_23,S$5,0))=16,\"\",VLOOKUP($A44,FB_23,S$5,0))&IF(TYPE(VLOOKUP($A44,FB_24,S$5,0))=16,\"\",VLOOKUP($A44,FB_24,S$5,0))&IF(TYPE(VLOOKUP($A44,FB_25,S$5,0))=16,\"\",VLOOKUP($A44,FB_25,S$5,0))&IF(TYPE(VLOOKUP($A44,FB_26,S$5,0))=16,\"\",VLOOKUP($A44,FB_26,S$5,0))&IF(TYPE(VLOOKUP($A44,FB_27,S$5,0))=16,\"\",VLOOKUP($A44,FB_27,S$5,0))&IF(TYPE(VLOOKUP($A44,FB_28,S$5,0))=16,\"\",VLOOKUP($A44,FB_28,S$5,0))&IF(TYPE(VLOOKUP($A44,FB_29,S$5,0))=16,\"\",VLOOKUP($A44,FB_29,S$5,0))&IF(TYPE(VLOOKUP($A44,FB_30,S$5,0))=16,\"\",VLOOKUP($A44,FB_30,S$5,0)))","v":""},null,null,null,null,null,null,null,null,null,null,null,null,null,null,null,null,"",":","","",""]
["16.",{"$f":"IF(TYPE(VLOOKUP($A45,FB_1,2,0))=16,\"\",VLOOKUP($A45,FB_1,2,0))&IF(TYPE(VLOOKUP($A45,FB_2,2,0))=16,\"\",VLOOKUP($A45,FB_2,2,0))&IF(TYPE(VLOOKUP($A45,FB_3,2,0))=16,\"\",VLOOKUP($A45,FB_3,2,0))&IF(TYPE(VLOOKUP($A45,FB_4,2,0))=16,\"\",VLOOKUP($A45,FB_4,2,0))&IF(TYPE(VLOOKUP($A45,FB_5,2,0))=16,\"\",VLOOKUP($A45,FB_5,2,0))&IF(TYPE(VLOOKUP($A45,FB_6,2,0))=16,\"\",VLOOKUP($A45,FB_6,2,0))&IF(TYPE(VLOOKUP($A45,FB_7,2,0))=16,\"\",VLOOKUP($A45,FB_7,2,0))&IF(TYPE(VLOOKUP($A45,FB_8,2,0))=16,\"\",VLOOKUP($A45,FB_8,2,0))&IF(TYPE(VLOOKUP($A45,FB_9,2,0))=16,\"\",VLOOKUP($A45,FB_9,2,0))&IF(TYPE(VLOOKUP($A45,FB_10,2,0))=16,\"\",VLOOKUP($A45,FB_10,2,0))&IF(TYPE(VLOOKUP($A45,FB_11,2,0))=16,\"\",VLOOKUP($A45,FB_11,2,0))&IF(TYPE(VLOOKUP($A45,FB_12,2,0))=16,\"\",VLOOKUP($A45,FB_12,2,0))&IF(TYPE(VLOOKUP($A45,FB_13,2,0))=16,\"\",VLOOKUP($A45,FB_13,2,0))&IF(TYPE(VLOOKUP($A45,FB_14,2,0))=16,\"\",VLOOKUP($A45,FB_14,2,0))&IF(TYPE(VLOOKUP($A45,FB_15,2,0))=16,\"\",VLOOKUP($A45,FB_15,2,0))&IF(TYPE(VLOOKUP($A45,FB_16,2,0))=16,\"\",VLOOKUP($A45,FB_16,2,0))&IF(TYPE(VLOOKUP($A45,FB_17,2,0))=16,\"\",VLOOKUP($A45,FB_17,2,0))&IF(TYPE(VLOOKUP($A45,FB_18,2,0))=16,\"\",VLOOKUP($A45,FB_18,2,0))&IF(TYPE(VLOOKUP($A45,FB_19,2,0))=16,\"\",VLOOKUP($A45,FB_19,2,0))&IF(TYPE(VLOOKUP($A45,FB_20,2,0))=16,\"\",VLOOKUP($A45,FB_20,2,0))&IF(TYPE(VLOOKUP($A45,FB_21,2,0))=16,\"\",VLOOKUP($A45,FB_21,2,0))&IF(TYPE(VLOOKUP($A45,FB_22,2,0))=16,\"\",VLOOKUP($A45,FB_22,2,0))&IF(TYPE(VLOOKUP($A45,FB_23,2,0))=16,\"\",VLOOKUP($A45,FB_23,2,0))&IF(TYPE(VLOOKUP($A45,FB_24,2,0))=16,\"\",VLOOKUP($A45,FB_24,2,0))&IF(TYPE(VLOOKUP($A45,FB_25,2,0))=16,\"\",VLOOKUP($A45,FB_25,2,0))&IF(TYPE(VLOOKUP($A45,FB_26,2,0))=16,\"\",VLOOKUP($A45,FB_26,2,0))&IF(TYPE(VLOOKUP($A45,FB_27,2,0))=16,\"\",VLOOKUP($A45,FB_27,2,0))&IF(TYPE(VLOOKUP($A45,FB_28,2,0))=16,\"\",VLOOKUP($A45,FB_28,2,0))&IF(TYPE(VLOOKUP($A45,FB_29,2,0))=16,\"\",VLOOKUP($A45,FB_29,2,0))&IF(TYPE(VLOOKUP($A45,FB_30,2,0))=16,\"\",VLOOKUP($A45,FB_30,2,0))","v":""},null,{"$f":"IF($B45=\"\",\"\",_xlfn.NUMBERVALUE(IF(TYPE(VLOOKUP($A45,FB_1,P$5,0))=16,\"\",VLOOKUP($A45,FB_1,P$5,0))&IF(TYPE(VLOOKUP($A45,FB_2,P$5,0))=16,\"\",VLOOKUP($A45,FB_2,P$5,0))&IF(TYPE(VLOOKUP($A45,FB_3,P$5,0))=16,\"\",VLOOKUP($A45,FB_3,P$5,0))&IF(TYPE(VLOOKUP($A45,FB_4,P$5,0))=16,\"\",VLOOKUP($A45,FB_4,P$5,0))&IF(TYPE(VLOOKUP($A45,FB_5,P$5,0))=16,\"\",VLOOKUP($A45,FB_5,P$5,0))&IF(TYPE(VLOOKUP($A45,FB_6,P$5,0))=16,\"\",VLOOKUP($A45,FB_6,P$5,0))&IF(TYPE(VLOOKUP($A45,FB_7,P$5,0))=16,\"\",VLOOKUP($A45,FB_7,P$5,0))&IF(TYPE(VLOOKUP($A45,FB_8,P$5,0))=16,\"\",VLOOKUP($A45,FB_8,P$5,0))&IF(TYPE(VLOOKUP($A45,FB_9,P$5,0))=16,\"\",VLOOKUP($A45,FB_9,P$5,0))&IF(TYPE(VLOOKUP($A45,FB_10,P$5,0))=16,\"\",VLOOKUP($A45,FB_10,P$5,0))&IF(TYPE(VLOOKUP($A45,FB_11,P$5,0))=16,\"\",VLOOKUP($A45,FB_11,P$5,0))&IF(TYPE(VLOOKUP($A45,FB_12,P$5,0))=16,\"\",VLOOKUP($A45,FB_12,P$5,0))&IF(TYPE(VLOOKUP($A45,FB_13,P$5,0))=16,\"\",VLOOKUP($A45,FB_13,P$5,0))&IF(TYPE(VLOOKUP($A45,FB_14,P$5,0))=16,\"\",VLOOKUP($A45,FB_14,P$5,0))&IF(TYPE(VLOOKUP($A45,FB_15,P$5,0))=16,\"\",VLOOKUP($A45,FB_15,P$5,0))&IF(TYPE(VLOOKUP($A45,FB_16,P$5,0))=16,\"\",VLOOKUP($A45,FB_16,P$5,0))&IF(TYPE(VLOOKUP($A45,FB_17,P$5,0))=16,\"\",VLOOKUP($A45,FB_17,P$5,0))&IF(TYPE(VLOOKUP($A45,FB_18,P$5,0))=16,\"\",VLOOKUP($A45,FB_18,P$5,0))&IF(TYPE(VLOOKUP($A45,FB_19,P$5,0))=16,\"\",VLOOKUP($A45,FB_19,P$5,0))&IF(TYPE(VLOOKUP($A45,FB_20,P$5,0))=16,\"\",VLOOKUP($A45,FB_20,P$5,0))&IF(TYPE(VLOOKUP($A45,FB_21,P$5,0))=16,\"\",VLOOKUP($A45,FB_21,P$5,0))&IF(TYPE(VLOOKUP($A45,FB_22,P$5,0))=16,\"\",VLOOKUP($A45,FB_22,P$5,0))&IF(TYPE(VLOOKUP($A45,FB_23,P$5,0))=16,\"\",VLOOKUP($A45,FB_23,P$5,0))&IF(TYPE(VLOOKUP($A45,FB_24,P$5,0))=16,\"\",VLOOKUP($A45,FB_24,P$5,0))&IF(TYPE(VLOOKUP($A45,FB_25,P$5,0))=16,\"\",VLOOKUP($A45,FB_25,P$5,0))&IF(TYPE(VLOOKUP($A45,FB_26,P$5,0))=16,\"\",VLOOKUP($A45,FB_26,P$5,0))&IF(TYPE(VLOOKUP($A45,FB_27,P$5,0))=16,\"\",VLOOKUP($A45,FB_27,P$5,0))&IF(TYPE(VLOOKUP($A45,FB_28,P$5,0))=16,\"\",VLOOKUP($A45,FB_28,P$5,0))&IF(TYPE(VLOOKUP($A45,FB_29,P$5,0))=16,\"\",VLOOKUP($A45,FB_29,P$5,0))&IF(TYPE(VLOOKUP($A45,FB_30,P$5,0))=16,\"\",VLOOKUP($A45,FB_30,P$5,0))))","v":""},"",{"$f":"IF($B45=\"\",\"\",_xlfn.NUMBERVALUE(IF(TYPE(VLOOKUP($A45,FB_1,R$5,0))=16,\"\",VLOOKUP($A45,FB_1,R$5,0))&IF(TYPE(VLOOKUP($A45,FB_2,R$5,0))=16,\"\",VLOOKUP($A45,FB_2,R$5,0))&IF(TYPE(VLOOKUP($A45,FB_3,R$5,0))=16,\"\",VLOOKUP($A45,FB_3,R$5,0))&IF(TYPE(VLOOKUP($A45,FB_4,R$5,0))=16,\"\",VLOOKUP($A45,FB_4,R$5,0))&IF(TYPE(VLOOKUP($A45,FB_5,R$5,0))=16,\"\",VLOOKUP($A45,FB_5,R$5,0))&IF(TYPE(VLOOKUP($A45,FB_6,R$5,0))=16,\"\",VLOOKUP($A45,FB_6,R$5,0))&IF(TYPE(VLOOKUP($A45,FB_7,R$5,0))=16,\"\",VLOOKUP($A45,FB_7,R$5,0))&IF(TYPE(VLOOKUP($A45,FB_8,R$5,0))=16,\"\",VLOOKUP($A45,FB_8,R$5,0))&IF(TYPE(VLOOKUP($A45,FB_9,R$5,0))=16,\"\",VLOOKUP($A45,FB_9,R$5,0))&IF(TYPE(VLOOKUP($A45,FB_10,R$5,0))=16,\"\",VLOOKUP($A45,FB_10,R$5,0))&IF(TYPE(VLOOKUP($A45,FB_11,R$5,0))=16,\"\",VLOOKUP($A45,FB_11,R$5,0))&IF(TYPE(VLOOKUP($A45,FB_12,R$5,0))=16,\"\",VLOOKUP($A45,FB_12,R$5,0))&IF(TYPE(VLOOKUP($A45,FB_13,R$5,0))=16,\"\",VLOOKUP($A45,FB_13,R$5,0))&IF(TYPE(VLOOKUP($A45,FB_14,R$5,0))=16,\"\",VLOOKUP($A45,FB_14,R$5,0))&IF(TYPE(VLOOKUP($A45,FB_15,R$5,0))=16,\"\",VLOOKUP($A45,FB_15,R$5,0))&IF(TYPE(VLOOKUP($A45,FB_16,R$5,0))=16,\"\",VLOOKUP($A45,FB_16,R$5,0))&IF(TYPE(VLOOKUP($A45,FB_17,R$5,0))=16,\"\",VLOOKUP($A45,FB_17,R$5,0))&IF(TYPE(VLOOKUP($A45,FB_18,R$5,0))=16,\"\",VLOOKUP($A45,FB_18,R$5,0))&IF(TYPE(VLOOKUP($A45,FB_19,R$5,0))=16,\"\",VLOOKUP($A45,FB_19,R$5,0))&IF(TYPE(VLOOKUP($A45,FB_20,R$5,0))=16,\"\",VLOOKUP($A45,FB_20,R$5,0))&IF(TYPE(VLOOKUP($A45,FB_21,R$5,0))=16,\"\",VLOOKUP($A45,FB_21,R$5,0))&IF(TYPE(VLOOKUP($A45,FB_22,R$5,0))=16,\"\",VLOOKUP($A45,FB_22,R$5,0))&IF(TYPE(VLOOKUP($A45,FB_23,R$5,0))=16,\"\",VLOOKUP($A45,FB_23,R$5,0))&IF(TYPE(VLOOKUP($A45,FB_24,R$5,0))=16,\"\",VLOOKUP($A45,FB_24,R$5,0))&IF(TYPE(VLOOKUP($A45,FB_25,R$5,0))=16,\"\",VLOOKUP($A45,FB_25,R$5,0))&IF(TYPE(VLOOKUP($A45,FB_26,R$5,0))=16,\"\",VLOOKUP($A45,FB_26,R$5,0))&IF(TYPE(VLOOKUP($A45,FB_27,R$5,0))=16,\"\",VLOOKUP($A45,FB_27,R$5,0))&IF(TYPE(VLOOKUP($A45,FB_28,R$5,0))=16,\"\",VLOOKUP($A45,FB_28,R$5,0))&IF(TYPE(VLOOKUP($A45,FB_29,R$5,0))=16,\"\",VLOOKUP($A45,FB_29,R$5,0))&IF(TYPE(VLOOKUP($A45,FB_30,R$5,0))=16,\"\",VLOOKUP($A45,FB_30,R$5,0))))","v":""},{"$f":"IF($B45=\"\",\"\",IF(TYPE(VLOOKUP($A45,FB_1,S$5,0))=16,\"\",VLOOKUP($A45,FB_1,S$5,0))&IF(TYPE(VLOOKUP($A45,FB_2,S$5,0))=16,\"\",VLOOKUP($A45,FB_2,S$5,0))&IF(TYPE(VLOOKUP($A45,FB_3,S$5,0))=16,\"\",VLOOKUP($A45,FB_3,S$5,0))&IF(TYPE(VLOOKUP($A45,FB_4,S$5,0))=16,\"\",VLOOKUP($A45,FB_4,S$5,0))&IF(TYPE(VLOOKUP($A45,FB_5,S$5,0))=16,\"\",VLOOKUP($A45,FB_5,S$5,0))&IF(TYPE(VLOOKUP($A45,FB_6,S$5,0))=16,\"\",VLOOKUP($A45,FB_6,S$5,0))&IF(TYPE(VLOOKUP($A45,FB_7,S$5,0))=16,\"\",VLOOKUP($A45,FB_7,S$5,0))&IF(TYPE(VLOOKUP($A45,FB_8,S$5,0))=16,\"\",VLOOKUP($A45,FB_8,S$5,0))&IF(TYPE(VLOOKUP($A45,FB_9,S$5,0))=16,\"\",VLOOKUP($A45,FB_9,S$5,0))&IF(TYPE(VLOOKUP($A45,FB_10,S$5,0))=16,\"\",VLOOKUP($A45,FB_10,S$5,0))&IF(TYPE(VLOOKUP($A45,FB_11,S$5,0))=16,\"\",VLOOKUP($A45,FB_11,S$5,0))&IF(TYPE(VLOOKUP($A45,FB_12,S$5,0))=16,\"\",VLOOKUP($A45,FB_12,S$5,0))&IF(TYPE(VLOOKUP($A45,FB_13,S$5,0))=16,\"\",VLOOKUP($A45,FB_13,S$5,0))&IF(TYPE(VLOOKUP($A45,FB_14,S$5,0))=16,\"\",VLOOKUP($A45,FB_14,S$5,0))&IF(TYPE(VLOOKUP($A45,FB_15,S$5,0))=16,\"\",VLOOKUP($A45,FB_15,S$5,0))&IF(TYPE(VLOOKUP($A45,FB_16,S$5,0))=16,\"\",VLOOKUP($A45,FB_16,S$5,0))&IF(TYPE(VLOOKUP($A45,FB_17,S$5,0))=16,\"\",VLOOKUP($A45,FB_17,S$5,0))&IF(TYPE(VLOOKUP($A45,FB_18,S$5,0))=16,\"\",VLOOKUP($A45,FB_18,S$5,0))&IF(TYPE(VLOOKUP($A45,FB_19,S$5,0))=16,\"\",VLOOKUP($A45,FB_19,S$5,0))&IF(TYPE(VLOOKUP($A45,FB_20,S$5,0))=16,\"\",VLOOKUP($A45,FB_20,S$5,0))&IF(TYPE(VLOOKUP($A45,FB_21,S$5,0))=16,\"\",VLOOKUP($A45,FB_21,S$5,0))&IF(TYPE(VLOOKUP($A45,FB_22,S$5,0))=16,\"\",VLOOKUP($A45,FB_22,S$5,0))&IF(TYPE(VLOOKUP($A45,FB_23,S$5,0))=16,\"\",VLOOKUP($A45,FB_23,S$5,0))&IF(TYPE(VLOOKUP($A45,FB_24,S$5,0))=16,\"\",VLOOKUP($A45,FB_24,S$5,0))&IF(TYPE(VLOOKUP($A45,FB_25,S$5,0))=16,\"\",VLOOKUP($A45,FB_25,S$5,0))&IF(TYPE(VLOOKUP($A45,FB_26,S$5,0))=16,\"\",VLOOKUP($A45,FB_26,S$5,0))&IF(TYPE(VLOOKUP($A45,FB_27,S$5,0))=16,\"\",VLOOKUP($A45,FB_27,S$5,0))&IF(TYPE(VLOOKUP($A45,FB_28,S$5,0))=16,\"\",VLOOKUP($A45,FB_28,S$5,0))&IF(TYPE(VLOOKUP($A45,FB_29,S$5,0))=16,\"\",VLOOKUP($A45,FB_29,S$5,0))&IF(TYPE(VLOOKUP($A45,FB_30,S$5,0))=16,\"\",VLOOKUP($A45,FB_30,S$5,0)))","v":""},null,null,null,null,null,null,null,null,null,null,null,null,null,null,null,null,"",":","","",""]
["17.",{"$f":"IF(TYPE(VLOOKUP($A46,FB_1,2,0))=16,\"\",VLOOKUP($A46,FB_1,2,0))&IF(TYPE(VLOOKUP($A46,FB_2,2,0))=16,\"\",VLOOKUP($A46,FB_2,2,0))&IF(TYPE(VLOOKUP($A46,FB_3,2,0))=16,\"\",VLOOKUP($A46,FB_3,2,0))&IF(TYPE(VLOOKUP($A46,FB_4,2,0))=16,\"\",VLOOKUP($A46,FB_4,2,0))&IF(TYPE(VLOOKUP($A46,FB_5,2,0))=16,\"\",VLOOKUP($A46,FB_5,2,0))&IF(TYPE(VLOOKUP($A46,FB_6,2,0))=16,\"\",VLOOKUP($A46,FB_6,2,0))&IF(TYPE(VLOOKUP($A46,FB_7,2,0))=16,\"\",VLOOKUP($A46,FB_7,2,0))&IF(TYPE(VLOOKUP($A46,FB_8,2,0))=16,\"\",VLOOKUP($A46,FB_8,2,0))&IF(TYPE(VLOOKUP($A46,FB_9,2,0))=16,\"\",VLOOKUP($A46,FB_9,2,0))&IF(TYPE(VLOOKUP($A46,FB_10,2,0))=16,\"\",VLOOKUP($A46,FB_10,2,0))&IF(TYPE(VLOOKUP($A46,FB_11,2,0))=16,\"\",VLOOKUP($A46,FB_11,2,0))&IF(TYPE(VLOOKUP($A46,FB_12,2,0))=16,\"\",VLOOKUP($A46,FB_12,2,0))&IF(TYPE(VLOOKUP($A46,FB_13,2,0))=16,\"\",VLOOKUP($A46,FB_13,2,0))&IF(TYPE(VLOOKUP($A46,FB_14,2,0))=16,\"\",VLOOKUP($A46,FB_14,2,0))&IF(TYPE(VLOOKUP($A46,FB_15,2,0))=16,\"\",VLOOKUP($A46,FB_15,2,0))&IF(TYPE(VLOOKUP($A46,FB_16,2,0))=16,\"\",VLOOKUP($A46,FB_16,2,0))&IF(TYPE(VLOOKUP($A46,FB_17,2,0))=16,\"\",VLOOKUP($A46,FB_17,2,0))&IF(TYPE(VLOOKUP($A46,FB_18,2,0))=16,\"\",VLOOKUP($A46,FB_18,2,0))&IF(TYPE(VLOOKUP($A46,FB_19,2,0))=16,\"\",VLOOKUP($A46,FB_19,2,0))&IF(TYPE(VLOOKUP($A46,FB_20,2,0))=16,\"\",VLOOKUP($A46,FB_20,2,0))&IF(TYPE(VLOOKUP($A46,FB_21,2,0))=16,\"\",VLOOKUP($A46,FB_21,2,0))&IF(TYPE(VLOOKUP($A46,FB_22,2,0))=16,\"\",VLOOKUP($A46,FB_22,2,0))&IF(TYPE(VLOOKUP($A46,FB_23,2,0))=16,\"\",VLOOKUP($A46,FB_23,2,0))&IF(TYPE(VLOOKUP($A46,FB_24,2,0))=16,\"\",VLOOKUP($A46,FB_24,2,0))&IF(TYPE(VLOOKUP($A46,FB_25,2,0))=16,\"\",VLOOKUP($A46,FB_25,2,0))&IF(TYPE(VLOOKUP($A46,FB_26,2,0))=16,\"\",VLOOKUP($A46,FB_26,2,0))&IF(TYPE(VLOOKUP($A46,FB_27,2,0))=16,\"\",VLOOKUP($A46,FB_27,2,0))&IF(TYPE(VLOOKUP($A46,FB_28,2,0))=16,\"\",VLOOKUP($A46,FB_28,2,0))&IF(TYPE(VLOOKUP($A46,FB_29,2,0))=16,\"\",VLOOKUP($A46,FB_29,2,0))&IF(TYPE(VLOOKUP($A46,FB_30,2,0))=16,\"\",VLOOKUP($A46,FB_30,2,0))","v":""},null,{"$f":"IF($B46=\"\",\"\",_xlfn.NUMBERVALUE(IF(TYPE(VLOOKUP($A46,FB_1,P$5,0))=16,\"\",VLOOKUP($A46,FB_1,P$5,0))&IF(TYPE(VLOOKUP($A46,FB_2,P$5,0))=16,\"\",VLOOKUP($A46,FB_2,P$5,0))&IF(TYPE(VLOOKUP($A46,FB_3,P$5,0))=16,\"\",VLOOKUP($A46,FB_3,P$5,0))&IF(TYPE(VLOOKUP($A46,FB_4,P$5,0))=16,\"\",VLOOKUP($A46,FB_4,P$5,0))&IF(TYPE(VLOOKUP($A46,FB_5,P$5,0))=16,\"\",VLOOKUP($A46,FB_5,P$5,0))&IF(TYPE(VLOOKUP($A46,FB_6,P$5,0))=16,\"\",VLOOKUP($A46,FB_6,P$5,0))&IF(TYPE(VLOOKUP($A46,FB_7,P$5,0))=16,\"\",VLOOKUP($A46,FB_7,P$5,0))&IF(TYPE(VLOOKUP($A46,FB_8,P$5,0))=16,\"\",VLOOKUP($A46,FB_8,P$5,0))&IF(TYPE(VLOOKUP($A46,FB_9,P$5,0))=16,\"\",VLOOKUP($A46,FB_9,P$5,0))&IF(TYPE(VLOOKUP($A46,FB_10,P$5,0))=16,\"\",VLOOKUP($A46,FB_10,P$5,0))&IF(TYPE(VLOOKUP($A46,FB_11,P$5,0))=16,\"\",VLOOKUP($A46,FB_11,P$5,0))&IF(TYPE(VLOOKUP($A46,FB_12,P$5,0))=16,\"\",VLOOKUP($A46,FB_12,P$5,0))&IF(TYPE(VLOOKUP($A46,FB_13,P$5,0))=16,\"\",VLOOKUP($A46,FB_13,P$5,0))&IF(TYPE(VLOOKUP($A46,FB_14,P$5,0))=16,\"\",VLOOKUP($A46,FB_14,P$5,0))&IF(TYPE(VLOOKUP($A46,FB_15,P$5,0))=16,\"\",VLOOKUP($A46,FB_15,P$5,0))&IF(TYPE(VLOOKUP($A46,FB_16,P$5,0))=16,\"\",VLOOKUP($A46,FB_16,P$5,0))&IF(TYPE(VLOOKUP($A46,FB_17,P$5,0))=16,\"\",VLOOKUP($A46,FB_17,P$5,0))&IF(TYPE(VLOOKUP($A46,FB_18,P$5,0))=16,\"\",VLOOKUP($A46,FB_18,P$5,0))&IF(TYPE(VLOOKUP($A46,FB_19,P$5,0))=16,\"\",VLOOKUP($A46,FB_19,P$5,0))&IF(TYPE(VLOOKUP($A46,FB_20,P$5,0))=16,\"\",VLOOKUP($A46,FB_20,P$5,0))&IF(TYPE(VLOOKUP($A46,FB_21,P$5,0))=16,\"\",VLOOKUP($A46,FB_21,P$5,0))&IF(TYPE(VLOOKUP($A46,FB_22,P$5,0))=16,\"\",VLOOKUP($A46,FB_22,P$5,0))&IF(TYPE(VLOOKUP($A46,FB_23,P$5,0))=16,\"\",VLOOKUP($A46,FB_23,P$5,0))&IF(TYPE(VLOOKUP($A46,FB_24,P$5,0))=16,\"\",VLOOKUP($A46,FB_24,P$5,0))&IF(TYPE(VLOOKUP($A46,FB_25,P$5,0))=16,\"\",VLOOKUP($A46,FB_25,P$5,0))&IF(TYPE(VLOOKUP($A46,FB_26,P$5,0))=16,\"\",VLOOKUP($A46,FB_26,P$5,0))&IF(TYPE(VLOOKUP($A46,FB_27,P$5,0))=16,\"\",VLOOKUP($A46,FB_27,P$5,0))&IF(TYPE(VLOOKUP($A46,FB_28,P$5,0))=16,\"\",VLOOKUP($A46,FB_28,P$5,0))&IF(TYPE(VLOOKUP($A46,FB_29,P$5,0))=16,\"\",VLOOKUP($A46,FB_29,P$5,0))&IF(TYPE(VLOOKUP($A46,FB_30,P$5,0))=16,\"\",VLOOKUP($A46,FB_30,P$5,0))))","v":""},"",{"$f":"IF($B46=\"\",\"\",_xlfn.NUMBERVALUE(IF(TYPE(VLOOKUP($A46,FB_1,R$5,0))=16,\"\",VLOOKUP($A46,FB_1,R$5,0))&IF(TYPE(VLOOKUP($A46,FB_2,R$5,0))=16,\"\",VLOOKUP($A46,FB_2,R$5,0))&IF(TYPE(VLOOKUP($A46,FB_3,R$5,0))=16,\"\",VLOOKUP($A46,FB_3,R$5,0))&IF(TYPE(VLOOKUP($A46,FB_4,R$5,0))=16,\"\",VLOOKUP($A46,FB_4,R$5,0))&IF(TYPE(VLOOKUP($A46,FB_5,R$5,0))=16,\"\",VLOOKUP($A46,FB_5,R$5,0))&IF(TYPE(VLOOKUP($A46,FB_6,R$5,0))=16,\"\",VLOOKUP($A46,FB_6,R$5,0))&IF(TYPE(VLOOKUP($A46,FB_7,R$5,0))=16,\"\",VLOOKUP($A46,FB_7,R$5,0))&IF(TYPE(VLOOKUP($A46,FB_8,R$5,0))=16,\"\",VLOOKUP($A46,FB_8,R$5,0))&IF(TYPE(VLOOKUP($A46,FB_9,R$5,0))=16,\"\",VLOOKUP($A46,FB_9,R$5,0))&IF(TYPE(VLOOKUP($A46,FB_10,R$5,0))=16,\"\",VLOOKUP($A46,FB_10,R$5,0))&IF(TYPE(VLOOKUP($A46,FB_11,R$5,0))=16,\"\",VLOOKUP($A46,FB_11,R$5,0))&IF(TYPE(VLOOKUP($A46,FB_12,R$5,0))=16,\"\",VLOOKUP($A46,FB_12,R$5,0))&IF(TYPE(VLOOKUP($A46,FB_13,R$5,0))=16,\"\",VLOOKUP($A46,FB_13,R$5,0))&IF(TYPE(VLOOKUP($A46,FB_14,R$5,0))=16,\"\",VLOOKUP($A46,FB_14,R$5,0))&IF(TYPE(VLOOKUP($A46,FB_15,R$5,0))=16,\"\",VLOOKUP($A46,FB_15,R$5,0))&IF(TYPE(VLOOKUP($A46,FB_16,R$5,0))=16,\"\",VLOOKUP($A46,FB_16,R$5,0))&IF(TYPE(VLOOKUP($A46,FB_17,R$5,0))=16,\"\",VLOOKUP($A46,FB_17,R$5,0))&IF(TYPE(VLOOKUP($A46,FB_18,R$5,0))=16,\"\",VLOOKUP($A46,FB_18,R$5,0))&IF(TYPE(VLOOKUP($A46,FB_19,R$5,0))=16,\"\",VLOOKUP($A46,FB_19,R$5,0))&IF(TYPE(VLOOKUP($A46,FB_20,R$5,0))=16,\"\",VLOOKUP($A46,FB_20,R$5,0))&IF(TYPE(VLOOKUP($A46,FB_21,R$5,0))=16,\"\",VLOOKUP($A46,FB_21,R$5,0))&IF(TYPE(VLOOKUP($A46,FB_22,R$5,0))=16,\"\",VLOOKUP($A46,FB_22,R$5,0))&IF(TYPE(VLOOKUP($A46,FB_23,R$5,0))=16,\"\",VLOOKUP($A46,FB_23,R$5,0))&IF(TYPE(VLOOKUP($A46,FB_24,R$5,0))=16,\"\",VLOOKUP($A46,FB_24,R$5,0))&IF(TYPE(VLOOKUP($A46,FB_25,R$5,0))=16,\"\",VLOOKUP($A46,FB_25,R$5,0))&IF(TYPE(VLOOKUP($A46,FB_26,R$5,0))=16,\"\",VLOOKUP($A46,FB_26,R$5,0))&IF(TYPE(VLOOKUP($A46,FB_27,R$5,0))=16,\"\",VLOOKUP($A46,FB_27,R$5,0))&IF(TYPE(VLOOKUP($A46,FB_28,R$5,0))=16,\"\",VLOOKUP($A46,FB_28,R$5,0))&IF(TYPE(VLOOKUP($A46,FB_29,R$5,0))=16,\"\",VLOOKUP($A46,FB_29,R$5,0))&IF(TYPE(VLOOKUP($A46,FB_30,R$5,0))=16,\"\",VLOOKUP($A46,FB_30,R$5,0))))","v":""},{"$f":"IF($B46=\"\",\"\",IF(TYPE(VLOOKUP($A46,FB_1,S$5,0))=16,\"\",VLOOKUP($A46,FB_1,S$5,0))&IF(TYPE(VLOOKUP($A46,FB_2,S$5,0))=16,\"\",VLOOKUP($A46,FB_2,S$5,0))&IF(TYPE(VLOOKUP($A46,FB_3,S$5,0))=16,\"\",VLOOKUP($A46,FB_3,S$5,0))&IF(TYPE(VLOOKUP($A46,FB_4,S$5,0))=16,\"\",VLOOKUP($A46,FB_4,S$5,0))&IF(TYPE(VLOOKUP($A46,FB_5,S$5,0))=16,\"\",VLOOKUP($A46,FB_5,S$5,0))&IF(TYPE(VLOOKUP($A46,FB_6,S$5,0))=16,\"\",VLOOKUP($A46,FB_6,S$5,0))&IF(TYPE(VLOOKUP($A46,FB_7,S$5,0))=16,\"\",VLOOKUP($A46,FB_7,S$5,0))&IF(TYPE(VLOOKUP($A46,FB_8,S$5,0))=16,\"\",VLOOKUP($A46,FB_8,S$5,0))&IF(TYPE(VLOOKUP($A46,FB_9,S$5,0))=16,\"\",VLOOKUP($A46,FB_9,S$5,0))&IF(TYPE(VLOOKUP($A46,FB_10,S$5,0))=16,\"\",VLOOKUP($A46,FB_10,S$5,0))&IF(TYPE(VLOOKUP($A46,FB_11,S$5,0))=16,\"\",VLOOKUP($A46,FB_11,S$5,0))&IF(TYPE(VLOOKUP($A46,FB_12,S$5,0))=16,\"\",VLOOKUP($A46,FB_12,S$5,0))&IF(TYPE(VLOOKUP($A46,FB_13,S$5,0))=16,\"\",VLOOKUP($A46,FB_13,S$5,0))&IF(TYPE(VLOOKUP($A46,FB_14,S$5,0))=16,\"\",VLOOKUP($A46,FB_14,S$5,0))&IF(TYPE(VLOOKUP($A46,FB_15,S$5,0))=16,\"\",VLOOKUP($A46,FB_15,S$5,0))&IF(TYPE(VLOOKUP($A46,FB_16,S$5,0))=16,\"\",VLOOKUP($A46,FB_16,S$5,0))&IF(TYPE(VLOOKUP($A46,FB_17,S$5,0))=16,\"\",VLOOKUP($A46,FB_17,S$5,0))&IF(TYPE(VLOOKUP($A46,FB_18,S$5,0))=16,\"\",VLOOKUP($A46,FB_18,S$5,0))&IF(TYPE(VLOOKUP($A46,FB_19,S$5,0))=16,\"\",VLOOKUP($A46,FB_19,S$5,0))&IF(TYPE(VLOOKUP($A46,FB_20,S$5,0))=16,\"\",VLOOKUP($A46,FB_20,S$5,0))&IF(TYPE(VLOOKUP($A46,FB_21,S$5,0))=16,\"\",VLOOKUP($A46,FB_21,S$5,0))&IF(TYPE(VLOOKUP($A46,FB_22,S$5,0))=16,\"\",VLOOKUP($A46,FB_22,S$5,0))&IF(TYPE(VLOOKUP($A46,FB_23,S$5,0))=16,\"\",VLOOKUP($A46,FB_23,S$5,0))&IF(TYPE(VLOOKUP($A46,FB_24,S$5,0))=16,\"\",VLOOKUP($A46,FB_24,S$5,0))&IF(TYPE(VLOOKUP($A46,FB_25,S$5,0))=16,\"\",VLOOKUP($A46,FB_25,S$5,0))&IF(TYPE(VLOOKUP($A46,FB_26,S$5,0))=16,\"\",VLOOKUP($A46,FB_26,S$5,0))&IF(TYPE(VLOOKUP($A46,FB_27,S$5,0))=16,\"\",VLOOKUP($A46,FB_27,S$5,0))&IF(TYPE(VLOOKUP($A46,FB_28,S$5,0))=16,\"\",VLOOKUP($A46,FB_28,S$5,0))&IF(TYPE(VLOOKUP($A46,FB_29,S$5,0))=16,\"\",VLOOKUP($A46,FB_29,S$5,0))&IF(TYPE(VLOOKUP($A46,FB_30,S$5,0))=16,\"\",VLOOKUP($A46,FB_30,S$5,0)))","v":""},null,null,null,null,null,null,null,null,null,null,null,null,null,null,null,null,"",":","","",""]
["18.",{"$f":"IF(TYPE(VLOOKUP($A47,FB_1,2,0))=16,\"\",VLOOKUP($A47,FB_1,2,0))&IF(TYPE(VLOOKUP($A47,FB_2,2,0))=16,\"\",VLOOKUP($A47,FB_2,2,0))&IF(TYPE(VLOOKUP($A47,FB_3,2,0))=16,\"\",VLOOKUP($A47,FB_3,2,0))&IF(TYPE(VLOOKUP($A47,FB_4,2,0))=16,\"\",VLOOKUP($A47,FB_4,2,0))&IF(TYPE(VLOOKUP($A47,FB_5,2,0))=16,\"\",VLOOKUP($A47,FB_5,2,0))&IF(TYPE(VLOOKUP($A47,FB_6,2,0))=16,\"\",VLOOKUP($A47,FB_6,2,0))&IF(TYPE(VLOOKUP($A47,FB_7,2,0))=16,\"\",VLOOKUP($A47,FB_7,2,0))&IF(TYPE(VLOOKUP($A47,FB_8,2,0))=16,\"\",VLOOKUP($A47,FB_8,2,0))&IF(TYPE(VLOOKUP($A47,FB_9,2,0))=16,\"\",VLOOKUP($A47,FB_9,2,0))&IF(TYPE(VLOOKUP($A47,FB_10,2,0))=16,\"\",VLOOKUP($A47,FB_10,2,0))&IF(TYPE(VLOOKUP($A47,FB_11,2,0))=16,\"\",VLOOKUP($A47,FB_11,2,0))&IF(TYPE(VLOOKUP($A47,FB_12,2,0))=16,\"\",VLOOKUP($A47,FB_12,2,0))&IF(TYPE(VLOOKUP($A47,FB_13,2,0))=16,\"\",VLOOKUP($A47,FB_13,2,0))&IF(TYPE(VLOOKUP($A47,FB_14,2,0))=16,\"\",VLOOKUP($A47,FB_14,2,0))&IF(TYPE(VLOOKUP($A47,FB_15,2,0))=16,\"\",VLOOKUP($A47,FB_15,2,0))&IF(TYPE(VLOOKUP($A47,FB_16,2,0))=16,\"\",VLOOKUP($A47,FB_16,2,0))&IF(TYPE(VLOOKUP($A47,FB_17,2,0))=16,\"\",VLOOKUP($A47,FB_17,2,0))&IF(TYPE(VLOOKUP($A47,FB_18,2,0))=16,\"\",VLOOKUP($A47,FB_18,2,0))&IF(TYPE(VLOOKUP($A47,FB_19,2,0))=16,\"\",VLOOKUP($A47,FB_19,2,0))&IF(TYPE(VLOOKUP($A47,FB_20,2,0))=16,\"\",VLOOKUP($A47,FB_20,2,0))&IF(TYPE(VLOOKUP($A47,FB_21,2,0))=16,\"\",VLOOKUP($A47,FB_21,2,0))&IF(TYPE(VLOOKUP($A47,FB_22,2,0))=16,\"\",VLOOKUP($A47,FB_22,2,0))&IF(TYPE(VLOOKUP($A47,FB_23,2,0))=16,\"\",VLOOKUP($A47,FB_23,2,0))&IF(TYPE(VLOOKUP($A47,FB_24,2,0))=16,\"\",VLOOKUP($A47,FB_24,2,0))&IF(TYPE(VLOOKUP($A47,FB_25,2,0))=16,\"\",VLOOKUP($A47,FB_25,2,0))&IF(TYPE(VLOOKUP($A47,FB_26,2,0))=16,\"\",VLOOKUP($A47,FB_26,2,0))&IF(TYPE(VLOOKUP($A47,FB_27,2,0))=16,\"\",VLOOKUP($A47,FB_27,2,0))&IF(TYPE(VLOOKUP($A47,FB_28,2,0))=16,\"\",VLOOKUP($A47,FB_28,2,0))&IF(TYPE(VLOOKUP($A47,FB_29,2,0))=16,\"\",VLOOKUP($A47,FB_29,2,0))&IF(TYPE(VLOOKUP($A47,FB_30,2,0))=16,\"\",VLOOKUP($A47,FB_30,2,0))","v":""},null,{"$f":"IF($B47=\"\",\"\",_xlfn.NUMBERVALUE(IF(TYPE(VLOOKUP($A47,FB_1,P$5,0))=16,\"\",VLOOKUP($A47,FB_1,P$5,0))&IF(TYPE(VLOOKUP($A47,FB_2,P$5,0))=16,\"\",VLOOKUP($A47,FB_2,P$5,0))&IF(TYPE(VLOOKUP($A47,FB_3,P$5,0))=16,\"\",VLOOKUP($A47,FB_3,P$5,0))&IF(TYPE(VLOOKUP($A47,FB_4,P$5,0))=16,\"\",VLOOKUP($A47,FB_4,P$5,0))&IF(TYPE(VLOOKUP($A47,FB_5,P$5,0))=16,\"\",VLOOKUP($A47,FB_5,P$5,0))&IF(TYPE(VLOOKUP($A47,FB_6,P$5,0))=16,\"\",VLOOKUP($A47,FB_6,P$5,0))&IF(TYPE(VLOOKUP($A47,FB_7,P$5,0))=16,\"\",VLOOKUP($A47,FB_7,P$5,0))&IF(TYPE(VLOOKUP($A47,FB_8,P$5,0))=16,\"\",VLOOKUP($A47,FB_8,P$5,0))&IF(TYPE(VLOOKUP($A47,FB_9,P$5,0))=16,\"\",VLOOKUP($A47,FB_9,P$5,0))&IF(TYPE(VLOOKUP($A47,FB_10,P$5,0))=16,\"\",VLOOKUP($A47,FB_10,P$5,0))&IF(TYPE(VLOOKUP($A47,FB_11,P$5,0))=16,\"\",VLOOKUP($A47,FB_11,P$5,0))&IF(TYPE(VLOOKUP($A47,FB_12,P$5,0))=16,\"\",VLOOKUP($A47,FB_12,P$5,0))&IF(TYPE(VLOOKUP($A47,FB_13,P$5,0))=16,\"\",VLOOKUP($A47,FB_13,P$5,0))&IF(TYPE(VLOOKUP($A47,FB_14,P$5,0))=16,\"\",VLOOKUP($A47,FB_14,P$5,0))&IF(TYPE(VLOOKUP($A47,FB_15,P$5,0))=16,\"\",VLOOKUP($A47,FB_15,P$5,0))&IF(TYPE(VLOOKUP($A47,FB_16,P$5,0))=16,\"\",VLOOKUP($A47,FB_16,P$5,0))&IF(TYPE(VLOOKUP($A47,FB_17,P$5,0))=16,\"\",VLOOKUP($A47,FB_17,P$5,0))&IF(TYPE(VLOOKUP($A47,FB_18,P$5,0))=16,\"\",VLOOKUP($A47,FB_18,P$5,0))&IF(TYPE(VLOOKUP($A47,FB_19,P$5,0))=16,\"\",VLOOKUP($A47,FB_19,P$5,0))&IF(TYPE(VLOOKUP($A47,FB_20,P$5,0))=16,\"\",VLOOKUP($A47,FB_20,P$5,0))&IF(TYPE(VLOOKUP($A47,FB_21,P$5,0))=16,\"\",VLOOKUP($A47,FB_21,P$5,0))&IF(TYPE(VLOOKUP($A47,FB_22,P$5,0))=16,\"\",VLOOKUP($A47,FB_22,P$5,0))&IF(TYPE(VLOOKUP($A47,FB_23,P$5,0))=16,\"\",VLOOKUP($A47,FB_23,P$5,0))&IF(TYPE(VLOOKUP($A47,FB_24,P$5,0))=16,\"\",VLOOKUP($A47,FB_24,P$5,0))&IF(TYPE(VLOOKUP($A47,FB_25,P$5,0))=16,\"\",VLOOKUP($A47,FB_25,P$5,0))&IF(TYPE(VLOOKUP($A47,FB_26,P$5,0))=16,\"\",VLOOKUP($A47,FB_26,P$5,0))&IF(TYPE(VLOOKUP($A47,FB_27,P$5,0))=16,\"\",VLOOKUP($A47,FB_27,P$5,0))&IF(TYPE(VLOOKUP($A47,FB_28,P$5,0))=16,\"\",VLOOKUP($A47,FB_28,P$5,0))&IF(TYPE(VLOOKUP($A47,FB_29,P$5,0))=16,\"\",VLOOKUP($A47,FB_29,P$5,0))&IF(TYPE(VLOOKUP($A47,FB_30,P$5,0))=16,\"\",VLOOKUP($A47,FB_30,P$5,0))))","v":""},"",{"$f":"IF($B47=\"\",\"\",_xlfn.NUMBERVALUE(IF(TYPE(VLOOKUP($A47,FB_1,R$5,0))=16,\"\",VLOOKUP($A47,FB_1,R$5,0))&IF(TYPE(VLOOKUP($A47,FB_2,R$5,0))=16,\"\",VLOOKUP($A47,FB_2,R$5,0))&IF(TYPE(VLOOKUP($A47,FB_3,R$5,0))=16,\"\",VLOOKUP($A47,FB_3,R$5,0))&IF(TYPE(VLOOKUP($A47,FB_4,R$5,0))=16,\"\",VLOOKUP($A47,FB_4,R$5,0))&IF(TYPE(VLOOKUP($A47,FB_5,R$5,0))=16,\"\",VLOOKUP($A47,FB_5,R$5,0))&IF(TYPE(VLOOKUP($A47,FB_6,R$5,0))=16,\"\",VLOOKUP($A47,FB_6,R$5,0))&IF(TYPE(VLOOKUP($A47,FB_7,R$5,0))=16,\"\",VLOOKUP($A47,FB_7,R$5,0))&IF(TYPE(VLOOKUP($A47,FB_8,R$5,0))=16,\"\",VLOOKUP($A47,FB_8,R$5,0))&IF(TYPE(VLOOKUP($A47,FB_9,R$5,0))=16,\"\",VLOOKUP($A47,FB_9,R$5,0))&IF(TYPE(VLOOKUP($A47,FB_10,R$5,0))=16,\"\",VLOOKUP($A47,FB_10,R$5,0))&IF(TYPE(VLOOKUP($A47,FB_11,R$5,0))=16,\"\",VLOOKUP($A47,FB_11,R$5,0))&IF(TYPE(VLOOKUP($A47,FB_12,R$5,0))=16,\"\",VLOOKUP($A47,FB_12,R$5,0))&IF(TYPE(VLOOKUP($A47,FB_13,R$5,0))=16,\"\",VLOOKUP($A47,FB_13,R$5,0))&IF(TYPE(VLOOKUP($A47,FB_14,R$5,0))=16,\"\",VLOOKUP($A47,FB_14,R$5,0))&IF(TYPE(VLOOKUP($A47,FB_15,R$5,0))=16,\"\",VLOOKUP($A47,FB_15,R$5,0))&IF(TYPE(VLOOKUP($A47,FB_16,R$5,0))=16,\"\",VLOOKUP($A47,FB_16,R$5,0))&IF(TYPE(VLOOKUP($A47,FB_17,R$5,0))=16,\"\",VLOOKUP($A47,FB_17,R$5,0))&IF(TYPE(VLOOKUP($A47,FB_18,R$5,0))=16,\"\",VLOOKUP($A47,FB_18,R$5,0))&IF(TYPE(VLOOKUP($A47,FB_19,R$5,0))=16,\"\",VLOOKUP($A47,FB_19,R$5,0))&IF(TYPE(VLOOKUP($A47,FB_20,R$5,0))=16,\"\",VLOOKUP($A47,FB_20,R$5,0))&IF(TYPE(VLOOKUP($A47,FB_21,R$5,0))=16,\"\",VLOOKUP($A47,FB_21,R$5,0))&IF(TYPE(VLOOKUP($A47,FB_22,R$5,0))=16,\"\",VLOOKUP($A47,FB_22,R$5,0))&IF(TYPE(VLOOKUP($A47,FB_23,R$5,0))=16,\"\",VLOOKUP($A47,FB_23,R$5,0))&IF(TYPE(VLOOKUP($A47,FB_24,R$5,0))=16,\"\",VLOOKUP($A47,FB_24,R$5,0))&IF(TYPE(VLOOKUP($A47,FB_25,R$5,0))=16,\"\",VLOOKUP($A47,FB_25,R$5,0))&IF(TYPE(VLOOKUP($A47,FB_26,R$5,0))=16,\"\",VLOOKUP($A47,FB_26,R$5,0))&IF(TYPE(VLOOKUP($A47,FB_27,R$5,0))=16,\"\",VLOOKUP($A47,FB_27,R$5,0))&IF(TYPE(VLOOKUP($A47,FB_28,R$5,0))=16,\"\",VLOOKUP($A47,FB_28,R$5,0))&IF(TYPE(VLOOKUP($A47,FB_29,R$5,0))=16,\"\",VLOOKUP($A47,FB_29,R$5,0))&IF(TYPE(VLOOKUP($A47,FB_30,R$5,0))=16,\"\",VLOOKUP($A47,FB_30,R$5,0))))","v":""},{"$f":"IF($B47=\"\",\"\",IF(TYPE(VLOOKUP($A47,FB_1,S$5,0))=16,\"\",VLOOKUP($A47,FB_1,S$5,0))&IF(TYPE(VLOOKUP($A47,FB_2,S$5,0))=16,\"\",VLOOKUP($A47,FB_2,S$5,0))&IF(TYPE(VLOOKUP($A47,FB_3,S$5,0))=16,\"\",VLOOKUP($A47,FB_3,S$5,0))&IF(TYPE(VLOOKUP($A47,FB_4,S$5,0))=16,\"\",VLOOKUP($A47,FB_4,S$5,0))&IF(TYPE(VLOOKUP($A47,FB_5,S$5,0))=16,\"\",VLOOKUP($A47,FB_5,S$5,0))&IF(TYPE(VLOOKUP($A47,FB_6,S$5,0))=16,\"\",VLOOKUP($A47,FB_6,S$5,0))&IF(TYPE(VLOOKUP($A47,FB_7,S$5,0))=16,\"\",VLOOKUP($A47,FB_7,S$5,0))&IF(TYPE(VLOOKUP($A47,FB_8,S$5,0))=16,\"\",VLOOKUP($A47,FB_8,S$5,0))&IF(TYPE(VLOOKUP($A47,FB_9,S$5,0))=16,\"\",VLOOKUP($A47,FB_9,S$5,0))&IF(TYPE(VLOOKUP($A47,FB_10,S$5,0))=16,\"\",VLOOKUP($A47,FB_10,S$5,0))&IF(TYPE(VLOOKUP($A47,FB_11,S$5,0))=16,\"\",VLOOKUP($A47,FB_11,S$5,0))&IF(TYPE(VLOOKUP($A47,FB_12,S$5,0))=16,\"\",VLOOKUP($A47,FB_12,S$5,0))&IF(TYPE(VLOOKUP($A47,FB_13,S$5,0))=16,\"\",VLOOKUP($A47,FB_13,S$5,0))&IF(TYPE(VLOOKUP($A47,FB_14,S$5,0))=16,\"\",VLOOKUP($A47,FB_14,S$5,0))&IF(TYPE(VLOOKUP($A47,FB_15,S$5,0))=16,\"\",VLOOKUP($A47,FB_15,S$5,0))&IF(TYPE(VLOOKUP($A47,FB_16,S$5,0))=16,\"\",VLOOKUP($A47,FB_16,S$5,0))&IF(TYPE(VLOOKUP($A47,FB_17,S$5,0))=16,\"\",VLOOKUP($A47,FB_17,S$5,0))&IF(TYPE(VLOOKUP($A47,FB_18,S$5,0))=16,\"\",VLOOKUP($A47,FB_18,S$5,0))&IF(TYPE(VLOOKUP($A47,FB_19,S$5,0))=16,\"\",VLOOKUP($A47,FB_19,S$5,0))&IF(TYPE(VLOOKUP($A47,FB_20,S$5,0))=16,\"\",VLOOKUP($A47,FB_20,S$5,0))&IF(TYPE(VLOOKUP($A47,FB_21,S$5,0))=16,\"\",VLOOKUP($A47,FB_21,S$5,0))&IF(TYPE(VLOOKUP($A47,FB_22,S$5,0))=16,\"\",VLOOKUP($A47,FB_22,S$5,0))&IF(TYPE(VLOOKUP($A47,FB_23,S$5,0))=16,\"\",VLOOKUP($A47,FB_23,S$5,0))&IF(TYPE(VLOOKUP($A47,FB_24,S$5,0))=16,\"\",VLOOKUP($A47,FB_24,S$5,0))&IF(TYPE(VLOOKUP($A47,FB_25,S$5,0))=16,\"\",VLOOKUP($A47,FB_25,S$5,0))&IF(TYPE(VLOOKUP($A47,FB_26,S$5,0))=16,\"\",VLOOKUP($A47,FB_26,S$5,0))&IF(TYPE(VLOOKUP($A47,FB_27,S$5,0))=16,\"\",VLOOKUP($A47,FB_27,S$5,0))&IF(TYPE(VLOOKUP($A47,FB_28,S$5,0))=16,\"\",VLOOKUP($A47,FB_28,S$5,0))&IF(TYPE(VLOOKUP($A47,FB_29,S$5,0))=16,\"\",VLOOKUP($A47,FB_29,S$5,0))&IF(TYPE(VLOOKUP($A47,FB_30,S$5,0))=16,\"\",VLOOKUP($A47,FB_30,S$5,0)))","v":""},null,null,null,null,null,null,null,null,null,null,null,null,null,null,null,null,"",":","","",""]
["19.",{"$f":"IF(TYPE(VLOOKUP($A48,FB_1,2,0))=16,\"\",VLOOKUP($A48,FB_1,2,0))&IF(TYPE(VLOOKUP($A48,FB_2,2,0))=16,\"\",VLOOKUP($A48,FB_2,2,0))&IF(TYPE(VLOOKUP($A48,FB_3,2,0))=16,\"\",VLOOKUP($A48,FB_3,2,0))&IF(TYPE(VLOOKUP($A48,FB_4,2,0))=16,\"\",VLOOKUP($A48,FB_4,2,0))&IF(TYPE(VLOOKUP($A48,FB_5,2,0))=16,\"\",VLOOKUP($A48,FB_5,2,0))&IF(TYPE(VLOOKUP($A48,FB_6,2,0))=16,\"\",VLOOKUP($A48,FB_6,2,0))&IF(TYPE(VLOOKUP($A48,FB_7,2,0))=16,\"\",VLOOKUP($A48,FB_7,2,0))&IF(TYPE(VLOOKUP($A48,FB_8,2,0))=16,\"\",VLOOKUP($A48,FB_8,2,0))&IF(TYPE(VLOOKUP($A48,FB_9,2,0))=16,\"\",VLOOKUP($A48,FB_9,2,0))&IF(TYPE(VLOOKUP($A48,FB_10,2,0))=16,\"\",VLOOKUP($A48,FB_10,2,0))&IF(TYPE(VLOOKUP($A48,FB_11,2,0))=16,\"\",VLOOKUP($A48,FB_11,2,0))&IF(TYPE(VLOOKUP($A48,FB_12,2,0))=16,\"\",VLOOKUP($A48,FB_12,2,0))&IF(TYPE(VLOOKUP($A48,FB_13,2,0))=16,\"\",VLOOKUP($A48,FB_13,2,0))&IF(TYPE(VLOOKUP($A48,FB_14,2,0))=16,\"\",VLOOKUP($A48,FB_14,2,0))&IF(TYPE(VLOOKUP($A48,FB_15,2,0))=16,\"\",VLOOKUP($A48,FB_15,2,0))&IF(TYPE(VLOOKUP($A48,FB_16,2,0))=16,\"\",VLOOKUP($A48,FB_16,2,0))&IF(TYPE(VLOOKUP($A48,FB_17,2,0))=16,\"\",VLOOKUP($A48,FB_17,2,0))&IF(TYPE(VLOOKUP($A48,FB_18,2,0))=16,\"\",VLOOKUP($A48,FB_18,2,0))&IF(TYPE(VLOOKUP($A48,FB_19,2,0))=16,\"\",VLOOKUP($A48,FB_19,2,0))&IF(TYPE(VLOOKUP($A48,FB_20,2,0))=16,\"\",VLOOKUP($A48,FB_20,2,0))&IF(TYPE(VLOOKUP($A48,FB_21,2,0))=16,\"\",VLOOKUP($A48,FB_21,2,0))&IF(TYPE(VLOOKUP($A48,FB_22,2,0))=16,\"\",VLOOKUP($A48,FB_22,2,0))&IF(TYPE(VLOOKUP($A48,FB_23,2,0))=16,\"\",VLOOKUP($A48,FB_23,2,0))&IF(TYPE(VLOOKUP($A48,FB_24,2,0))=16,\"\",VLOOKUP($A48,FB_24,2,0))&IF(TYPE(VLOOKUP($A48,FB_25,2,0))=16,\"\",VLOOKUP($A48,FB_25,2,0))&IF(TYPE(VLOOKUP($A48,FB_26,2,0))=16,\"\",VLOOKUP($A48,FB_26,2,0))&IF(TYPE(VLOOKUP($A48,FB_27,2,0))=16,\"\",VLOOKUP($A48,FB_27,2,0))&IF(TYPE(VLOOKUP($A48,FB_28,2,0))=16,\"\",VLOOKUP($A48,FB_28,2,0))&IF(TYPE(VLOOKUP($A48,FB_29,2,0))=16,\"\",VLOOKUP($A48,FB_29,2,0))&IF(TYPE(VLOOKUP($A48,FB_30,2,0))=16,\"\",VLOOKUP($A48,FB_30,2,0))","v":""},null,{"$f":"IF($B48=\"\",\"\",_xlfn.NUMBERVALUE(IF(TYPE(VLOOKUP($A48,FB_1,P$5,0))=16,\"\",VLOOKUP($A48,FB_1,P$5,0))&IF(TYPE(VLOOKUP($A48,FB_2,P$5,0))=16,\"\",VLOOKUP($A48,FB_2,P$5,0))&IF(TYPE(VLOOKUP($A48,FB_3,P$5,0))=16,\"\",VLOOKUP($A48,FB_3,P$5,0))&IF(TYPE(VLOOKUP($A48,FB_4,P$5,0))=16,\"\",VLOOKUP($A48,FB_4,P$5,0))&IF(TYPE(VLOOKUP($A48,FB_5,P$5,0))=16,\"\",VLOOKUP($A48,FB_5,P$5,0))&IF(TYPE(VLOOKUP($A48,FB_6,P$5,0))=16,\"\",VLOOKUP($A48,FB_6,P$5,0))&IF(TYPE(VLOOKUP($A48,FB_7,P$5,0))=16,\"\",VLOOKUP($A48,FB_7,P$5,0))&IF(TYPE(VLOOKUP($A48,FB_8,P$5,0))=16,\"\",VLOOKUP($A48,FB_8,P$5,0))&IF(TYPE(VLOOKUP($A48,FB_9,P$5,0))=16,\"\",VLOOKUP($A48,FB_9,P$5,0))&IF(TYPE(VLOOKUP($A48,FB_10,P$5,0))=16,\"\",VLOOKUP($A48,FB_10,P$5,0))&IF(TYPE(VLOOKUP($A48,FB_11,P$5,0))=16,\"\",VLOOKUP($A48,FB_11,P$5,0))&IF(TYPE(VLOOKUP($A48,FB_12,P$5,0))=16,\"\",VLOOKUP($A48,FB_12,P$5,0))&IF(TYPE(VLOOKUP($A48,FB_13,P$5,0))=16,\"\",VLOOKUP($A48,FB_13,P$5,0))&IF(TYPE(VLOOKUP($A48,FB_14,P$5,0))=16,\"\",VLOOKUP($A48,FB_14,P$5,0))&IF(TYPE(VLOOKUP($A48,FB_15,P$5,0))=16,\"\",VLOOKUP($A48,FB_15,P$5,0))&IF(TYPE(VLOOKUP($A48,FB_16,P$5,0))=16,\"\",VLOOKUP($A48,FB_16,P$5,0))&IF(TYPE(VLOOKUP($A48,FB_17,P$5,0))=16,\"\",VLOOKUP($A48,FB_17,P$5,0))&IF(TYPE(VLOOKUP($A48,FB_18,P$5,0))=16,\"\",VLOOKUP($A48,FB_18,P$5,0))&IF(TYPE(VLOOKUP($A48,FB_19,P$5,0))=16,\"\",VLOOKUP($A48,FB_19,P$5,0))&IF(TYPE(VLOOKUP($A48,FB_20,P$5,0))=16,\"\",VLOOKUP($A48,FB_20,P$5,0))&IF(TYPE(VLOOKUP($A48,FB_21,P$5,0))=16,\"\",VLOOKUP($A48,FB_21,P$5,0))&IF(TYPE(VLOOKUP($A48,FB_22,P$5,0))=16,\"\",VLOOKUP($A48,FB_22,P$5,0))&IF(TYPE(VLOOKUP($A48,FB_23,P$5,0))=16,\"\",VLOOKUP($A48,FB_23,P$5,0))&IF(TYPE(VLOOKUP($A48,FB_24,P$5,0))=16,\"\",VLOOKUP($A48,FB_24,P$5,0))&IF(TYPE(VLOOKUP($A48,FB_25,P$5,0))=16,\"\",VLOOKUP($A48,FB_25,P$5,0))&IF(TYPE(VLOOKUP($A48,FB_26,P$5,0))=16,\"\",VLOOKUP($A48,FB_26,P$5,0))&IF(TYPE(VLOOKUP($A48,FB_27,P$5,0))=16,\"\",VLOOKUP($A48,FB_27,P$5,0))&IF(TYPE(VLOOKUP($A48,FB_28,P$5,0))=16,\"\",VLOOKUP($A48,FB_28,P$5,0))&IF(TYPE(VLOOKUP($A48,FB_29,P$5,0))=16,\"\",VLOOKUP($A48,FB_29,P$5,0))&IF(TYPE(VLOOKUP($A48,FB_30,P$5,0))=16,\"\",VLOOKUP($A48,FB_30,P$5,0))))","v":""},"",{"$f":"IF($B48=\"\",\"\",_xlfn.NUMBERVALUE(IF(TYPE(VLOOKUP($A48,FB_1,R$5,0))=16,\"\",VLOOKUP($A48,FB_1,R$5,0))&IF(TYPE(VLOOKUP($A48,FB_2,R$5,0))=16,\"\",VLOOKUP($A48,FB_2,R$5,0))&IF(TYPE(VLOOKUP($A48,FB_3,R$5,0))=16,\"\",VLOOKUP($A48,FB_3,R$5,0))&IF(TYPE(VLOOKUP($A48,FB_4,R$5,0))=16,\"\",VLOOKUP($A48,FB_4,R$5,0))&IF(TYPE(VLOOKUP($A48,FB_5,R$5,0))=16,\"\",VLOOKUP($A48,FB_5,R$5,0))&IF(TYPE(VLOOKUP($A48,FB_6,R$5,0))=16,\"\",VLOOKUP($A48,FB_6,R$5,0))&IF(TYPE(VLOOKUP($A48,FB_7,R$5,0))=16,\"\",VLOOKUP($A48,FB_7,R$5,0))&IF(TYPE(VLOOKUP($A48,FB_8,R$5,0))=16,\"\",VLOOKUP($A48,FB_8,R$5,0))&IF(TYPE(VLOOKUP($A48,FB_9,R$5,0))=16,\"\",VLOOKUP($A48,FB_9,R$5,0))&IF(TYPE(VLOOKUP($A48,FB_10,R$5,0))=16,\"\",VLOOKUP($A48,FB_10,R$5,0))&IF(TYPE(VLOOKUP($A48,FB_11,R$5,0))=16,\"\",VLOOKUP($A48,FB_11,R$5,0))&IF(TYPE(VLOOKUP($A48,FB_12,R$5,0))=16,\"\",VLOOKUP($A48,FB_12,R$5,0))&IF(TYPE(VLOOKUP($A48,FB_13,R$5,0))=16,\"\",VLOOKUP($A48,FB_13,R$5,0))&IF(TYPE(VLOOKUP($A48,FB_14,R$5,0))=16,\"\",VLOOKUP($A48,FB_14,R$5,0))&IF(TYPE(VLOOKUP($A48,FB_15,R$5,0))=16,\"\",VLOOKUP($A48,FB_15,R$5,0))&IF(TYPE(VLOOKUP($A48,FB_16,R$5,0))=16,\"\",VLOOKUP($A48,FB_16,R$5,0))&IF(TYPE(VLOOKUP($A48,FB_17,R$5,0))=16,\"\",VLOOKUP($A48,FB_17,R$5,0))&IF(TYPE(VLOOKUP($A48,FB_18,R$5,0))=16,\"\",VLOOKUP($A48,FB_18,R$5,0))&IF(TYPE(VLOOKUP($A48,FB_19,R$5,0))=16,\"\",VLOOKUP($A48,FB_19,R$5,0))&IF(TYPE(VLOOKUP($A48,FB_20,R$5,0))=16,\"\",VLOOKUP($A48,FB_20,R$5,0))&IF(TYPE(VLOOKUP($A48,FB_21,R$5,0))=16,\"\",VLOOKUP($A48,FB_21,R$5,0))&IF(TYPE(VLOOKUP($A48,FB_22,R$5,0))=16,\"\",VLOOKUP($A48,FB_22,R$5,0))&IF(TYPE(VLOOKUP($A48,FB_23,R$5,0))=16,\"\",VLOOKUP($A48,FB_23,R$5,0))&IF(TYPE(VLOOKUP($A48,FB_24,R$5,0))=16,\"\",VLOOKUP($A48,FB_24,R$5,0))&IF(TYPE(VLOOKUP($A48,FB_25,R$5,0))=16,\"\",VLOOKUP($A48,FB_25,R$5,0))&IF(TYPE(VLOOKUP($A48,FB_26,R$5,0))=16,\"\",VLOOKUP($A48,FB_26,R$5,0))&IF(TYPE(VLOOKUP($A48,FB_27,R$5,0))=16,\"\",VLOOKUP($A48,FB_27,R$5,0))&IF(TYPE(VLOOKUP($A48,FB_28,R$5,0))=16,\"\",VLOOKUP($A48,FB_28,R$5,0))&IF(TYPE(VLOOKUP($A48,FB_29,R$5,0))=16,\"\",VLOOKUP($A48,FB_29,R$5,0))&IF(TYPE(VLOOKUP($A48,FB_30,R$5,0))=16,\"\",VLOOKUP($A48,FB_30,R$5,0))))","v":""},{"$f":"IF($B48=\"\",\"\",IF(TYPE(VLOOKUP($A48,FB_1,S$5,0))=16,\"\",VLOOKUP($A48,FB_1,S$5,0))&IF(TYPE(VLOOKUP($A48,FB_2,S$5,0))=16,\"\",VLOOKUP($A48,FB_2,S$5,0))&IF(TYPE(VLOOKUP($A48,FB_3,S$5,0))=16,\"\",VLOOKUP($A48,FB_3,S$5,0))&IF(TYPE(VLOOKUP($A48,FB_4,S$5,0))=16,\"\",VLOOKUP($A48,FB_4,S$5,0))&IF(TYPE(VLOOKUP($A48,FB_5,S$5,0))=16,\"\",VLOOKUP($A48,FB_5,S$5,0))&IF(TYPE(VLOOKUP($A48,FB_6,S$5,0))=16,\"\",VLOOKUP($A48,FB_6,S$5,0))&IF(TYPE(VLOOKUP($A48,FB_7,S$5,0))=16,\"\",VLOOKUP($A48,FB_7,S$5,0))&IF(TYPE(VLOOKUP($A48,FB_8,S$5,0))=16,\"\",VLOOKUP($A48,FB_8,S$5,0))&IF(TYPE(VLOOKUP($A48,FB_9,S$5,0))=16,\"\",VLOOKUP($A48,FB_9,S$5,0))&IF(TYPE(VLOOKUP($A48,FB_10,S$5,0))=16,\"\",VLOOKUP($A48,FB_10,S$5,0))&IF(TYPE(VLOOKUP($A48,FB_11,S$5,0))=16,\"\",VLOOKUP($A48,FB_11,S$5,0))&IF(TYPE(VLOOKUP($A48,FB_12,S$5,0))=16,\"\",VLOOKUP($A48,FB_12,S$5,0))&IF(TYPE(VLOOKUP($A48,FB_13,S$5,0))=16,\"\",VLOOKUP($A48,FB_13,S$5,0))&IF(TYPE(VLOOKUP($A48,FB_14,S$5,0))=16,\"\",VLOOKUP($A48,FB_14,S$5,0))&IF(TYPE(VLOOKUP($A48,FB_15,S$5,0))=16,\"\",VLOOKUP($A48,FB_15,S$5,0))&IF(TYPE(VLOOKUP($A48,FB_16,S$5,0))=16,\"\",VLOOKUP($A48,FB_16,S$5,0))&IF(TYPE(VLOOKUP($A48,FB_17,S$5,0))=16,\"\",VLOOKUP($A48,FB_17,S$5,0))&IF(TYPE(VLOOKUP($A48,FB_18,S$5,0))=16,\"\",VLOOKUP($A48,FB_18,S$5,0))&IF(TYPE(VLOOKUP($A48,FB_19,S$5,0))=16,\"\",VLOOKUP($A48,FB_19,S$5,0))&IF(TYPE(VLOOKUP($A48,FB_20,S$5,0))=16,\"\",VLOOKUP($A48,FB_20,S$5,0))&IF(TYPE(VLOOKUP($A48,FB_21,S$5,0))=16,\"\",VLOOKUP($A48,FB_21,S$5,0))&IF(TYPE(VLOOKUP($A48,FB_22,S$5,0))=16,\"\",VLOOKUP($A48,FB_22,S$5,0))&IF(TYPE(VLOOKUP($A48,FB_23,S$5,0))=16,\"\",VLOOKUP($A48,FB_23,S$5,0))&IF(TYPE(VLOOKUP($A48,FB_24,S$5,0))=16,\"\",VLOOKUP($A48,FB_24,S$5,0))&IF(TYPE(VLOOKUP($A48,FB_25,S$5,0))=16,\"\",VLOOKUP($A48,FB_25,S$5,0))&IF(TYPE(VLOOKUP($A48,FB_26,S$5,0))=16,\"\",VLOOKUP($A48,FB_26,S$5,0))&IF(TYPE(VLOOKUP($A48,FB_27,S$5,0))=16,\"\",VLOOKUP($A48,FB_27,S$5,0))&IF(TYPE(VLOOKUP($A48,FB_28,S$5,0))=16,\"\",VLOOKUP($A48,FB_28,S$5,0))&IF(TYPE(VLOOKUP($A48,FB_29,S$5,0))=16,\"\",VLOOKUP($A48,FB_29,S$5,0))&IF(TYPE(VLOOKUP($A48,FB_30,S$5,0))=16,\"\",VLOOKUP($A48,FB_30,S$5,0)))","v":""},null,null,null,null,null,null,null,null,null,null,null,null,null,null,null,null,"",":","","",""]
["20.",{"$f":"IF(TYPE(VLOOKUP($A49,FB_1,2,0))=16,\"\",VLOOKUP($A49,FB_1,2,0))&IF(TYPE(VLOOKUP($A49,FB_2,2,0))=16,\"\",VLOOKUP($A49,FB_2,2,0))&IF(TYPE(VLOOKUP($A49,FB_3,2,0))=16,\"\",VLOOKUP($A49,FB_3,2,0))&IF(TYPE(VLOOKUP($A49,FB_4,2,0))=16,\"\",VLOOKUP($A49,FB_4,2,0))&IF(TYPE(VLOOKUP($A49,FB_5,2,0))=16,\"\",VLOOKUP($A49,FB_5,2,0))&IF(TYPE(VLOOKUP($A49,FB_6,2,0))=16,\"\",VLOOKUP($A49,FB_6,2,0))&IF(TYPE(VLOOKUP($A49,FB_7,2,0))=16,\"\",VLOOKUP($A49,FB_7,2,0))&IF(TYPE(VLOOKUP($A49,FB_8,2,0))=16,\"\",VLOOKUP($A49,FB_8,2,0))&IF(TYPE(VLOOKUP($A49,FB_9,2,0))=16,\"\",VLOOKUP($A49,FB_9,2,0))&IF(TYPE(VLOOKUP($A49,FB_10,2,0))=16,\"\",VLOOKUP($A49,FB_10,2,0))&IF(TYPE(VLOOKUP($A49,FB_11,2,0))=16,\"\",VLOOKUP($A49,FB_11,2,0))&IF(TYPE(VLOOKUP($A49,FB_12,2,0))=16,\"\",VLOOKUP($A49,FB_12,2,0))&IF(TYPE(VLOOKUP($A49,FB_13,2,0))=16,\"\",VLOOKUP($A49,FB_13,2,0))&IF(TYPE(VLOOKUP($A49,FB_14,2,0))=16,\"\",VLOOKUP($A49,FB_14,2,0))&IF(TYPE(VLOOKUP($A49,FB_15,2,0))=16,\"\",VLOOKUP($A49,FB_15,2,0))&IF(TYPE(VLOOKUP($A49,FB_16,2,0))=16,\"\",VLOOKUP($A49,FB_16,2,0))&IF(TYPE(VLOOKUP($A49,FB_17,2,0))=16,\"\",VLOOKUP($A49,FB_17,2,0))&IF(TYPE(VLOOKUP($A49,FB_18,2,0))=16,\"\",VLOOKUP($A49,FB_18,2,0))&IF(TYPE(VLOOKUP($A49,FB_19,2,0))=16,\"\",VLOOKUP($A49,FB_19,2,0))&IF(TYPE(VLOOKUP($A49,FB_20,2,0))=16,\"\",VLOOKUP($A49,FB_20,2,0))&IF(TYPE(VLOOKUP($A49,FB_21,2,0))=16,\"\",VLOOKUP($A49,FB_21,2,0))&IF(TYPE(VLOOKUP($A49,FB_22,2,0))=16,\"\",VLOOKUP($A49,FB_22,2,0))&IF(TYPE(VLOOKUP($A49,FB_23,2,0))=16,\"\",VLOOKUP($A49,FB_23,2,0))&IF(TYPE(VLOOKUP($A49,FB_24,2,0))=16,\"\",VLOOKUP($A49,FB_24,2,0))&IF(TYPE(VLOOKUP($A49,FB_25,2,0))=16,\"\",VLOOKUP($A49,FB_25,2,0))&IF(TYPE(VLOOKUP($A49,FB_26,2,0))=16,\"\",VLOOKUP($A49,FB_26,2,0))&IF(TYPE(VLOOKUP($A49,FB_27,2,0))=16,\"\",VLOOKUP($A49,FB_27,2,0))&IF(TYPE(VLOOKUP($A49,FB_28,2,0))=16,\"\",VLOOKUP($A49,FB_28,2,0))&IF(TYPE(VLOOKUP($A49,FB_29,2,0))=16,\"\",VLOOKUP($A49,FB_29,2,0))&IF(TYPE(VLOOKUP($A49,FB_30,2,0))=16,\"\",VLOOKUP($A49,FB_30,2,0))","v":""},null,{"$f":"IF($B49=\"\",\"\",_xlfn.NUMBERVALUE(IF(TYPE(VLOOKUP($A49,FB_1,P$5,0))=16,\"\",VLOOKUP($A49,FB_1,P$5,0))&IF(TYPE(VLOOKUP($A49,FB_2,P$5,0))=16,\"\",VLOOKUP($A49,FB_2,P$5,0))&IF(TYPE(VLOOKUP($A49,FB_3,P$5,0))=16,\"\",VLOOKUP($A49,FB_3,P$5,0))&IF(TYPE(VLOOKUP($A49,FB_4,P$5,0))=16,\"\",VLOOKUP($A49,FB_4,P$5,0))&IF(TYPE(VLOOKUP($A49,FB_5,P$5,0))=16,\"\",VLOOKUP($A49,FB_5,P$5,0))&IF(TYPE(VLOOKUP($A49,FB_6,P$5,0))=16,\"\",VLOOKUP($A49,FB_6,P$5,0))&IF(TYPE(VLOOKUP($A49,FB_7,P$5,0))=16,\"\",VLOOKUP($A49,FB_7,P$5,0))&IF(TYPE(VLOOKUP($A49,FB_8,P$5,0))=16,\"\",VLOOKUP($A49,FB_8,P$5,0))&IF(TYPE(VLOOKUP($A49,FB_9,P$5,0))=16,\"\",VLOOKUP($A49,FB_9,P$5,0))&IF(TYPE(VLOOKUP($A49,FB_10,P$5,0))=16,\"\",VLOOKUP($A49,FB_10,P$5,0))&IF(TYPE(VLOOKUP($A49,FB_11,P$5,0))=16,\"\",VLOOKUP($A49,FB_11,P$5,0))&IF(TYPE(VLOOKUP($A49,FB_12,P$5,0))=16,\"\",VLOOKUP($A49,FB_12,P$5,0))&IF(TYPE(VLOOKUP($A49,FB_13,P$5,0))=16,\"\",VLOOKUP($A49,FB_13,P$5,0))&IF(TYPE(VLOOKUP($A49,FB_14,P$5,0))=16,\"\",VLOOKUP($A49,FB_14,P$5,0))&IF(TYPE(VLOOKUP($A49,FB_15,P$5,0))=16,\"\",VLOOKUP($A49,FB_15,P$5,0))&IF(TYPE(VLOOKUP($A49,FB_16,P$5,0))=16,\"\",VLOOKUP($A49,FB_16,P$5,0))&IF(TYPE(VLOOKUP($A49,FB_17,P$5,0))=16,\"\",VLOOKUP($A49,FB_17,P$5,0))&IF(TYPE(VLOOKUP($A49,FB_18,P$5,0))=16,\"\",VLOOKUP($A49,FB_18,P$5,0))&IF(TYPE(VLOOKUP($A49,FB_19,P$5,0))=16,\"\",VLOOKUP($A49,FB_19,P$5,0))&IF(TYPE(VLOOKUP($A49,FB_20,P$5,0))=16,\"\",VLOOKUP($A49,FB_20,P$5,0))&IF(TYPE(VLOOKUP($A49,FB_21,P$5,0))=16,\"\",VLOOKUP($A49,FB_21,P$5,0))&IF(TYPE(VLOOKUP($A49,FB_22,P$5,0))=16,\"\",VLOOKUP($A49,FB_22,P$5,0))&IF(TYPE(VLOOKUP($A49,FB_23,P$5,0))=16,\"\",VLOOKUP($A49,FB_23,P$5,0))&IF(TYPE(VLOOKUP($A49,FB_24,P$5,0))=16,\"\",VLOOKUP($A49,FB_24,P$5,0))&IF(TYPE(VLOOKUP($A49,FB_25,P$5,0))=16,\"\",VLOOKUP($A49,FB_25,P$5,0))&IF(TYPE(VLOOKUP($A49,FB_26,P$5,0))=16,\"\",VLOOKUP($A49,FB_26,P$5,0))&IF(TYPE(VLOOKUP($A49,FB_27,P$5,0))=16,\"\",VLOOKUP($A49,FB_27,P$5,0))&IF(TYPE(VLOOKUP($A49,FB_28,P$5,0))=16,\"\",VLOOKUP($A49,FB_28,P$5,0))&IF(TYPE(VLOOKUP($A49,FB_29,P$5,0))=16,\"\",VLOOKUP($A49,FB_29,P$5,0))&IF(TYPE(VLOOKUP($A49,FB_30,P$5,0))=16,\"\",VLOOKUP($A49,FB_30,P$5,0))))","v":""},"",{"$f":"IF($B49=\"\",\"\",_xlfn.NUMBERVALUE(IF(TYPE(VLOOKUP($A49,FB_1,R$5,0))=16,\"\",VLOOKUP($A49,FB_1,R$5,0))&IF(TYPE(VLOOKUP($A49,FB_2,R$5,0))=16,\"\",VLOOKUP($A49,FB_2,R$5,0))&IF(TYPE(VLOOKUP($A49,FB_3,R$5,0))=16,\"\",VLOOKUP($A49,FB_3,R$5,0))&IF(TYPE(VLOOKUP($A49,FB_4,R$5,0))=16,\"\",VLOOKUP($A49,FB_4,R$5,0))&IF(TYPE(VLOOKUP($A49,FB_5,R$5,0))=16,\"\",VLOOKUP($A49,FB_5,R$5,0))&IF(TYPE(VLOOKUP($A49,FB_6,R$5,0))=16,\"\",VLOOKUP($A49,FB_6,R$5,0))&IF(TYPE(VLOOKUP($A49,FB_7,R$5,0))=16,\"\",VLOOKUP($A49,FB_7,R$5,0))&IF(TYPE(VLOOKUP($A49,FB_8,R$5,0))=16,\"\",VLOOKUP($A49,FB_8,R$5,0))&IF(TYPE(VLOOKUP($A49,FB_9,R$5,0))=16,\"\",VLOOKUP($A49,FB_9,R$5,0))&IF(TYPE(VLOOKUP($A49,FB_10,R$5,0))=16,\"\",VLOOKUP($A49,FB_10,R$5,0))&IF(TYPE(VLOOKUP($A49,FB_11,R$5,0))=16,\"\",VLOOKUP($A49,FB_11,R$5,0))&IF(TYPE(VLOOKUP($A49,FB_12,R$5,0))=16,\"\",VLOOKUP($A49,FB_12,R$5,0))&IF(TYPE(VLOOKUP($A49,FB_13,R$5,0))=16,\"\",VLOOKUP($A49,FB_13,R$5,0))&IF(TYPE(VLOOKUP($A49,FB_14,R$5,0))=16,\"\",VLOOKUP($A49,FB_14,R$5,0))&IF(TYPE(VLOOKUP($A49,FB_15,R$5,0))=16,\"\",VLOOKUP($A49,FB_15,R$5,0))&IF(TYPE(VLOOKUP($A49,FB_16,R$5,0))=16,\"\",VLOOKUP($A49,FB_16,R$5,0))&IF(TYPE(VLOOKUP($A49,FB_17,R$5,0))=16,\"\",VLOOKUP($A49,FB_17,R$5,0))&IF(TYPE(VLOOKUP($A49,FB_18,R$5,0))=16,\"\",VLOOKUP($A49,FB_18,R$5,0))&IF(TYPE(VLOOKUP($A49,FB_19,R$5,0))=16,\"\",VLOOKUP($A49,FB_19,R$5,0))&IF(TYPE(VLOOKUP($A49,FB_20,R$5,0))=16,\"\",VLOOKUP($A49,FB_20,R$5,0))&IF(TYPE(VLOOKUP($A49,FB_21,R$5,0))=16,\"\",VLOOKUP($A49,FB_21,R$5,0))&IF(TYPE(VLOOKUP($A49,FB_22,R$5,0))=16,\"\",VLOOKUP($A49,FB_22,R$5,0))&IF(TYPE(VLOOKUP($A49,FB_23,R$5,0))=16,\"\",VLOOKUP($A49,FB_23,R$5,0))&IF(TYPE(VLOOKUP($A49,FB_24,R$5,0))=16,\"\",VLOOKUP($A49,FB_24,R$5,0))&IF(TYPE(VLOOKUP($A49,FB_25,R$5,0))=16,\"\",VLOOKUP($A49,FB_25,R$5,0))&IF(TYPE(VLOOKUP($A49,FB_26,R$5,0))=16,\"\",VLOOKUP($A49,FB_26,R$5,0))&IF(TYPE(VLOOKUP($A49,FB_27,R$5,0))=16,\"\",VLOOKUP($A49,FB_27,R$5,0))&IF(TYPE(VLOOKUP($A49,FB_28,R$5,0))=16,\"\",VLOOKUP($A49,FB_28,R$5,0))&IF(TYPE(VLOOKUP($A49,FB_29,R$5,0))=16,\"\",VLOOKUP($A49,FB_29,R$5,0))&IF(TYPE(VLOOKUP($A49,FB_30,R$5,0))=16,\"\",VLOOKUP($A49,FB_30,R$5,0))))","v":""},{"$f":"IF($B49=\"\",\"\",IF(TYPE(VLOOKUP($A49,FB_1,S$5,0))=16,\"\",VLOOKUP($A49,FB_1,S$5,0))&IF(TYPE(VLOOKUP($A49,FB_2,S$5,0))=16,\"\",VLOOKUP($A49,FB_2,S$5,0))&IF(TYPE(VLOOKUP($A49,FB_3,S$5,0))=16,\"\",VLOOKUP($A49,FB_3,S$5,0))&IF(TYPE(VLOOKUP($A49,FB_4,S$5,0))=16,\"\",VLOOKUP($A49,FB_4,S$5,0))&IF(TYPE(VLOOKUP($A49,FB_5,S$5,0))=16,\"\",VLOOKUP($A49,FB_5,S$5,0))&IF(TYPE(VLOOKUP($A49,FB_6,S$5,0))=16,\"\",VLOOKUP($A49,FB_6,S$5,0))&IF(TYPE(VLOOKUP($A49,FB_7,S$5,0))=16,\"\",VLOOKUP($A49,FB_7,S$5,0))&IF(TYPE(VLOOKUP($A49,FB_8,S$5,0))=16,\"\",VLOOKUP($A49,FB_8,S$5,0))&IF(TYPE(VLOOKUP($A49,FB_9,S$5,0))=16,\"\",VLOOKUP($A49,FB_9,S$5,0))&IF(TYPE(VLOOKUP($A49,FB_10,S$5,0))=16,\"\",VLOOKUP($A49,FB_10,S$5,0))&IF(TYPE(VLOOKUP($A49,FB_11,S$5,0))=16,\"\",VLOOKUP($A49,FB_11,S$5,0))&IF(TYPE(VLOOKUP($A49,FB_12,S$5,0))=16,\"\",VLOOKUP($A49,FB_12,S$5,0))&IF(TYPE(VLOOKUP($A49,FB_13,S$5,0))=16,\"\",VLOOKUP($A49,FB_13,S$5,0))&IF(TYPE(VLOOKUP($A49,FB_14,S$5,0))=16,\"\",VLOOKUP($A49,FB_14,S$5,0))&IF(TYPE(VLOOKUP($A49,FB_15,S$5,0))=16,\"\",VLOOKUP($A49,FB_15,S$5,0))&IF(TYPE(VLOOKUP($A49,FB_16,S$5,0))=16,\"\",VLOOKUP($A49,FB_16,S$5,0))&IF(TYPE(VLOOKUP($A49,FB_17,S$5,0))=16,\"\",VLOOKUP($A49,FB_17,S$5,0))&IF(TYPE(VLOOKUP($A49,FB_18,S$5,0))=16,\"\",VLOOKUP($A49,FB_18,S$5,0))&IF(TYPE(VLOOKUP($A49,FB_19,S$5,0))=16,\"\",VLOOKUP($A49,FB_19,S$5,0))&IF(TYPE(VLOOKUP($A49,FB_20,S$5,0))=16,\"\",VLOOKUP($A49,FB_20,S$5,0))&IF(TYPE(VLOOKUP($A49,FB_21,S$5,0))=16,\"\",VLOOKUP($A49,FB_21,S$5,0))&IF(TYPE(VLOOKUP($A49,FB_22,S$5,0))=16,\"\",VLOOKUP($A49,FB_22,S$5,0))&IF(TYPE(VLOOKUP($A49,FB_23,S$5,0))=16,\"\",VLOOKUP($A49,FB_23,S$5,0))&IF(TYPE(VLOOKUP($A49,FB_24,S$5,0))=16,\"\",VLOOKUP($A49,FB_24,S$5,0))&IF(TYPE(VLOOKUP($A49,FB_25,S$5,0))=16,\"\",VLOOKUP($A49,FB_25,S$5,0))&IF(TYPE(VLOOKUP($A49,FB_26,S$5,0))=16,\"\",VLOOKUP($A49,FB_26,S$5,0))&IF(TYPE(VLOOKUP($A49,FB_27,S$5,0))=16,\"\",VLOOKUP($A49,FB_27,S$5,0))&IF(TYPE(VLOOKUP($A49,FB_28,S$5,0))=16,\"\",VLOOKUP($A49,FB_28,S$5,0))&IF(TYPE(VLOOKUP($A49,FB_29,S$5,0))=16,\"\",VLOOKUP($A49,FB_29,S$5,0))&IF(TYPE(VLOOKUP($A49,FB_30,S$5,0))=16,\"\",VLOOKUP($A49,FB_30,S$5,0)))","v":""},null,null,null,null,null,null,null,null,null,null,null,null,null,null,null,null,"",":","","",""]
["21.",{"$f":"IF(TYPE(VLOOKUP($A50,FB_1,2,0))=16,\"\",VLOOKUP($A50,FB_1,2,0))&IF(TYPE(VLOOKUP($A50,FB_2,2,0))=16,\"\",VLOOKUP($A50,FB_2,2,0))&IF(TYPE(VLOOKUP($A50,FB_3,2,0))=16,\"\",VLOOKUP($A50,FB_3,2,0))&IF(TYPE(VLOOKUP($A50,FB_4,2,0))=16,\"\",VLOOKUP($A50,FB_4,2,0))&IF(TYPE(VLOOKUP($A50,FB_5,2,0))=16,\"\",VLOOKUP($A50,FB_5,2,0))&IF(TYPE(VLOOKUP($A50,FB_6,2,0))=16,\"\",VLOOKUP($A50,FB_6,2,0))&IF(TYPE(VLOOKUP($A50,FB_7,2,0))=16,\"\",VLOOKUP($A50,FB_7,2,0))&IF(TYPE(VLOOKUP($A50,FB_8,2,0))=16,\"\",VLOOKUP($A50,FB_8,2,0))&IF(TYPE(VLOOKUP($A50,FB_9,2,0))=16,\"\",VLOOKUP($A50,FB_9,2,0))&IF(TYPE(VLOOKUP($A50,FB_10,2,0))=16,\"\",VLOOKUP($A50,FB_10,2,0))&IF(TYPE(VLOOKUP($A50,FB_11,2,0))=16,\"\",VLOOKUP($A50,FB_11,2,0))&IF(TYPE(VLOOKUP($A50,FB_12,2,0))=16,\"\",VLOOKUP($A50,FB_12,2,0))&IF(TYPE(VLOOKUP($A50,FB_13,2,0))=16,\"\",VLOOKUP($A50,FB_13,2,0))&IF(TYPE(VLOOKUP($A50,FB_14,2,0))=16,\"\",VLOOKUP($A50,FB_14,2,0))&IF(TYPE(VLOOKUP($A50,FB_15,2,0))=16,\"\",VLOOKUP($A50,FB_15,2,0))&IF(TYPE(VLOOKUP($A50,FB_16,2,0))=16,\"\",VLOOKUP($A50,FB_16,2,0))&IF(TYPE(VLOOKUP($A50,FB_17,2,0))=16,\"\",VLOOKUP($A50,FB_17,2,0))&IF(TYPE(VLOOKUP($A50,FB_18,2,0))=16,\"\",VLOOKUP($A50,FB_18,2,0))&IF(TYPE(VLOOKUP($A50,FB_19,2,0))=16,\"\",VLOOKUP($A50,FB_19,2,0))&IF(TYPE(VLOOKUP($A50,FB_20,2,0))=16,\"\",VLOOKUP($A50,FB_20,2,0))&IF(TYPE(VLOOKUP($A50,FB_21,2,0))=16,\"\",VLOOKUP($A50,FB_21,2,0))&IF(TYPE(VLOOKUP($A50,FB_22,2,0))=16,\"\",VLOOKUP($A50,FB_22,2,0))&IF(TYPE(VLOOKUP($A50,FB_23,2,0))=16,\"\",VLOOKUP($A50,FB_23,2,0))&IF(TYPE(VLOOKUP($A50,FB_24,2,0))=16,\"\",VLOOKUP($A50,FB_24,2,0))&IF(TYPE(VLOOKUP($A50,FB_25,2,0))=16,\"\",VLOOKUP($A50,FB_25,2,0))&IF(TYPE(VLOOKUP($A50,FB_26,2,0))=16,\"\",VLOOKUP($A50,FB_26,2,0))&IF(TYPE(VLOOKUP($A50,FB_27,2,0))=16,\"\",VLOOKUP($A50,FB_27,2,0))&IF(TYPE(VLOOKUP($A50,FB_28,2,0))=16,\"\",VLOOKUP($A50,FB_28,2,0))&IF(TYPE(VLOOKUP($A50,FB_29,2,0))=16,\"\",VLOOKUP($A50,FB_29,2,0))&IF(TYPE(VLOOKUP($A50,FB_30,2,0))=16,\"\",VLOOKUP($A50,FB_30,2,0))","v":""},null,{"$f":"IF($B50=\"\",\"\",_xlfn.NUMBERVALUE(IF(TYPE(VLOOKUP($A50,FB_1,P$5,0))=16,\"\",VLOOKUP($A50,FB_1,P$5,0))&IF(TYPE(VLOOKUP($A50,FB_2,P$5,0))=16,\"\",VLOOKUP($A50,FB_2,P$5,0))&IF(TYPE(VLOOKUP($A50,FB_3,P$5,0))=16,\"\",VLOOKUP($A50,FB_3,P$5,0))&IF(TYPE(VLOOKUP($A50,FB_4,P$5,0))=16,\"\",VLOOKUP($A50,FB_4,P$5,0))&IF(TYPE(VLOOKUP($A50,FB_5,P$5,0))=16,\"\",VLOOKUP($A50,FB_5,P$5,0))&IF(TYPE(VLOOKUP($A50,FB_6,P$5,0))=16,\"\",VLOOKUP($A50,FB_6,P$5,0))&IF(TYPE(VLOOKUP($A50,FB_7,P$5,0))=16,\"\",VLOOKUP($A50,FB_7,P$5,0))&IF(TYPE(VLOOKUP($A50,FB_8,P$5,0))=16,\"\",VLOOKUP($A50,FB_8,P$5,0))&IF(TYPE(VLOOKUP($A50,FB_9,P$5,0))=16,\"\",VLOOKUP($A50,FB_9,P$5,0))&IF(TYPE(VLOOKUP($A50,FB_10,P$5,0))=16,\"\",VLOOKUP($A50,FB_10,P$5,0))&IF(TYPE(VLOOKUP($A50,FB_11,P$5,0))=16,\"\",VLOOKUP($A50,FB_11,P$5,0))&IF(TYPE(VLOOKUP($A50,FB_12,P$5,0))=16,\"\",VLOOKUP($A50,FB_12,P$5,0))&IF(TYPE(VLOOKUP($A50,FB_13,P$5,0))=16,\"\",VLOOKUP($A50,FB_13,P$5,0))&IF(TYPE(VLOOKUP($A50,FB_14,P$5,0))=16,\"\",VLOOKUP($A50,FB_14,P$5,0))&IF(TYPE(VLOOKUP($A50,FB_15,P$5,0))=16,\"\",VLOOKUP($A50,FB_15,P$5,0))&IF(TYPE(VLOOKUP($A50,FB_16,P$5,0))=16,\"\",VLOOKUP($A50,FB_16,P$5,0))&IF(TYPE(VLOOKUP($A50,FB_17,P$5,0))=16,\"\",VLOOKUP($A50,FB_17,P$5,0))&IF(TYPE(VLOOKUP($A50,FB_18,P$5,0))=16,\"\",VLOOKUP($A50,FB_18,P$5,0))&IF(TYPE(VLOOKUP($A50,FB_19,P$5,0))=16,\"\",VLOOKUP($A50,FB_19,P$5,0))&IF(TYPE(VLOOKUP($A50,FB_20,P$5,0))=16,\"\",VLOOKUP($A50,FB_20,P$5,0))&IF(TYPE(VLOOKUP($A50,FB_21,P$5,0))=16,\"\",VLOOKUP($A50,FB_21,P$5,0))&IF(TYPE(VLOOKUP($A50,FB_22,P$5,0))=16,\"\",VLOOKUP($A50,FB_22,P$5,0))&IF(TYPE(VLOOKUP($A50,FB_23,P$5,0))=16,\"\",VLOOKUP($A50,FB_23,P$5,0))&IF(TYPE(VLOOKUP($A50,FB_24,P$5,0))=16,\"\",VLOOKUP($A50,FB_24,P$5,0))&IF(TYPE(VLOOKUP($A50,FB_25,P$5,0))=16,\"\",VLOOKUP($A50,FB_25,P$5,0))&IF(TYPE(VLOOKUP($A50,FB_26,P$5,0))=16,\"\",VLOOKUP($A50,FB_26,P$5,0))&IF(TYPE(VLOOKUP($A50,FB_27,P$5,0))=16,\"\",VLOOKUP($A50,FB_27,P$5,0))&IF(TYPE(VLOOKUP($A50,FB_28,P$5,0))=16,\"\",VLOOKUP($A50,FB_28,P$5,0))&IF(TYPE(VLOOKUP($A50,FB_29,P$5,0))=16,\"\",VLOOKUP($A50,FB_29,P$5,0))&IF(TYPE(VLOOKUP($A50,FB_30,P$5,0))=16,\"\",VLOOKUP($A50,FB_30,P$5,0))))","v":""},"",{"$f":"IF($B50=\"\",\"\",_xlfn.NUMBERVALUE(IF(TYPE(VLOOKUP($A50,FB_1,R$5,0))=16,\"\",VLOOKUP($A50,FB_1,R$5,0))&IF(TYPE(VLOOKUP($A50,FB_2,R$5,0))=16,\"\",VLOOKUP($A50,FB_2,R$5,0))&IF(TYPE(VLOOKUP($A50,FB_3,R$5,0))=16,\"\",VLOOKUP($A50,FB_3,R$5,0))&IF(TYPE(VLOOKUP($A50,FB_4,R$5,0))=16,\"\",VLOOKUP($A50,FB_4,R$5,0))&IF(TYPE(VLOOKUP($A50,FB_5,R$5,0))=16,\"\",VLOOKUP($A50,FB_5,R$5,0))&IF(TYPE(VLOOKUP($A50,FB_6,R$5,0))=16,\"\",VLOOKUP($A50,FB_6,R$5,0))&IF(TYPE(VLOOKUP($A50,FB_7,R$5,0))=16,\"\",VLOOKUP($A50,FB_7,R$5,0))&IF(TYPE(VLOOKUP($A50,FB_8,R$5,0))=16,\"\",VLOOKUP($A50,FB_8,R$5,0))&IF(TYPE(VLOOKUP($A50,FB_9,R$5,0))=16,\"\",VLOOKUP($A50,FB_9,R$5,0))&IF(TYPE(VLOOKUP($A50,FB_10,R$5,0))=16,\"\",VLOOKUP($A50,FB_10,R$5,0))&IF(TYPE(VLOOKUP($A50,FB_11,R$5,0))=16,\"\",VLOOKUP($A50,FB_11,R$5,0))&IF(TYPE(VLOOKUP($A50,FB_12,R$5,0))=16,\"\",VLOOKUP($A50,FB_12,R$5,0))&IF(TYPE(VLOOKUP($A50,FB_13,R$5,0))=16,\"\",VLOOKUP($A50,FB_13,R$5,0))&IF(TYPE(VLOOKUP($A50,FB_14,R$5,0))=16,\"\",VLOOKUP($A50,FB_14,R$5,0))&IF(TYPE(VLOOKUP($A50,FB_15,R$5,0))=16,\"\",VLOOKUP($A50,FB_15,R$5,0))&IF(TYPE(VLOOKUP($A50,FB_16,R$5,0))=16,\"\",VLOOKUP($A50,FB_16,R$5,0))&IF(TYPE(VLOOKUP($A50,FB_17,R$5,0))=16,\"\",VLOOKUP($A50,FB_17,R$5,0))&IF(TYPE(VLOOKUP($A50,FB_18,R$5,0))=16,\"\",VLOOKUP($A50,FB_18,R$5,0))&IF(TYPE(VLOOKUP($A50,FB_19,R$5,0))=16,\"\",VLOOKUP($A50,FB_19,R$5,0))&IF(TYPE(VLOOKUP($A50,FB_20,R$5,0))=16,\"\",VLOOKUP($A50,FB_20,R$5,0))&IF(TYPE(VLOOKUP($A50,FB_21,R$5,0))=16,\"\",VLOOKUP($A50,FB_21,R$5,0))&IF(TYPE(VLOOKUP($A50,FB_22,R$5,0))=16,\"\",VLOOKUP($A50,FB_22,R$5,0))&IF(TYPE(VLOOKUP($A50,FB_23,R$5,0))=16,\"\",VLOOKUP($A50,FB_23,R$5,0))&IF(TYPE(VLOOKUP($A50,FB_24,R$5,0))=16,\"\",VLOOKUP($A50,FB_24,R$5,0))&IF(TYPE(VLOOKUP($A50,FB_25,R$5,0))=16,\"\",VLOOKUP($A50,FB_25,R$5,0))&IF(TYPE(VLOOKUP($A50,FB_26,R$5,0))=16,\"\",VLOOKUP($A50,FB_26,R$5,0))&IF(TYPE(VLOOKUP($A50,FB_27,R$5,0))=16,\"\",VLOOKUP($A50,FB_27,R$5,0))&IF(TYPE(VLOOKUP($A50,FB_28,R$5,0))=16,\"\",VLOOKUP($A50,FB_28,R$5,0))&IF(TYPE(VLOOKUP($A50,FB_29,R$5,0))=16,\"\",VLOOKUP($A50,FB_29,R$5,0))&IF(TYPE(VLOOKUP($A50,FB_30,R$5,0))=16,\"\",VLOOKUP($A50,FB_30,R$5,0))))","v":""},{"$f":"IF($B50=\"\",\"\",IF(TYPE(VLOOKUP($A50,FB_1,S$5,0))=16,\"\",VLOOKUP($A50,FB_1,S$5,0))&IF(TYPE(VLOOKUP($A50,FB_2,S$5,0))=16,\"\",VLOOKUP($A50,FB_2,S$5,0))&IF(TYPE(VLOOKUP($A50,FB_3,S$5,0))=16,\"\",VLOOKUP($A50,FB_3,S$5,0))&IF(TYPE(VLOOKUP($A50,FB_4,S$5,0))=16,\"\",VLOOKUP($A50,FB_4,S$5,0))&IF(TYPE(VLOOKUP($A50,FB_5,S$5,0))=16,\"\",VLOOKUP($A50,FB_5,S$5,0))&IF(TYPE(VLOOKUP($A50,FB_6,S$5,0))=16,\"\",VLOOKUP($A50,FB_6,S$5,0))&IF(TYPE(VLOOKUP($A50,FB_7,S$5,0))=16,\"\",VLOOKUP($A50,FB_7,S$5,0))&IF(TYPE(VLOOKUP($A50,FB_8,S$5,0))=16,\"\",VLOOKUP($A50,FB_8,S$5,0))&IF(TYPE(VLOOKUP($A50,FB_9,S$5,0))=16,\"\",VLOOKUP($A50,FB_9,S$5,0))&IF(TYPE(VLOOKUP($A50,FB_10,S$5,0))=16,\"\",VLOOKUP($A50,FB_10,S$5,0))&IF(TYPE(VLOOKUP($A50,FB_11,S$5,0))=16,\"\",VLOOKUP($A50,FB_11,S$5,0))&IF(TYPE(VLOOKUP($A50,FB_12,S$5,0))=16,\"\",VLOOKUP($A50,FB_12,S$5,0))&IF(TYPE(VLOOKUP($A50,FB_13,S$5,0))=16,\"\",VLOOKUP($A50,FB_13,S$5,0))&IF(TYPE(VLOOKUP($A50,FB_14,S$5,0))=16,\"\",VLOOKUP($A50,FB_14,S$5,0))&IF(TYPE(VLOOKUP($A50,FB_15,S$5,0))=16,\"\",VLOOKUP($A50,FB_15,S$5,0))&IF(TYPE(VLOOKUP($A50,FB_16,S$5,0))=16,\"\",VLOOKUP($A50,FB_16,S$5,0))&IF(TYPE(VLOOKUP($A50,FB_17,S$5,0))=16,\"\",VLOOKUP($A50,FB_17,S$5,0))&IF(TYPE(VLOOKUP($A50,FB_18,S$5,0))=16,\"\",VLOOKUP($A50,FB_18,S$5,0))&IF(TYPE(VLOOKUP($A50,FB_19,S$5,0))=16,\"\",VLOOKUP($A50,FB_19,S$5,0))&IF(TYPE(VLOOKUP($A50,FB_20,S$5,0))=16,\"\",VLOOKUP($A50,FB_20,S$5,0))&IF(TYPE(VLOOKUP($A50,FB_21,S$5,0))=16,\"\",VLOOKUP($A50,FB_21,S$5,0))&IF(TYPE(VLOOKUP($A50,FB_22,S$5,0))=16,\"\",VLOOKUP($A50,FB_22,S$5,0))&IF(TYPE(VLOOKUP($A50,FB_23,S$5,0))=16,\"\",VLOOKUP($A50,FB_23,S$5,0))&IF(TYPE(VLOOKUP($A50,FB_24,S$5,0))=16,\"\",VLOOKUP($A50,FB_24,S$5,0))&IF(TYPE(VLOOKUP($A50,FB_25,S$5,0))=16,\"\",VLOOKUP($A50,FB_25,S$5,0))&IF(TYPE(VLOOKUP($A50,FB_26,S$5,0))=16,\"\",VLOOKUP($A50,FB_26,S$5,0))&IF(TYPE(VLOOKUP($A50,FB_27,S$5,0))=16,\"\",VLOOKUP($A50,FB_27,S$5,0))&IF(TYPE(VLOOKUP($A50,FB_28,S$5,0))=16,\"\",VLOOKUP($A50,FB_28,S$5,0))&IF(TYPE(VLOOKUP($A50,FB_29,S$5,0))=16,\"\",VLOOKUP($A50,FB_29,S$5,0))&IF(TYPE(VLOOKUP($A50,FB_30,S$5,0))=16,\"\",VLOOKUP($A50,FB_30,S$5,0)))","v":""},null,null,null,null,null,null,null,null,null,null,null,null,null,null,null,null,"",":","","",""]
["22.",{"$f":"IF(TYPE(VLOOKUP($A51,FB_1,2,0))=16,\"\",VLOOKUP($A51,FB_1,2,0))&IF(TYPE(VLOOKUP($A51,FB_2,2,0))=16,\"\",VLOOKUP($A51,FB_2,2,0))&IF(TYPE(VLOOKUP($A51,FB_3,2,0))=16,\"\",VLOOKUP($A51,FB_3,2,0))&IF(TYPE(VLOOKUP($A51,FB_4,2,0))=16,\"\",VLOOKUP($A51,FB_4,2,0))&IF(TYPE(VLOOKUP($A51,FB_5,2,0))=16,\"\",VLOOKUP($A51,FB_5,2,0))&IF(TYPE(VLOOKUP($A51,FB_6,2,0))=16,\"\",VLOOKUP($A51,FB_6,2,0))&IF(TYPE(VLOOKUP($A51,FB_7,2,0))=16,\"\",VLOOKUP($A51,FB_7,2,0))&IF(TYPE(VLOOKUP($A51,FB_8,2,0))=16,\"\",VLOOKUP($A51,FB_8,2,0))&IF(TYPE(VLOOKUP($A51,FB_9,2,0))=16,\"\",VLOOKUP($A51,FB_9,2,0))&IF(TYPE(VLOOKUP($A51,FB_10,2,0))=16,\"\",VLOOKUP($A51,FB_10,2,0))&IF(TYPE(VLOOKUP($A51,FB_11,2,0))=16,\"\",VLOOKUP($A51,FB_11,2,0))&IF(TYPE(VLOOKUP($A51,FB_12,2,0))=16,\"\",VLOOKUP($A51,FB_12,2,0))&IF(TYPE(VLOOKUP($A51,FB_13,2,0))=16,\"\",VLOOKUP($A51,FB_13,2,0))&IF(TYPE(VLOOKUP($A51,FB_14,2,0))=16,\"\",VLOOKUP($A51,FB_14,2,0))&IF(TYPE(VLOOKUP($A51,FB_15,2,0))=16,\"\",VLOOKUP($A51,FB_15,2,0))&IF(TYPE(VLOOKUP($A51,FB_16,2,0))=16,\"\",VLOOKUP($A51,FB_16,2,0))&IF(TYPE(VLOOKUP($A51,FB_17,2,0))=16,\"\",VLOOKUP($A51,FB_17,2,0))&IF(TYPE(VLOOKUP($A51,FB_18,2,0))=16,\"\",VLOOKUP($A51,FB_18,2,0))&IF(TYPE(VLOOKUP($A51,FB_19,2,0))=16,\"\",VLOOKUP($A51,FB_19,2,0))&IF(TYPE(VLOOKUP($A51,FB_20,2,0))=16,\"\",VLOOKUP($A51,FB_20,2,0))&IF(TYPE(VLOOKUP($A51,FB_21,2,0))=16,\"\",VLOOKUP($A51,FB_21,2,0))&IF(TYPE(VLOOKUP($A51,FB_22,2,0))=16,\"\",VLOOKUP($A51,FB_22,2,0))&IF(TYPE(VLOOKUP($A51,FB_23,2,0))=16,\"\",VLOOKUP($A51,FB_23,2,0))&IF(TYPE(VLOOKUP($A51,FB_24,2,0))=16,\"\",VLOOKUP($A51,FB_24,2,0))&IF(TYPE(VLOOKUP($A51,FB_25,2,0))=16,\"\",VLOOKUP($A51,FB_25,2,0))&IF(TYPE(VLOOKUP($A51,FB_26,2,0))=16,\"\",VLOOKUP($A51,FB_26,2,0))&IF(TYPE(VLOOKUP($A51,FB_27,2,0))=16,\"\",VLOOKUP($A51,FB_27,2,0))&IF(TYPE(VLOOKUP($A51,FB_28,2,0))=16,\"\",VLOOKUP($A51,FB_28,2,0))&IF(TYPE(VLOOKUP($A51,FB_29,2,0))=16,\"\",VLOOKUP($A51,FB_29,2,0))&IF(TYPE(VLOOKUP($A51,FB_30,2,0))=16,\"\",VLOOKUP($A51,FB_30,2,0))","v":""},null,{"$f":"IF($B51=\"\",\"\",_xlfn.NUMBERVALUE(IF(TYPE(VLOOKUP($A51,FB_1,P$5,0))=16,\"\",VLOOKUP($A51,FB_1,P$5,0))&IF(TYPE(VLOOKUP($A51,FB_2,P$5,0))=16,\"\",VLOOKUP($A51,FB_2,P$5,0))&IF(TYPE(VLOOKUP($A51,FB_3,P$5,0))=16,\"\",VLOOKUP($A51,FB_3,P$5,0))&IF(TYPE(VLOOKUP($A51,FB_4,P$5,0))=16,\"\",VLOOKUP($A51,FB_4,P$5,0))&IF(TYPE(VLOOKUP($A51,FB_5,P$5,0))=16,\"\",VLOOKUP($A51,FB_5,P$5,0))&IF(TYPE(VLOOKUP($A51,FB_6,P$5,0))=16,\"\",VLOOKUP($A51,FB_6,P$5,0))&IF(TYPE(VLOOKUP($A51,FB_7,P$5,0))=16,\"\",VLOOKUP($A51,FB_7,P$5,0))&IF(TYPE(VLOOKUP($A51,FB_8,P$5,0))=16,\"\",VLOOKUP($A51,FB_8,P$5,0))&IF(TYPE(VLOOKUP($A51,FB_9,P$5,0))=16,\"\",VLOOKUP($A51,FB_9,P$5,0))&IF(TYPE(VLOOKUP($A51,FB_10,P$5,0))=16,\"\",VLOOKUP($A51,FB_10,P$5,0))&IF(TYPE(VLOOKUP($A51,FB_11,P$5,0))=16,\"\",VLOOKUP($A51,FB_11,P$5,0))&IF(TYPE(VLOOKUP($A51,FB_12,P$5,0))=16,\"\",VLOOKUP($A51,FB_12,P$5,0))&IF(TYPE(VLOOKUP($A51,FB_13,P$5,0))=16,\"\",VLOOKUP($A51,FB_13,P$5,0))&IF(TYPE(VLOOKUP($A51,FB_14,P$5,0))=16,\"\",VLOOKUP($A51,FB_14,P$5,0))&IF(TYPE(VLOOKUP($A51,FB_15,P$5,0))=16,\"\",VLOOKUP($A51,FB_15,P$5,0))&IF(TYPE(VLOOKUP($A51,FB_16,P$5,0))=16,\"\",VLOOKUP($A51,FB_16,P$5,0))&IF(TYPE(VLOOKUP($A51,FB_17,P$5,0))=16,\"\",VLOOKUP($A51,FB_17,P$5,0))&IF(TYPE(VLOOKUP($A51,FB_18,P$5,0))=16,\"\",VLOOKUP($A51,FB_18,P$5,0))&IF(TYPE(VLOOKUP($A51,FB_19,P$5,0))=16,\"\",VLOOKUP($A51,FB_19,P$5,0))&IF(TYPE(VLOOKUP($A51,FB_20,P$5,0))=16,\"\",VLOOKUP($A51,FB_20,P$5,0))&IF(TYPE(VLOOKUP($A51,FB_21,P$5,0))=16,\"\",VLOOKUP($A51,FB_21,P$5,0))&IF(TYPE(VLOOKUP($A51,FB_22,P$5,0))=16,\"\",VLOOKUP($A51,FB_22,P$5,0))&IF(TYPE(VLOOKUP($A51,FB_23,P$5,0))=16,\"\",VLOOKUP($A51,FB_23,P$5,0))&IF(TYPE(VLOOKUP($A51,FB_24,P$5,0))=16,\"\",VLOOKUP($A51,FB_24,P$5,0))&IF(TYPE(VLOOKUP($A51,FB_25,P$5,0))=16,\"\",VLOOKUP($A51,FB_25,P$5,0))&IF(TYPE(VLOOKUP($A51,FB_26,P$5,0))=16,\"\",VLOOKUP($A51,FB_26,P$5,0))&IF(TYPE(VLOOKUP($A51,FB_27,P$5,0))=16,\"\",VLOOKUP($A51,FB_27,P$5,0))&IF(TYPE(VLOOKUP($A51,FB_28,P$5,0))=16,\"\",VLOOKUP($A51,FB_28,P$5,0))&IF(TYPE(VLOOKUP($A51,FB_29,P$5,0))=16,\"\",VLOOKUP($A51,FB_29,P$5,0))&IF(TYPE(VLOOKUP($A51,FB_30,P$5,0))=16,\"\",VLOOKUP($A51,FB_30,P$5,0))))","v":""},"",{"$f":"IF($B51=\"\",\"\",_xlfn.NUMBERVALUE(IF(TYPE(VLOOKUP($A51,FB_1,R$5,0))=16,\"\",VLOOKUP($A51,FB_1,R$5,0))&IF(TYPE(VLOOKUP($A51,FB_2,R$5,0))=16,\"\",VLOOKUP($A51,FB_2,R$5,0))&IF(TYPE(VLOOKUP($A51,FB_3,R$5,0))=16,\"\",VLOOKUP($A51,FB_3,R$5,0))&IF(TYPE(VLOOKUP($A51,FB_4,R$5,0))=16,\"\",VLOOKUP($A51,FB_4,R$5,0))&IF(TYPE(VLOOKUP($A51,FB_5,R$5,0))=16,\"\",VLOOKUP($A51,FB_5,R$5,0))&IF(TYPE(VLOOKUP($A51,FB_6,R$5,0))=16,\"\",VLOOKUP($A51,FB_6,R$5,0))&IF(TYPE(VLOOKUP($A51,FB_7,R$5,0))=16,\"\",VLOOKUP($A51,FB_7,R$5,0))&IF(TYPE(VLOOKUP($A51,FB_8,R$5,0))=16,\"\",VLOOKUP($A51,FB_8,R$5,0))&IF(TYPE(VLOOKUP($A51,FB_9,R$5,0))=16,\"\",VLOOKUP($A51,FB_9,R$5,0))&IF(TYPE(VLOOKUP($A51,FB_10,R$5,0))=16,\"\",VLOOKUP($A51,FB_10,R$5,0))&IF(TYPE(VLOOKUP($A51,FB_11,R$5,0))=16,\"\",VLOOKUP($A51,FB_11,R$5,0))&IF(TYPE(VLOOKUP($A51,FB_12,R$5,0))=16,\"\",VLOOKUP($A51,FB_12,R$5,0))&IF(TYPE(VLOOKUP($A51,FB_13,R$5,0))=16,\"\",VLOOKUP($A51,FB_13,R$5,0))&IF(TYPE(VLOOKUP($A51,FB_14,R$5,0))=16,\"\",VLOOKUP($A51,FB_14,R$5,0))&IF(TYPE(VLOOKUP($A51,FB_15,R$5,0))=16,\"\",VLOOKUP($A51,FB_15,R$5,0))&IF(TYPE(VLOOKUP($A51,FB_16,R$5,0))=16,\"\",VLOOKUP($A51,FB_16,R$5,0))&IF(TYPE(VLOOKUP($A51,FB_17,R$5,0))=16,\"\",VLOOKUP($A51,FB_17,R$5,0))&IF(TYPE(VLOOKUP($A51,FB_18,R$5,0))=16,\"\",VLOOKUP($A51,FB_18,R$5,0))&IF(TYPE(VLOOKUP($A51,FB_19,R$5,0))=16,\"\",VLOOKUP($A51,FB_19,R$5,0))&IF(TYPE(VLOOKUP($A51,FB_20,R$5,0))=16,\"\",VLOOKUP($A51,FB_20,R$5,0))&IF(TYPE(VLOOKUP($A51,FB_21,R$5,0))=16,\"\",VLOOKUP($A51,FB_21,R$5,0))&IF(TYPE(VLOOKUP($A51,FB_22,R$5,0))=16,\"\",VLOOKUP($A51,FB_22,R$5,0))&IF(TYPE(VLOOKUP($A51,FB_23,R$5,0))=16,\"\",VLOOKUP($A51,FB_23,R$5,0))&IF(TYPE(VLOOKUP($A51,FB_24,R$5,0))=16,\"\",VLOOKUP($A51,FB_24,R$5,0))&IF(TYPE(VLOOKUP($A51,FB_25,R$5,0))=16,\"\",VLOOKUP($A51,FB_25,R$5,0))&IF(TYPE(VLOOKUP($A51,FB_26,R$5,0))=16,\"\",VLOOKUP($A51,FB_26,R$5,0))&IF(TYPE(VLOOKUP($A51,FB_27,R$5,0))=16,\"\",VLOOKUP($A51,FB_27,R$5,0))&IF(TYPE(VLOOKUP($A51,FB_28,R$5,0))=16,\"\",VLOOKUP($A51,FB_28,R$5,0))&IF(TYPE(VLOOKUP($A51,FB_29,R$5,0))=16,\"\",VLOOKUP($A51,FB_29,R$5,0))&IF(TYPE(VLOOKUP($A51,FB_30,R$5,0))=16,\"\",VLOOKUP($A51,FB_30,R$5,0))))","v":""},{"$f":"IF($B51=\"\",\"\",IF(TYPE(VLOOKUP($A51,FB_1,S$5,0))=16,\"\",VLOOKUP($A51,FB_1,S$5,0))&IF(TYPE(VLOOKUP($A51,FB_2,S$5,0))=16,\"\",VLOOKUP($A51,FB_2,S$5,0))&IF(TYPE(VLOOKUP($A51,FB_3,S$5,0))=16,\"\",VLOOKUP($A51,FB_3,S$5,0))&IF(TYPE(VLOOKUP($A51,FB_4,S$5,0))=16,\"\",VLOOKUP($A51,FB_4,S$5,0))&IF(TYPE(VLOOKUP($A51,FB_5,S$5,0))=16,\"\",VLOOKUP($A51,FB_5,S$5,0))&IF(TYPE(VLOOKUP($A51,FB_6,S$5,0))=16,\"\",VLOOKUP($A51,FB_6,S$5,0))&IF(TYPE(VLOOKUP($A51,FB_7,S$5,0))=16,\"\",VLOOKUP($A51,FB_7,S$5,0))&IF(TYPE(VLOOKUP($A51,FB_8,S$5,0))=16,\"\",VLOOKUP($A51,FB_8,S$5,0))&IF(TYPE(VLOOKUP($A51,FB_9,S$5,0))=16,\"\",VLOOKUP($A51,FB_9,S$5,0))&IF(TYPE(VLOOKUP($A51,FB_10,S$5,0))=16,\"\",VLOOKUP($A51,FB_10,S$5,0))&IF(TYPE(VLOOKUP($A51,FB_11,S$5,0))=16,\"\",VLOOKUP($A51,FB_11,S$5,0))&IF(TYPE(VLOOKUP($A51,FB_12,S$5,0))=16,\"\",VLOOKUP($A51,FB_12,S$5,0))&IF(TYPE(VLOOKUP($A51,FB_13,S$5,0))=16,\"\",VLOOKUP($A51,FB_13,S$5,0))&IF(TYPE(VLOOKUP($A51,FB_14,S$5,0))=16,\"\",VLOOKUP($A51,FB_14,S$5,0))&IF(TYPE(VLOOKUP($A51,FB_15,S$5,0))=16,\"\",VLOOKUP($A51,FB_15,S$5,0))&IF(TYPE(VLOOKUP($A51,FB_16,S$5,0))=16,\"\",VLOOKUP($A51,FB_16,S$5,0))&IF(TYPE(VLOOKUP($A51,FB_17,S$5,0))=16,\"\",VLOOKUP($A51,FB_17,S$5,0))&IF(TYPE(VLOOKUP($A51,FB_18,S$5,0))=16,\"\",VLOOKUP($A51,FB_18,S$5,0))&IF(TYPE(VLOOKUP($A51,FB_19,S$5,0))=16,\"\",VLOOKUP($A51,FB_19,S$5,0))&IF(TYPE(VLOOKUP($A51,FB_20,S$5,0))=16,\"\",VLOOKUP($A51,FB_20,S$5,0))&IF(TYPE(VLOOKUP($A51,FB_21,S$5,0))=16,\"\",VLOOKUP($A51,FB_21,S$5,0))&IF(TYPE(VLOOKUP($A51,FB_22,S$5,0))=16,\"\",VLOOKUP($A51,FB_22,S$5,0))&IF(TYPE(VLOOKUP($A51,FB_23,S$5,0))=16,\"\",VLOOKUP($A51,FB_23,S$5,0))&IF(TYPE(VLOOKUP($A51,FB_24,S$5,0))=16,\"\",VLOOKUP($A51,FB_24,S$5,0))&IF(TYPE(VLOOKUP($A51,FB_25,S$5,0))=16,\"\",VLOOKUP($A51,FB_25,S$5,0))&IF(TYPE(VLOOKUP($A51,FB_26,S$5,0))=16,\"\",VLOOKUP($A51,FB_26,S$5,0))&IF(TYPE(VLOOKUP($A51,FB_27,S$5,0))=16,\"\",VLOOKUP($A51,FB_27,S$5,0))&IF(TYPE(VLOOKUP($A51,FB_28,S$5,0))=16,\"\",VLOOKUP($A51,FB_28,S$5,0))&IF(TYPE(VLOOKUP($A51,FB_29,S$5,0))=16,\"\",VLOOKUP($A51,FB_29,S$5,0))&IF(TYPE(VLOOKUP($A51,FB_30,S$5,0))=16,\"\",VLOOKUP($A51,FB_30,S$5,0)))","v":""},null,null,null,null,null,null,null,null,null,null,null,null,null,null,null,null,"",":","","",""]
["23.",{"$f":"IF(TYPE(VLOOKUP($A52,FB_1,2,0))=16,\"\",VLOOKUP($A52,FB_1,2,0))&IF(TYPE(VLOOKUP($A52,FB_2,2,0))=16,\"\",VLOOKUP($A52,FB_2,2,0))&IF(TYPE(VLOOKUP($A52,FB_3,2,0))=16,\"\",VLOOKUP($A52,FB_3,2,0))&IF(TYPE(VLOOKUP($A52,FB_4,2,0))=16,\"\",VLOOKUP($A52,FB_4,2,0))&IF(TYPE(VLOOKUP($A52,FB_5,2,0))=16,\"\",VLOOKUP($A52,FB_5,2,0))&IF(TYPE(VLOOKUP($A52,FB_6,2,0))=16,\"\",VLOOKUP($A52,FB_6,2,0))&IF(TYPE(VLOOKUP($A52,FB_7,2,0))=16,\"\",VLOOKUP($A52,FB_7,2,0))&IF(TYPE(VLOOKUP($A52,FB_8,2,0))=16,\"\",VLOOKUP($A52,FB_8,2,0))&IF(TYPE(VLOOKUP($A52,FB_9,2,0))=16,\"\",VLOOKUP($A52,FB_9,2,0))&IF(TYPE(VLOOKUP($A52,FB_10,2,0))=16,\"\",VLOOKUP($A52,FB_10,2,0))&IF(TYPE(VLOOKUP($A52,FB_11,2,0))=16,\"\",VLOOKUP($A52,FB_11,2,0))&IF(TYPE(VLOOKUP($A52,FB_12,2,0))=16,\"\",VLOOKUP($A52,FB_12,2,0))&IF(TYPE(VLOOKUP($A52,FB_13,2,0))=16,\"\",VLOOKUP($A52,FB_13,2,0))&IF(TYPE(VLOOKUP($A52,FB_14,2,0))=16,\"\",VLOOKUP($A52,FB_14,2,0))&IF(TYPE(VLOOKUP($A52,FB_15,2,0))=16,\"\",VLOOKUP($A52,FB_15,2,0))&IF(TYPE(VLOOKUP($A52,FB_16,2,0))=16,\"\",VLOOKUP($A52,FB_16,2,0))&IF(TYPE(VLOOKUP($A52,FB_17,2,0))=16,\"\",VLOOKUP($A52,FB_17,2,0))&IF(TYPE(VLOOKUP($A52,FB_18,2,0))=16,\"\",VLOOKUP($A52,FB_18,2,0))&IF(TYPE(VLOOKUP($A52,FB_19,2,0))=16,\"\",VLOOKUP($A52,FB_19,2,0))&IF(TYPE(VLOOKUP($A52,FB_20,2,0))=16,\"\",VLOOKUP($A52,FB_20,2,0))&IF(TYPE(VLOOKUP($A52,FB_21,2,0))=16,\"\",VLOOKUP($A52,FB_21,2,0))&IF(TYPE(VLOOKUP($A52,FB_22,2,0))=16,\"\",VLOOKUP($A52,FB_22,2,0))&IF(TYPE(VLOOKUP($A52,FB_23,2,0))=16,\"\",VLOOKUP($A52,FB_23,2,0))&IF(TYPE(VLOOKUP($A52,FB_24,2,0))=16,\"\",VLOOKUP($A52,FB_24,2,0))&IF(TYPE(VLOOKUP($A52,FB_25,2,0))=16,\"\",VLOOKUP($A52,FB_25,2,0))&IF(TYPE(VLOOKUP($A52,FB_26,2,0))=16,\"\",VLOOKUP($A52,FB_26,2,0))&IF(TYPE(VLOOKUP($A52,FB_27,2,0))=16,\"\",VLOOKUP($A52,FB_27,2,0))&IF(TYPE(VLOOKUP($A52,FB_28,2,0))=16,\"\",VLOOKUP($A52,FB_28,2,0))&IF(TYPE(VLOOKUP($A52,FB_29,2,0))=16,\"\",VLOOKUP($A52,FB_29,2,0))&IF(TYPE(VLOOKUP($A52,FB_30,2,0))=16,\"\",VLOOKUP($A52,FB_30,2,0))","v":""},null,{"$f":"IF($B52=\"\",\"\",_xlfn.NUMBERVALUE(IF(TYPE(VLOOKUP($A52,FB_1,P$5,0))=16,\"\",VLOOKUP($A52,FB_1,P$5,0))&IF(TYPE(VLOOKUP($A52,FB_2,P$5,0))=16,\"\",VLOOKUP($A52,FB_2,P$5,0))&IF(TYPE(VLOOKUP($A52,FB_3,P$5,0))=16,\"\",VLOOKUP($A52,FB_3,P$5,0))&IF(TYPE(VLOOKUP($A52,FB_4,P$5,0))=16,\"\",VLOOKUP($A52,FB_4,P$5,0))&IF(TYPE(VLOOKUP($A52,FB_5,P$5,0))=16,\"\",VLOOKUP($A52,FB_5,P$5,0))&IF(TYPE(VLOOKUP($A52,FB_6,P$5,0))=16,\"\",VLOOKUP($A52,FB_6,P$5,0))&IF(TYPE(VLOOKUP($A52,FB_7,P$5,0))=16,\"\",VLOOKUP($A52,FB_7,P$5,0))&IF(TYPE(VLOOKUP($A52,FB_8,P$5,0))=16,\"\",VLOOKUP($A52,FB_8,P$5,0))&IF(TYPE(VLOOKUP($A52,FB_9,P$5,0))=16,\"\",VLOOKUP($A52,FB_9,P$5,0))&IF(TYPE(VLOOKUP($A52,FB_10,P$5,0))=16,\"\",VLOOKUP($A52,FB_10,P$5,0))&IF(TYPE(VLOOKUP($A52,FB_11,P$5,0))=16,\"\",VLOOKUP($A52,FB_11,P$5,0))&IF(TYPE(VLOOKUP($A52,FB_12,P$5,0))=16,\"\",VLOOKUP($A52,FB_12,P$5,0))&IF(TYPE(VLOOKUP($A52,FB_13,P$5,0))=16,\"\",VLOOKUP($A52,FB_13,P$5,0))&IF(TYPE(VLOOKUP($A52,FB_14,P$5,0))=16,\"\",VLOOKUP($A52,FB_14,P$5,0))&IF(TYPE(VLOOKUP($A52,FB_15,P$5,0))=16,\"\",VLOOKUP($A52,FB_15,P$5,0))&IF(TYPE(VLOOKUP($A52,FB_16,P$5,0))=16,\"\",VLOOKUP($A52,FB_16,P$5,0))&IF(TYPE(VLOOKUP($A52,FB_17,P$5,0))=16,\"\",VLOOKUP($A52,FB_17,P$5,0))&IF(TYPE(VLOOKUP($A52,FB_18,P$5,0))=16,\"\",VLOOKUP($A52,FB_18,P$5,0))&IF(TYPE(VLOOKUP($A52,FB_19,P$5,0))=16,\"\",VLOOKUP($A52,FB_19,P$5,0))&IF(TYPE(VLOOKUP($A52,FB_20,P$5,0))=16,\"\",VLOOKUP($A52,FB_20,P$5,0))&IF(TYPE(VLOOKUP($A52,FB_21,P$5,0))=16,\"\",VLOOKUP($A52,FB_21,P$5,0))&IF(TYPE(VLOOKUP($A52,FB_22,P$5,0))=16,\"\",VLOOKUP($A52,FB_22,P$5,0))&IF(TYPE(VLOOKUP($A52,FB_23,P$5,0))=16,\"\",VLOOKUP($A52,FB_23,P$5,0))&IF(TYPE(VLOOKUP($A52,FB_24,P$5,0))=16,\"\",VLOOKUP($A52,FB_24,P$5,0))&IF(TYPE(VLOOKUP($A52,FB_25,P$5,0))=16,\"\",VLOOKUP($A52,FB_25,P$5,0))&IF(TYPE(VLOOKUP($A52,FB_26,P$5,0))=16,\"\",VLOOKUP($A52,FB_26,P$5,0))&IF(TYPE(VLOOKUP($A52,FB_27,P$5,0))=16,\"\",VLOOKUP($A52,FB_27,P$5,0))&IF(TYPE(VLOOKUP($A52,FB_28,P$5,0))=16,\"\",VLOOKUP($A52,FB_28,P$5,0))&IF(TYPE(VLOOKUP($A52,FB_29,P$5,0))=16,\"\",VLOOKUP($A52,FB_29,P$5,0))&IF(TYPE(VLOOKUP($A52,FB_30,P$5,0))=16,\"\",VLOOKUP($A52,FB_30,P$5,0))))","v":""},"",{"$f":"IF($B52=\"\",\"\",_xlfn.NUMBERVALUE(IF(TYPE(VLOOKUP($A52,FB_1,R$5,0))=16,\"\",VLOOKUP($A52,FB_1,R$5,0))&IF(TYPE(VLOOKUP($A52,FB_2,R$5,0))=16,\"\",VLOOKUP($A52,FB_2,R$5,0))&IF(TYPE(VLOOKUP($A52,FB_3,R$5,0))=16,\"\",VLOOKUP($A52,FB_3,R$5,0))&IF(TYPE(VLOOKUP($A52,FB_4,R$5,0))=16,\"\",VLOOKUP($A52,FB_4,R$5,0))&IF(TYPE(VLOOKUP($A52,FB_5,R$5,0))=16,\"\",VLOOKUP($A52,FB_5,R$5,0))&IF(TYPE(VLOOKUP($A52,FB_6,R$5,0))=16,\"\",VLOOKUP($A52,FB_6,R$5,0))&IF(TYPE(VLOOKUP($A52,FB_7,R$5,0))=16,\"\",VLOOKUP($A52,FB_7,R$5,0))&IF(TYPE(VLOOKUP($A52,FB_8,R$5,0))=16,\"\",VLOOKUP($A52,FB_8,R$5,0))&IF(TYPE(VLOOKUP($A52,FB_9,R$5,0))=16,\"\",VLOOKUP($A52,FB_9,R$5,0))&IF(TYPE(VLOOKUP($A52,FB_10,R$5,0))=16,\"\",VLOOKUP($A52,FB_10,R$5,0))&IF(TYPE(VLOOKUP($A52,FB_11,R$5,0))=16,\"\",VLOOKUP($A52,FB_11,R$5,0))&IF(TYPE(VLOOKUP($A52,FB_12,R$5,0))=16,\"\",VLOOKUP($A52,FB_12,R$5,0))&IF(TYPE(VLOOKUP($A52,FB_13,R$5,0))=16,\"\",VLOOKUP($A52,FB_13,R$5,0))&IF(TYPE(VLOOKUP($A52,FB_14,R$5,0))=16,\"\",VLOOKUP($A52,FB_14,R$5,0))&IF(TYPE(VLOOKUP($A52,FB_15,R$5,0))=16,\"\",VLOOKUP($A52,FB_15,R$5,0))&IF(TYPE(VLOOKUP($A52,FB_16,R$5,0))=16,\"\",VLOOKUP($A52,FB_16,R$5,0))&IF(TYPE(VLOOKUP($A52,FB_17,R$5,0))=16,\"\",VLOOKUP($A52,FB_17,R$5,0))&IF(TYPE(VLOOKUP($A52,FB_18,R$5,0))=16,\"\",VLOOKUP($A52,FB_18,R$5,0))&IF(TYPE(VLOOKUP($A52,FB_19,R$5,0))=16,\"\",VLOOKUP($A52,FB_19,R$5,0))&IF(TYPE(VLOOKUP($A52,FB_20,R$5,0))=16,\"\",VLOOKUP($A52,FB_20,R$5,0))&IF(TYPE(VLOOKUP($A52,FB_21,R$5,0))=16,\"\",VLOOKUP($A52,FB_21,R$5,0))&IF(TYPE(VLOOKUP($A52,FB_22,R$5,0))=16,\"\",VLOOKUP($A52,FB_22,R$5,0))&IF(TYPE(VLOOKUP($A52,FB_23,R$5,0))=16,\"\",VLOOKUP($A52,FB_23,R$5,0))&IF(TYPE(VLOOKUP($A52,FB_24,R$5,0))=16,\"\",VLOOKUP($A52,FB_24,R$5,0))&IF(TYPE(VLOOKUP($A52,FB_25,R$5,0))=16,\"\",VLOOKUP($A52,FB_25,R$5,0))&IF(TYPE(VLOOKUP($A52,FB_26,R$5,0))=16,\"\",VLOOKUP($A52,FB_26,R$5,0))&IF(TYPE(VLOOKUP($A52,FB_27,R$5,0))=16,\"\",VLOOKUP($A52,FB_27,R$5,0))&IF(TYPE(VLOOKUP($A52,FB_28,R$5,0))=16,\"\",VLOOKUP($A52,FB_28,R$5,0))&IF(TYPE(VLOOKUP($A52,FB_29,R$5,0))=16,\"\",VLOOKUP($A52,FB_29,R$5,0))&IF(TYPE(VLOOKUP($A52,FB_30,R$5,0))=16,\"\",VLOOKUP($A52,FB_30,R$5,0))))","v":""},{"$f":"IF($B52=\"\",\"\",IF(TYPE(VLOOKUP($A52,FB_1,S$5,0))=16,\"\",VLOOKUP($A52,FB_1,S$5,0))&IF(TYPE(VLOOKUP($A52,FB_2,S$5,0))=16,\"\",VLOOKUP($A52,FB_2,S$5,0))&IF(TYPE(VLOOKUP($A52,FB_3,S$5,0))=16,\"\",VLOOKUP($A52,FB_3,S$5,0))&IF(TYPE(VLOOKUP($A52,FB_4,S$5,0))=16,\"\",VLOOKUP($A52,FB_4,S$5,0))&IF(TYPE(VLOOKUP($A52,FB_5,S$5,0))=16,\"\",VLOOKUP($A52,FB_5,S$5,0))&IF(TYPE(VLOOKUP($A52,FB_6,S$5,0))=16,\"\",VLOOKUP($A52,FB_6,S$5,0))&IF(TYPE(VLOOKUP($A52,FB_7,S$5,0))=16,\"\",VLOOKUP($A52,FB_7,S$5,0))&IF(TYPE(VLOOKUP($A52,FB_8,S$5,0))=16,\"\",VLOOKUP($A52,FB_8,S$5,0))&IF(TYPE(VLOOKUP($A52,FB_9,S$5,0))=16,\"\",VLOOKUP($A52,FB_9,S$5,0))&IF(TYPE(VLOOKUP($A52,FB_10,S$5,0))=16,\"\",VLOOKUP($A52,FB_10,S$5,0))&IF(TYPE(VLOOKUP($A52,FB_11,S$5,0))=16,\"\",VLOOKUP($A52,FB_11,S$5,0))&IF(TYPE(VLOOKUP($A52,FB_12,S$5,0))=16,\"\",VLOOKUP($A52,FB_12,S$5,0))&IF(TYPE(VLOOKUP($A52,FB_13,S$5,0))=16,\"\",VLOOKUP($A52,FB_13,S$5,0))&IF(TYPE(VLOOKUP($A52,FB_14,S$5,0))=16,\"\",VLOOKUP($A52,FB_14,S$5,0))&IF(TYPE(VLOOKUP($A52,FB_15,S$5,0))=16,\"\",VLOOKUP($A52,FB_15,S$5,0))&IF(TYPE(VLOOKUP($A52,FB_16,S$5,0))=16,\"\",VLOOKUP($A52,FB_16,S$5,0))&IF(TYPE(VLOOKUP($A52,FB_17,S$5,0))=16,\"\",VLOOKUP($A52,FB_17,S$5,0))&IF(TYPE(VLOOKUP($A52,FB_18,S$5,0))=16,\"\",VLOOKUP($A52,FB_18,S$5,0))&IF(TYPE(VLOOKUP($A52,FB_19,S$5,0))=16,\"\",VLOOKUP($A52,FB_19,S$5,0))&IF(TYPE(VLOOKUP($A52,FB_20,S$5,0))=16,\"\",VLOOKUP($A52,FB_20,S$5,0))&IF(TYPE(VLOOKUP($A52,FB_21,S$5,0))=16,\"\",VLOOKUP($A52,FB_21,S$5,0))&IF(TYPE(VLOOKUP($A52,FB_22,S$5,0))=16,\"\",VLOOKUP($A52,FB_22,S$5,0))&IF(TYPE(VLOOKUP($A52,FB_23,S$5,0))=16,\"\",VLOOKUP($A52,FB_23,S$5,0))&IF(TYPE(VLOOKUP($A52,FB_24,S$5,0))=16,\"\",VLOOKUP($A52,FB_24,S$5,0))&IF(TYPE(VLOOKUP($A52,FB_25,S$5,0))=16,\"\",VLOOKUP($A52,FB_25,S$5,0))&IF(TYPE(VLOOKUP($A52,FB_26,S$5,0))=16,\"\",VLOOKUP($A52,FB_26,S$5,0))&IF(TYPE(VLOOKUP($A52,FB_27,S$5,0))=16,\"\",VLOOKUP($A52,FB_27,S$5,0))&IF(TYPE(VLOOKUP($A52,FB_28,S$5,0))=16,\"\",VLOOKUP($A52,FB_28,S$5,0))&IF(TYPE(VLOOKUP($A52,FB_29,S$5,0))=16,\"\",VLOOKUP($A52,FB_29,S$5,0))&IF(TYPE(VLOOKUP($A52,FB_30,S$5,0))=16,\"\",VLOOKUP($A52,FB_30,S$5,0)))","v":""},null,null,null,null,null,null,null,null,null,null,null,null,null,null,null,null,"",":","","",""]
["24.",{"$f":"IF(TYPE(VLOOKUP($A53,FB_1,2,0))=16,\"\",VLOOKUP($A53,FB_1,2,0))&IF(TYPE(VLOOKUP($A53,FB_2,2,0))=16,\"\",VLOOKUP($A53,FB_2,2,0))&IF(TYPE(VLOOKUP($A53,FB_3,2,0))=16,\"\",VLOOKUP($A53,FB_3,2,0))&IF(TYPE(VLOOKUP($A53,FB_4,2,0))=16,\"\",VLOOKUP($A53,FB_4,2,0))&IF(TYPE(VLOOKUP($A53,FB_5,2,0))=16,\"\",VLOOKUP($A53,FB_5,2,0))&IF(TYPE(VLOOKUP($A53,FB_6,2,0))=16,\"\",VLOOKUP($A53,FB_6,2,0))&IF(TYPE(VLOOKUP($A53,FB_7,2,0))=16,\"\",VLOOKUP($A53,FB_7,2,0))&IF(TYPE(VLOOKUP($A53,FB_8,2,0))=16,\"\",VLOOKUP($A53,FB_8,2,0))&IF(TYPE(VLOOKUP($A53,FB_9,2,0))=16,\"\",VLOOKUP($A53,FB_9,2,0))&IF(TYPE(VLOOKUP($A53,FB_10,2,0))=16,\"\",VLOOKUP($A53,FB_10,2,0))&IF(TYPE(VLOOKUP($A53,FB_11,2,0))=16,\"\",VLOOKUP($A53,FB_11,2,0))&IF(TYPE(VLOOKUP($A53,FB_12,2,0))=16,\"\",VLOOKUP($A53,FB_12,2,0))&IF(TYPE(VLOOKUP($A53,FB_13,2,0))=16,\"\",VLOOKUP($A53,FB_13,2,0))&IF(TYPE(VLOOKUP($A53,FB_14,2,0))=16,\"\",VLOOKUP($A53,FB_14,2,0))&IF(TYPE(VLOOKUP($A53,FB_15,2,0))=16,\"\",VLOOKUP($A53,FB_15,2,0))&IF(TYPE(VLOOKUP($A53,FB_16,2,0))=16,\"\",VLOOKUP($A53,FB_16,2,0))&IF(TYPE(VLOOKUP($A53,FB_17,2,0))=16,\"\",VLOOKUP($A53,FB_17,2,0))&IF(TYPE(VLOOKUP($A53,FB_18,2,0))=16,\"\",VLOOKUP($A53,FB_18,2,0))&IF(TYPE(VLOOKUP($A53,FB_19,2,0))=16,\"\",VLOOKUP($A53,FB_19,2,0))&IF(TYPE(VLOOKUP($A53,FB_20,2,0))=16,\"\",VLOOKUP($A53,FB_20,2,0))&IF(TYPE(VLOOKUP($A53,FB_21,2,0))=16,\"\",VLOOKUP($A53,FB_21,2,0))&IF(TYPE(VLOOKUP($A53,FB_22,2,0))=16,\"\",VLOOKUP($A53,FB_22,2,0))&IF(TYPE(VLOOKUP($A53,FB_23,2,0))=16,\"\",VLOOKUP($A53,FB_23,2,0))&IF(TYPE(VLOOKUP($A53,FB_24,2,0))=16,\"\",VLOOKUP($A53,FB_24,2,0))&IF(TYPE(VLOOKUP($A53,FB_25,2,0))=16,\"\",VLOOKUP($A53,FB_25,2,0))&IF(TYPE(VLOOKUP($A53,FB_26,2,0))=16,\"\",VLOOKUP($A53,FB_26,2,0))&IF(TYPE(VLOOKUP($A53,FB_27,2,0))=16,\"\",VLOOKUP($A53,FB_27,2,0))&IF(TYPE(VLOOKUP($A53,FB_28,2,0))=16,\"\",VLOOKUP($A53,FB_28,2,0))&IF(TYPE(VLOOKUP($A53,FB_29,2,0))=16,\"\",VLOOKUP($A53,FB_29,2,0))&IF(TYPE(VLOOKUP($A53,FB_30,2,0))=16,\"\",VLOOKUP($A53,FB_30,2,0))","v":""},null,{"$f":"IF($B53=\"\",\"\",_xlfn.NUMBERVALUE(IF(TYPE(VLOOKUP($A53,FB_1,P$5,0))=16,\"\",VLOOKUP($A53,FB_1,P$5,0))&IF(TYPE(VLOOKUP($A53,FB_2,P$5,0))=16,\"\",VLOOKUP($A53,FB_2,P$5,0))&IF(TYPE(VLOOKUP($A53,FB_3,P$5,0))=16,\"\",VLOOKUP($A53,FB_3,P$5,0))&IF(TYPE(VLOOKUP($A53,FB_4,P$5,0))=16,\"\",VLOOKUP($A53,FB_4,P$5,0))&IF(TYPE(VLOOKUP($A53,FB_5,P$5,0))=16,\"\",VLOOKUP($A53,FB_5,P$5,0))&IF(TYPE(VLOOKUP($A53,FB_6,P$5,0))=16,\"\",VLOOKUP($A53,FB_6,P$5,0))&IF(TYPE(VLOOKUP($A53,FB_7,P$5,0))=16,\"\",VLOOKUP($A53,FB_7,P$5,0))&IF(TYPE(VLOOKUP($A53,FB_8,P$5,0))=16,\"\",VLOOKUP($A53,FB_8,P$5,0))&IF(TYPE(VLOOKUP($A53,FB_9,P$5,0))=16,\"\",VLOOKUP($A53,FB_9,P$5,0))&IF(TYPE(VLOOKUP($A53,FB_10,P$5,0))=16,\"\",VLOOKUP($A53,FB_10,P$5,0))&IF(TYPE(VLOOKUP($A53,FB_11,P$5,0))=16,\"\",VLOOKUP($A53,FB_11,P$5,0))&IF(TYPE(VLOOKUP($A53,FB_12,P$5,0))=16,\"\",VLOOKUP($A53,FB_12,P$5,0))&IF(TYPE(VLOOKUP($A53,FB_13,P$5,0))=16,\"\",VLOOKUP($A53,FB_13,P$5,0))&IF(TYPE(VLOOKUP($A53,FB_14,P$5,0))=16,\"\",VLOOKUP($A53,FB_14,P$5,0))&IF(TYPE(VLOOKUP($A53,FB_15,P$5,0))=16,\"\",VLOOKUP($A53,FB_15,P$5,0))&IF(TYPE(VLOOKUP($A53,FB_16,P$5,0))=16,\"\",VLOOKUP($A53,FB_16,P$5,0))&IF(TYPE(VLOOKUP($A53,FB_17,P$5,0))=16,\"\",VLOOKUP($A53,FB_17,P$5,0))&IF(TYPE(VLOOKUP($A53,FB_18,P$5,0))=16,\"\",VLOOKUP($A53,FB_18,P$5,0))&IF(TYPE(VLOOKUP($A53,FB_19,P$5,0))=16,\"\",VLOOKUP($A53,FB_19,P$5,0))&IF(TYPE(VLOOKUP($A53,FB_20,P$5,0))=16,\"\",VLOOKUP($A53,FB_20,P$5,0))&IF(TYPE(VLOOKUP($A53,FB_21,P$5,0))=16,\"\",VLOOKUP($A53,FB_21,P$5,0))&IF(TYPE(VLOOKUP($A53,FB_22,P$5,0))=16,\"\",VLOOKUP($A53,FB_22,P$5,0))&IF(TYPE(VLOOKUP($A53,FB_23,P$5,0))=16,\"\",VLOOKUP($A53,FB_23,P$5,0))&IF(TYPE(VLOOKUP($A53,FB_24,P$5,0))=16,\"\",VLOOKUP($A53,FB_24,P$5,0))&IF(TYPE(VLOOKUP($A53,FB_25,P$5,0))=16,\"\",VLOOKUP($A53,FB_25,P$5,0))&IF(TYPE(VLOOKUP($A53,FB_26,P$5,0))=16,\"\",VLOOKUP($A53,FB_26,P$5,0))&IF(TYPE(VLOOKUP($A53,FB_27,P$5,0))=16,\"\",VLOOKUP($A53,FB_27,P$5,0))&IF(TYPE(VLOOKUP($A53,FB_28,P$5,0))=16,\"\",VLOOKUP($A53,FB_28,P$5,0))&IF(TYPE(VLOOKUP($A53,FB_29,P$5,0))=16,\"\",VLOOKUP($A53,FB_29,P$5,0))&IF(TYPE(VLOOKUP($A53,FB_30,P$5,0))=16,\"\",VLOOKUP($A53,FB_30,P$5,0))))","v":""},"",{"$f":"IF($B53=\"\",\"\",_xlfn.NUMBERVALUE(IF(TYPE(VLOOKUP($A53,FB_1,R$5,0))=16,\"\",VLOOKUP($A53,FB_1,R$5,0))&IF(TYPE(VLOOKUP($A53,FB_2,R$5,0))=16,\"\",VLOOKUP($A53,FB_2,R$5,0))&IF(TYPE(VLOOKUP($A53,FB_3,R$5,0))=16,\"\",VLOOKUP($A53,FB_3,R$5,0))&IF(TYPE(VLOOKUP($A53,FB_4,R$5,0))=16,\"\",VLOOKUP($A53,FB_4,R$5,0))&IF(TYPE(VLOOKUP($A53,FB_5,R$5,0))=16,\"\",VLOOKUP($A53,FB_5,R$5,0))&IF(TYPE(VLOOKUP($A53,FB_6,R$5,0))=16,\"\",VLOOKUP($A53,FB_6,R$5,0))&IF(TYPE(VLOOKUP($A53,FB_7,R$5,0))=16,\"\",VLOOKUP($A53,FB_7,R$5,0))&IF(TYPE(VLOOKUP($A53,FB_8,R$5,0))=16,\"\",VLOOKUP($A53,FB_8,R$5,0))&IF(TYPE(VLOOKUP($A53,FB_9,R$5,0))=16,\"\",VLOOKUP($A53,FB_9,R$5,0))&IF(TYPE(VLOOKUP($A53,FB_10,R$5,0))=16,\"\",VLOOKUP($A53,FB_10,R$5,0))&IF(TYPE(VLOOKUP($A53,FB_11,R$5,0))=16,\"\",VLOOKUP($A53,FB_11,R$5,0))&IF(TYPE(VLOOKUP($A53,FB_12,R$5,0))=16,\"\",VLOOKUP($A53,FB_12,R$5,0))&IF(TYPE(VLOOKUP($A53,FB_13,R$5,0))=16,\"\",VLOOKUP($A53,FB_13,R$5,0))&IF(TYPE(VLOOKUP($A53,FB_14,R$5,0))=16,\"\",VLOOKUP($A53,FB_14,R$5,0))&IF(TYPE(VLOOKUP($A53,FB_15,R$5,0))=16,\"\",VLOOKUP($A53,FB_15,R$5,0))&IF(TYPE(VLOOKUP($A53,FB_16,R$5,0))=16,\"\",VLOOKUP($A53,FB_16,R$5,0))&IF(TYPE(VLOOKUP($A53,FB_17,R$5,0))=16,\"\",VLOOKUP($A53,FB_17,R$5,0))&IF(TYPE(VLOOKUP($A53,FB_18,R$5,0))=16,\"\",VLOOKUP($A53,FB_18,R$5,0))&IF(TYPE(VLOOKUP($A53,FB_19,R$5,0))=16,\"\",VLOOKUP($A53,FB_19,R$5,0))&IF(TYPE(VLOOKUP($A53,FB_20,R$5,0))=16,\"\",VLOOKUP($A53,FB_20,R$5,0))&IF(TYPE(VLOOKUP($A53,FB_21,R$5,0))=16,\"\",VLOOKUP($A53,FB_21,R$5,0))&IF(TYPE(VLOOKUP($A53,FB_22,R$5,0))=16,\"\",VLOOKUP($A53,FB_22,R$5,0))&IF(TYPE(VLOOKUP($A53,FB_23,R$5,0))=16,\"\",VLOOKUP($A53,FB_23,R$5,0))&IF(TYPE(VLOOKUP($A53,FB_24,R$5,0))=16,\"\",VLOOKUP($A53,FB_24,R$5,0))&IF(TYPE(VLOOKUP($A53,FB_25,R$5,0))=16,\"\",VLOOKUP($A53,FB_25,R$5,0))&IF(TYPE(VLOOKUP($A53,FB_26,R$5,0))=16,\"\",VLOOKUP($A53,FB_26,R$5,0))&IF(TYPE(VLOOKUP($A53,FB_27,R$5,0))=16,\"\",VLOOKUP($A53,FB_27,R$5,0))&IF(TYPE(VLOOKUP($A53,FB_28,R$5,0))=16,\"\",VLOOKUP($A53,FB_28,R$5,0))&IF(TYPE(VLOOKUP($A53,FB_29,R$5,0))=16,\"\",VLOOKUP($A53,FB_29,R$5,0))&IF(TYPE(VLOOKUP($A53,FB_30,R$5,0))=16,\"\",VLOOKUP($A53,FB_30,R$5,0))))","v":""},{"$f":"IF($B53=\"\",\"\",IF(TYPE(VLOOKUP($A53,FB_1,S$5,0))=16,\"\",VLOOKUP($A53,FB_1,S$5,0))&IF(TYPE(VLOOKUP($A53,FB_2,S$5,0))=16,\"\",VLOOKUP($A53,FB_2,S$5,0))&IF(TYPE(VLOOKUP($A53,FB_3,S$5,0))=16,\"\",VLOOKUP($A53,FB_3,S$5,0))&IF(TYPE(VLOOKUP($A53,FB_4,S$5,0))=16,\"\",VLOOKUP($A53,FB_4,S$5,0))&IF(TYPE(VLOOKUP($A53,FB_5,S$5,0))=16,\"\",VLOOKUP($A53,FB_5,S$5,0))&IF(TYPE(VLOOKUP($A53,FB_6,S$5,0))=16,\"\",VLOOKUP($A53,FB_6,S$5,0))&IF(TYPE(VLOOKUP($A53,FB_7,S$5,0))=16,\"\",VLOOKUP($A53,FB_7,S$5,0))&IF(TYPE(VLOOKUP($A53,FB_8,S$5,0))=16,\"\",VLOOKUP($A53,FB_8,S$5,0))&IF(TYPE(VLOOKUP($A53,FB_9,S$5,0))=16,\"\",VLOOKUP($A53,FB_9,S$5,0))&IF(TYPE(VLOOKUP($A53,FB_10,S$5,0))=16,\"\",VLOOKUP($A53,FB_10,S$5,0))&IF(TYPE(VLOOKUP($A53,FB_11,S$5,0))=16,\"\",VLOOKUP($A53,FB_11,S$5,0))&IF(TYPE(VLOOKUP($A53,FB_12,S$5,0))=16,\"\",VLOOKUP($A53,FB_12,S$5,0))&IF(TYPE(VLOOKUP($A53,FB_13,S$5,0))=16,\"\",VLOOKUP($A53,FB_13,S$5,0))&IF(TYPE(VLOOKUP($A53,FB_14,S$5,0))=16,\"\",VLOOKUP($A53,FB_14,S$5,0))&IF(TYPE(VLOOKUP($A53,FB_15,S$5,0))=16,\"\",VLOOKUP($A53,FB_15,S$5,0))&IF(TYPE(VLOOKUP($A53,FB_16,S$5,0))=16,\"\",VLOOKUP($A53,FB_16,S$5,0))&IF(TYPE(VLOOKUP($A53,FB_17,S$5,0))=16,\"\",VLOOKUP($A53,FB_17,S$5,0))&IF(TYPE(VLOOKUP($A53,FB_18,S$5,0))=16,\"\",VLOOKUP($A53,FB_18,S$5,0))&IF(TYPE(VLOOKUP($A53,FB_19,S$5,0))=16,\"\",VLOOKUP($A53,FB_19,S$5,0))&IF(TYPE(VLOOKUP($A53,FB_20,S$5,0))=16,\"\",VLOOKUP($A53,FB_20,S$5,0))&IF(TYPE(VLOOKUP($A53,FB_21,S$5,0))=16,\"\",VLOOKUP($A53,FB_21,S$5,0))&IF(TYPE(VLOOKUP($A53,FB_22,S$5,0))=16,\"\",VLOOKUP($A53,FB_22,S$5,0))&IF(TYPE(VLOOKUP($A53,FB_23,S$5,0))=16,\"\",VLOOKUP($A53,FB_23,S$5,0))&IF(TYPE(VLOOKUP($A53,FB_24,S$5,0))=16,\"\",VLOOKUP($A53,FB_24,S$5,0))&IF(TYPE(VLOOKUP($A53,FB_25,S$5,0))=16,\"\",VLOOKUP($A53,FB_25,S$5,0))&IF(TYPE(VLOOKUP($A53,FB_26,S$5,0))=16,\"\",VLOOKUP($A53,FB_26,S$5,0))&IF(TYPE(VLOOKUP($A53,FB_27,S$5,0))=16,\"\",VLOOKUP($A53,FB_27,S$5,0))&IF(TYPE(VLOOKUP($A53,FB_28,S$5,0))=16,\"\",VLOOKUP($A53,FB_28,S$5,0))&IF(TYPE(VLOOKUP($A53,FB_29,S$5,0))=16,\"\",VLOOKUP($A53,FB_29,S$5,0))&IF(TYPE(VLOOKUP($A53,FB_30,S$5,0))=16,\"\",VLOOKUP($A53,FB_30,S$5,0)))","v":""},null,null,null,null,null,null,null,null,null,null,null,null,null,null,null,null,"",":","","",""]
["25.",{"$f":"IF(TYPE(VLOOKUP($A54,FB_1,2,0))=16,\"\",VLOOKUP($A54,FB_1,2,0))&IF(TYPE(VLOOKUP($A54,FB_2,2,0))=16,\"\",VLOOKUP($A54,FB_2,2,0))&IF(TYPE(VLOOKUP($A54,FB_3,2,0))=16,\"\",VLOOKUP($A54,FB_3,2,0))&IF(TYPE(VLOOKUP($A54,FB_4,2,0))=16,\"\",VLOOKUP($A54,FB_4,2,0))&IF(TYPE(VLOOKUP($A54,FB_5,2,0))=16,\"\",VLOOKUP($A54,FB_5,2,0))&IF(TYPE(VLOOKUP($A54,FB_6,2,0))=16,\"\",VLOOKUP($A54,FB_6,2,0))&IF(TYPE(VLOOKUP($A54,FB_7,2,0))=16,\"\",VLOOKUP($A54,FB_7,2,0))&IF(TYPE(VLOOKUP($A54,FB_8,2,0))=16,\"\",VLOOKUP($A54,FB_8,2,0))&IF(TYPE(VLOOKUP($A54,FB_9,2,0))=16,\"\",VLOOKUP($A54,FB_9,2,0))&IF(TYPE(VLOOKUP($A54,FB_10,2,0))=16,\"\",VLOOKUP($A54,FB_10,2,0))&IF(TYPE(VLOOKUP($A54,FB_11,2,0))=16,\"\",VLOOKUP($A54,FB_11,2,0))&IF(TYPE(VLOOKUP($A54,FB_12,2,0))=16,\"\",VLOOKUP($A54,FB_12,2,0))&IF(TYPE(VLOOKUP($A54,FB_13,2,0))=16,\"\",VLOOKUP($A54,FB_13,2,0))&IF(TYPE(VLOOKUP($A54,FB_14,2,0))=16,\"\",VLOOKUP($A54,FB_14,2,0))&IF(TYPE(VLOOKUP($A54,FB_15,2,0))=16,\"\",VLOOKUP($A54,FB_15,2,0))&IF(TYPE(VLOOKUP($A54,FB_16,2,0))=16,\"\",VLOOKUP($A54,FB_16,2,0))&IF(TYPE(VLOOKUP($A54,FB_17,2,0))=16,\"\",VLOOKUP($A54,FB_17,2,0))&IF(TYPE(VLOOKUP($A54,FB_18,2,0))=16,\"\",VLOOKUP($A54,FB_18,2,0))&IF(TYPE(VLOOKUP($A54,FB_19,2,0))=16,\"\",VLOOKUP($A54,FB_19,2,0))&IF(TYPE(VLOOKUP($A54,FB_20,2,0))=16,\"\",VLOOKUP($A54,FB_20,2,0))&IF(TYPE(VLOOKUP($A54,FB_21,2,0))=16,\"\",VLOOKUP($A54,FB_21,2,0))&IF(TYPE(VLOOKUP($A54,FB_22,2,0))=16,\"\",VLOOKUP($A54,FB_22,2,0))&IF(TYPE(VLOOKUP($A54,FB_23,2,0))=16,\"\",VLOOKUP($A54,FB_23,2,0))&IF(TYPE(VLOOKUP($A54,FB_24,2,0))=16,\"\",VLOOKUP($A54,FB_24,2,0))&IF(TYPE(VLOOKUP($A54,FB_25,2,0))=16,\"\",VLOOKUP($A54,FB_25,2,0))&IF(TYPE(VLOOKUP($A54,FB_26,2,0))=16,\"\",VLOOKUP($A54,FB_26,2,0))&IF(TYPE(VLOOKUP($A54,FB_27,2,0))=16,\"\",VLOOKUP($A54,FB_27,2,0))&IF(TYPE(VLOOKUP($A54,FB_28,2,0))=16,\"\",VLOOKUP($A54,FB_28,2,0))&IF(TYPE(VLOOKUP($A54,FB_29,2,0))=16,\"\",VLOOKUP($A54,FB_29,2,0))&IF(TYPE(VLOOKUP($A54,FB_30,2,0))=16,\"\",VLOOKUP($A54,FB_30,2,0))","v":""},null,{"$f":"IF($B54=\"\",\"\",_xlfn.NUMBERVALUE(IF(TYPE(VLOOKUP($A54,FB_1,P$5,0))=16,\"\",VLOOKUP($A54,FB_1,P$5,0))&IF(TYPE(VLOOKUP($A54,FB_2,P$5,0))=16,\"\",VLOOKUP($A54,FB_2,P$5,0))&IF(TYPE(VLOOKUP($A54,FB_3,P$5,0))=16,\"\",VLOOKUP($A54,FB_3,P$5,0))&IF(TYPE(VLOOKUP($A54,FB_4,P$5,0))=16,\"\",VLOOKUP($A54,FB_4,P$5,0))&IF(TYPE(VLOOKUP($A54,FB_5,P$5,0))=16,\"\",VLOOKUP($A54,FB_5,P$5,0))&IF(TYPE(VLOOKUP($A54,FB_6,P$5,0))=16,\"\",VLOOKUP($A54,FB_6,P$5,0))&IF(TYPE(VLOOKUP($A54,FB_7,P$5,0))=16,\"\",VLOOKUP($A54,FB_7,P$5,0))&IF(TYPE(VLOOKUP($A54,FB_8,P$5,0))=16,\"\",VLOOKUP($A54,FB_8,P$5,0))&IF(TYPE(VLOOKUP($A54,FB_9,P$5,0))=16,\"\",VLOOKUP($A54,FB_9,P$5,0))&IF(TYPE(VLOOKUP($A54,FB_10,P$5,0))=16,\"\",VLOOKUP($A54,FB_10,P$5,0))&IF(TYPE(VLOOKUP($A54,FB_11,P$5,0))=16,\"\",VLOOKUP($A54,FB_11,P$5,0))&IF(TYPE(VLOOKUP($A54,FB_12,P$5,0))=16,\"\",VLOOKUP($A54,FB_12,P$5,0))&IF(TYPE(VLOOKUP($A54,FB_13,P$5,0))=16,\"\",VLOOKUP($A54,FB_13,P$5,0))&IF(TYPE(VLOOKUP($A54,FB_14,P$5,0))=16,\"\",VLOOKUP($A54,FB_14,P$5,0))&IF(TYPE(VLOOKUP($A54,FB_15,P$5,0))=16,\"\",VLOOKUP($A54,FB_15,P$5,0))&IF(TYPE(VLOOKUP($A54,FB_16,P$5,0))=16,\"\",VLOOKUP($A54,FB_16,P$5,0))&IF(TYPE(VLOOKUP($A54,FB_17,P$5,0))=16,\"\",VLOOKUP($A54,FB_17,P$5,0))&IF(TYPE(VLOOKUP($A54,FB_18,P$5,0))=16,\"\",VLOOKUP($A54,FB_18,P$5,0))&IF(TYPE(VLOOKUP($A54,FB_19,P$5,0))=16,\"\",VLOOKUP($A54,FB_19,P$5,0))&IF(TYPE(VLOOKUP($A54,FB_20,P$5,0))=16,\"\",VLOOKUP($A54,FB_20,P$5,0))&IF(TYPE(VLOOKUP($A54,FB_21,P$5,0))=16,\"\",VLOOKUP($A54,FB_21,P$5,0))&IF(TYPE(VLOOKUP($A54,FB_22,P$5,0))=16,\"\",VLOOKUP($A54,FB_22,P$5,0))&IF(TYPE(VLOOKUP($A54,FB_23,P$5,0))=16,\"\",VLOOKUP($A54,FB_23,P$5,0))&IF(TYPE(VLOOKUP($A54,FB_24,P$5,0))=16,\"\",VLOOKUP($A54,FB_24,P$5,0))&IF(TYPE(VLOOKUP($A54,FB_25,P$5,0))=16,\"\",VLOOKUP($A54,FB_25,P$5,0))&IF(TYPE(VLOOKUP($A54,FB_26,P$5,0))=16,\"\",VLOOKUP($A54,FB_26,P$5,0))&IF(TYPE(VLOOKUP($A54,FB_27,P$5,0))=16,\"\",VLOOKUP($A54,FB_27,P$5,0))&IF(TYPE(VLOOKUP($A54,FB_28,P$5,0))=16,\"\",VLOOKUP($A54,FB_28,P$5,0))&IF(TYPE(VLOOKUP($A54,FB_29,P$5,0))=16,\"\",VLOOKUP($A54,FB_29,P$5,0))&IF(TYPE(VLOOKUP($A54,FB_30,P$5,0))=16,\"\",VLOOKUP($A54,FB_30,P$5,0))))","v":""},"",{"$f":"IF($B54=\"\",\"\",_xlfn.NUMBERVALUE(IF(TYPE(VLOOKUP($A54,FB_1,R$5,0))=16,\"\",VLOOKUP($A54,FB_1,R$5,0))&IF(TYPE(VLOOKUP($A54,FB_2,R$5,0))=16,\"\",VLOOKUP($A54,FB_2,R$5,0))&IF(TYPE(VLOOKUP($A54,FB_3,R$5,0))=16,\"\",VLOOKUP($A54,FB_3,R$5,0))&IF(TYPE(VLOOKUP($A54,FB_4,R$5,0))=16,\"\",VLOOKUP($A54,FB_4,R$5,0))&IF(TYPE(VLOOKUP($A54,FB_5,R$5,0))=16,\"\",VLOOKUP($A54,FB_5,R$5,0))&IF(TYPE(VLOOKUP($A54,FB_6,R$5,0))=16,\"\",VLOOKUP($A54,FB_6,R$5,0))&IF(TYPE(VLOOKUP($A54,FB_7,R$5,0))=16,\"\",VLOOKUP($A54,FB_7,R$5,0))&IF(TYPE(VLOOKUP($A54,FB_8,R$5,0))=16,\"\",VLOOKUP($A54,FB_8,R$5,0))&IF(TYPE(VLOOKUP($A54,FB_9,R$5,0))=16,\"\",VLOOKUP($A54,FB_9,R$5,0))&IF(TYPE(VLOOKUP($A54,FB_10,R$5,0))=16,\"\",VLOOKUP($A54,FB_10,R$5,0))&IF(TYPE(VLOOKUP($A54,FB_11,R$5,0))=16,\"\",VLOOKUP($A54,FB_11,R$5,0))&IF(TYPE(VLOOKUP($A54,FB_12,R$5,0))=16,\"\",VLOOKUP($A54,FB_12,R$5,0))&IF(TYPE(VLOOKUP($A54,FB_13,R$5,0))=16,\"\",VLOOKUP($A54,FB_13,R$5,0))&IF(TYPE(VLOOKUP($A54,FB_14,R$5,0))=16,\"\",VLOOKUP($A54,FB_14,R$5,0))&IF(TYPE(VLOOKUP($A54,FB_15,R$5,0))=16,\"\",VLOOKUP($A54,FB_15,R$5,0))&IF(TYPE(VLOOKUP($A54,FB_16,R$5,0))=16,\"\",VLOOKUP($A54,FB_16,R$5,0))&IF(TYPE(VLOOKUP($A54,FB_17,R$5,0))=16,\"\",VLOOKUP($A54,FB_17,R$5,0))&IF(TYPE(VLOOKUP($A54,FB_18,R$5,0))=16,\"\",VLOOKUP($A54,FB_18,R$5,0))&IF(TYPE(VLOOKUP($A54,FB_19,R$5,0))=16,\"\",VLOOKUP($A54,FB_19,R$5,0))&IF(TYPE(VLOOKUP($A54,FB_20,R$5,0))=16,\"\",VLOOKUP($A54,FB_20,R$5,0))&IF(TYPE(VLOOKUP($A54,FB_21,R$5,0))=16,\"\",VLOOKUP($A54,FB_21,R$5,0))&IF(TYPE(VLOOKUP($A54,FB_22,R$5,0))=16,\"\",VLOOKUP($A54,FB_22,R$5,0))&IF(TYPE(VLOOKUP($A54,FB_23,R$5,0))=16,\"\",VLOOKUP($A54,FB_23,R$5,0))&IF(TYPE(VLOOKUP($A54,FB_24,R$5,0))=16,\"\",VLOOKUP($A54,FB_24,R$5,0))&IF(TYPE(VLOOKUP($A54,FB_25,R$5,0))=16,\"\",VLOOKUP($A54,FB_25,R$5,0))&IF(TYPE(VLOOKUP($A54,FB_26,R$5,0))=16,\"\",VLOOKUP($A54,FB_26,R$5,0))&IF(TYPE(VLOOKUP($A54,FB_27,R$5,0))=16,\"\",VLOOKUP($A54,FB_27,R$5,0))&IF(TYPE(VLOOKUP($A54,FB_28,R$5,0))=16,\"\",VLOOKUP($A54,FB_28,R$5,0))&IF(TYPE(VLOOKUP($A54,FB_29,R$5,0))=16,\"\",VLOOKUP($A54,FB_29,R$5,0))&IF(TYPE(VLOOKUP($A54,FB_30,R$5,0))=16,\"\",VLOOKUP($A54,FB_30,R$5,0))))","v":""},{"$f":"IF($B54=\"\",\"\",IF(TYPE(VLOOKUP($A54,FB_1,S$5,0))=16,\"\",VLOOKUP($A54,FB_1,S$5,0))&IF(TYPE(VLOOKUP($A54,FB_2,S$5,0))=16,\"\",VLOOKUP($A54,FB_2,S$5,0))&IF(TYPE(VLOOKUP($A54,FB_3,S$5,0))=16,\"\",VLOOKUP($A54,FB_3,S$5,0))&IF(TYPE(VLOOKUP($A54,FB_4,S$5,0))=16,\"\",VLOOKUP($A54,FB_4,S$5,0))&IF(TYPE(VLOOKUP($A54,FB_5,S$5,0))=16,\"\",VLOOKUP($A54,FB_5,S$5,0))&IF(TYPE(VLOOKUP($A54,FB_6,S$5,0))=16,\"\",VLOOKUP($A54,FB_6,S$5,0))&IF(TYPE(VLOOKUP($A54,FB_7,S$5,0))=16,\"\",VLOOKUP($A54,FB_7,S$5,0))&IF(TYPE(VLOOKUP($A54,FB_8,S$5,0))=16,\"\",VLOOKUP($A54,FB_8,S$5,0))&IF(TYPE(VLOOKUP($A54,FB_9,S$5,0))=16,\"\",VLOOKUP($A54,FB_9,S$5,0))&IF(TYPE(VLOOKUP($A54,FB_10,S$5,0))=16,\"\",VLOOKUP($A54,FB_10,S$5,0))&IF(TYPE(VLOOKUP($A54,FB_11,S$5,0))=16,\"\",VLOOKUP($A54,FB_11,S$5,0))&IF(TYPE(VLOOKUP($A54,FB_12,S$5,0))=16,\"\",VLOOKUP($A54,FB_12,S$5,0))&IF(TYPE(VLOOKUP($A54,FB_13,S$5,0))=16,\"\",VLOOKUP($A54,FB_13,S$5,0))&IF(TYPE(VLOOKUP($A54,FB_14,S$5,0))=16,\"\",VLOOKUP($A54,FB_14,S$5,0))&IF(TYPE(VLOOKUP($A54,FB_15,S$5,0))=16,\"\",VLOOKUP($A54,FB_15,S$5,0))&IF(TYPE(VLOOKUP($A54,FB_16,S$5,0))=16,\"\",VLOOKUP($A54,FB_16,S$5,0))&IF(TYPE(VLOOKUP($A54,FB_17,S$5,0))=16,\"\",VLOOKUP($A54,FB_17,S$5,0))&IF(TYPE(VLOOKUP($A54,FB_18,S$5,0))=16,\"\",VLOOKUP($A54,FB_18,S$5,0))&IF(TYPE(VLOOKUP($A54,FB_19,S$5,0))=16,\"\",VLOOKUP($A54,FB_19,S$5,0))&IF(TYPE(VLOOKUP($A54,FB_20,S$5,0))=16,\"\",VLOOKUP($A54,FB_20,S$5,0))&IF(TYPE(VLOOKUP($A54,FB_21,S$5,0))=16,\"\",VLOOKUP($A54,FB_21,S$5,0))&IF(TYPE(VLOOKUP($A54,FB_22,S$5,0))=16,\"\",VLOOKUP($A54,FB_22,S$5,0))&IF(TYPE(VLOOKUP($A54,FB_23,S$5,0))=16,\"\",VLOOKUP($A54,FB_23,S$5,0))&IF(TYPE(VLOOKUP($A54,FB_24,S$5,0))=16,\"\",VLOOKUP($A54,FB_24,S$5,0))&IF(TYPE(VLOOKUP($A54,FB_25,S$5,0))=16,\"\",VLOOKUP($A54,FB_25,S$5,0))&IF(TYPE(VLOOKUP($A54,FB_26,S$5,0))=16,\"\",VLOOKUP($A54,FB_26,S$5,0))&IF(TYPE(VLOOKUP($A54,FB_27,S$5,0))=16,\"\",VLOOKUP($A54,FB_27,S$5,0))&IF(TYPE(VLOOKUP($A54,FB_28,S$5,0))=16,\"\",VLOOKUP($A54,FB_28,S$5,0))&IF(TYPE(VLOOKUP($A54,FB_29,S$5,0))=16,\"\",VLOOKUP($A54,FB_29,S$5,0))&IF(TYPE(VLOOKUP($A54,FB_30,S$5,0))=16,\"\",VLOOKUP($A54,FB_30,S$5,0)))","v":""},null,null,null,null,null,null,null,null,null,null,null,null,null,null,null,null,"",":","","",""]
["26.",{"$f":"IF(TYPE(VLOOKUP($A55,FB_1,2,0))=16,\"\",VLOOKUP($A55,FB_1,2,0))&IF(TYPE(VLOOKUP($A55,FB_2,2,0))=16,\"\",VLOOKUP($A55,FB_2,2,0))&IF(TYPE(VLOOKUP($A55,FB_3,2,0))=16,\"\",VLOOKUP($A55,FB_3,2,0))&IF(TYPE(VLOOKUP($A55,FB_4,2,0))=16,\"\",VLOOKUP($A55,FB_4,2,0))&IF(TYPE(VLOOKUP($A55,FB_5,2,0))=16,\"\",VLOOKUP($A55,FB_5,2,0))&IF(TYPE(VLOOKUP($A55,FB_6,2,0))=16,\"\",VLOOKUP($A55,FB_6,2,0))&IF(TYPE(VLOOKUP($A55,FB_7,2,0))=16,\"\",VLOOKUP($A55,FB_7,2,0))&IF(TYPE(VLOOKUP($A55,FB_8,2,0))=16,\"\",VLOOKUP($A55,FB_8,2,0))&IF(TYPE(VLOOKUP($A55,FB_9,2,0))=16,\"\",VLOOKUP($A55,FB_9,2,0))&IF(TYPE(VLOOKUP($A55,FB_10,2,0))=16,\"\",VLOOKUP($A55,FB_10,2,0))&IF(TYPE(VLOOKUP($A55,FB_11,2,0))=16,\"\",VLOOKUP($A55,FB_11,2,0))&IF(TYPE(VLOOKUP($A55,FB_12,2,0))=16,\"\",VLOOKUP($A55,FB_12,2,0))&IF(TYPE(VLOOKUP($A55,FB_13,2,0))=16,\"\",VLOOKUP($A55,FB_13,2,0))&IF(TYPE(VLOOKUP($A55,FB_14,2,0))=16,\"\",VLOOKUP($A55,FB_14,2,0))&IF(TYPE(VLOOKUP($A55,FB_15,2,0))=16,\"\",VLOOKUP($A55,FB_15,2,0))&IF(TYPE(VLOOKUP($A55,FB_16,2,0))=16,\"\",VLOOKUP($A55,FB_16,2,0))&IF(TYPE(VLOOKUP($A55,FB_17,2,0))=16,\"\",VLOOKUP($A55,FB_17,2,0))&IF(TYPE(VLOOKUP($A55,FB_18,2,0))=16,\"\",VLOOKUP($A55,FB_18,2,0))&IF(TYPE(VLOOKUP($A55,FB_19,2,0))=16,\"\",VLOOKUP($A55,FB_19,2,0))&IF(TYPE(VLOOKUP($A55,FB_20,2,0))=16,\"\",VLOOKUP($A55,FB_20,2,0))&IF(TYPE(VLOOKUP($A55,FB_21,2,0))=16,\"\",VLOOKUP($A55,FB_21,2,0))&IF(TYPE(VLOOKUP($A55,FB_22,2,0))=16,\"\",VLOOKUP($A55,FB_22,2,0))&IF(TYPE(VLOOKUP($A55,FB_23,2,0))=16,\"\",VLOOKUP($A55,FB_23,2,0))&IF(TYPE(VLOOKUP($A55,FB_24,2,0))=16,\"\",VLOOKUP($A55,FB_24,2,0))&IF(TYPE(VLOOKUP($A55,FB_25,2,0))=16,\"\",VLOOKUP($A55,FB_25,2,0))&IF(TYPE(VLOOKUP($A55,FB_26,2,0))=16,\"\",VLOOKUP($A55,FB_26,2,0))&IF(TYPE(VLOOKUP($A55,FB_27,2,0))=16,\"\",VLOOKUP($A55,FB_27,2,0))&IF(TYPE(VLOOKUP($A55,FB_28,2,0))=16,\"\",VLOOKUP($A55,FB_28,2,0))&IF(TYPE(VLOOKUP($A55,FB_29,2,0))=16,\"\",VLOOKUP($A55,FB_29,2,0))&IF(TYPE(VLOOKUP($A55,FB_30,2,0))=16,\"\",VLOOKUP($A55,FB_30,2,0))","v":""},null,{"$f":"IF($B55=\"\",\"\",_xlfn.NUMBERVALUE(IF(TYPE(VLOOKUP($A55,FB_1,P$5,0))=16,\"\",VLOOKUP($A55,FB_1,P$5,0))&IF(TYPE(VLOOKUP($A55,FB_2,P$5,0))=16,\"\",VLOOKUP($A55,FB_2,P$5,0))&IF(TYPE(VLOOKUP($A55,FB_3,P$5,0))=16,\"\",VLOOKUP($A55,FB_3,P$5,0))&IF(TYPE(VLOOKUP($A55,FB_4,P$5,0))=16,\"\",VLOOKUP($A55,FB_4,P$5,0))&IF(TYPE(VLOOKUP($A55,FB_5,P$5,0))=16,\"\",VLOOKUP($A55,FB_5,P$5,0))&IF(TYPE(VLOOKUP($A55,FB_6,P$5,0))=16,\"\",VLOOKUP($A55,FB_6,P$5,0))&IF(TYPE(VLOOKUP($A55,FB_7,P$5,0))=16,\"\",VLOOKUP($A55,FB_7,P$5,0))&IF(TYPE(VLOOKUP($A55,FB_8,P$5,0))=16,\"\",VLOOKUP($A55,FB_8,P$5,0))&IF(TYPE(VLOOKUP($A55,FB_9,P$5,0))=16,\"\",VLOOKUP($A55,FB_9,P$5,0))&IF(TYPE(VLOOKUP($A55,FB_10,P$5,0))=16,\"\",VLOOKUP($A55,FB_10,P$5,0))&IF(TYPE(VLOOKUP($A55,FB_11,P$5,0))=16,\"\",VLOOKUP($A55,FB_11,P$5,0))&IF(TYPE(VLOOKUP($A55,FB_12,P$5,0))=16,\"\",VLOOKUP($A55,FB_12,P$5,0))&IF(TYPE(VLOOKUP($A55,FB_13,P$5,0))=16,\"\",VLOOKUP($A55,FB_13,P$5,0))&IF(TYPE(VLOOKUP($A55,FB_14,P$5,0))=16,\"\",VLOOKUP($A55,FB_14,P$5,0))&IF(TYPE(VLOOKUP($A55,FB_15,P$5,0))=16,\"\",VLOOKUP($A55,FB_15,P$5,0))&IF(TYPE(VLOOKUP($A55,FB_16,P$5,0))=16,\"\",VLOOKUP($A55,FB_16,P$5,0))&IF(TYPE(VLOOKUP($A55,FB_17,P$5,0))=16,\"\",VLOOKUP($A55,FB_17,P$5,0))&IF(TYPE(VLOOKUP($A55,FB_18,P$5,0))=16,\"\",VLOOKUP($A55,FB_18,P$5,0))&IF(TYPE(VLOOKUP($A55,FB_19,P$5,0))=16,\"\",VLOOKUP($A55,FB_19,P$5,0))&IF(TYPE(VLOOKUP($A55,FB_20,P$5,0))=16,\"\",VLOOKUP($A55,FB_20,P$5,0))&IF(TYPE(VLOOKUP($A55,FB_21,P$5,0))=16,\"\",VLOOKUP($A55,FB_21,P$5,0))&IF(TYPE(VLOOKUP($A55,FB_22,P$5,0))=16,\"\",VLOOKUP($A55,FB_22,P$5,0))&IF(TYPE(VLOOKUP($A55,FB_23,P$5,0))=16,\"\",VLOOKUP($A55,FB_23,P$5,0))&IF(TYPE(VLOOKUP($A55,FB_24,P$5,0))=16,\"\",VLOOKUP($A55,FB_24,P$5,0))&IF(TYPE(VLOOKUP($A55,FB_25,P$5,0))=16,\"\",VLOOKUP($A55,FB_25,P$5,0))&IF(TYPE(VLOOKUP($A55,FB_26,P$5,0))=16,\"\",VLOOKUP($A55,FB_26,P$5,0))&IF(TYPE(VLOOKUP($A55,FB_27,P$5,0))=16,\"\",VLOOKUP($A55,FB_27,P$5,0))&IF(TYPE(VLOOKUP($A55,FB_28,P$5,0))=16,\"\",VLOOKUP($A55,FB_28,P$5,0))&IF(TYPE(VLOOKUP($A55,FB_29,P$5,0))=16,\"\",VLOOKUP($A55,FB_29,P$5,0))&IF(TYPE(VLOOKUP($A55,FB_30,P$5,0))=16,\"\",VLOOKUP($A55,FB_30,P$5,0))))","v":""},"",{"$f":"IF($B55=\"\",\"\",_xlfn.NUMBERVALUE(IF(TYPE(VLOOKUP($A55,FB_1,R$5,0))=16,\"\",VLOOKUP($A55,FB_1,R$5,0))&IF(TYPE(VLOOKUP($A55,FB_2,R$5,0))=16,\"\",VLOOKUP($A55,FB_2,R$5,0))&IF(TYPE(VLOOKUP($A55,FB_3,R$5,0))=16,\"\",VLOOKUP($A55,FB_3,R$5,0))&IF(TYPE(VLOOKUP($A55,FB_4,R$5,0))=16,\"\",VLOOKUP($A55,FB_4,R$5,0))&IF(TYPE(VLOOKUP($A55,FB_5,R$5,0))=16,\"\",VLOOKUP($A55,FB_5,R$5,0))&IF(TYPE(VLOOKUP($A55,FB_6,R$5,0))=16,\"\",VLOOKUP($A55,FB_6,R$5,0))&IF(TYPE(VLOOKUP($A55,FB_7,R$5,0))=16,\"\",VLOOKUP($A55,FB_7,R$5,0))&IF(TYPE(VLOOKUP($A55,FB_8,R$5,0))=16,\"\",VLOOKUP($A55,FB_8,R$5,0))&IF(TYPE(VLOOKUP($A55,FB_9,R$5,0))=16,\"\",VLOOKUP($A55,FB_9,R$5,0))&IF(TYPE(VLOOKUP($A55,FB_10,R$5,0))=16,\"\",VLOOKUP($A55,FB_10,R$5,0))&IF(TYPE(VLOOKUP($A55,FB_11,R$5,0))=16,\"\",VLOOKUP($A55,FB_11,R$5,0))&IF(TYPE(VLOOKUP($A55,FB_12,R$5,0))=16,\"\",VLOOKUP($A55,FB_12,R$5,0))&IF(TYPE(VLOOKUP($A55,FB_13,R$5,0))=16,\"\",VLOOKUP($A55,FB_13,R$5,0))&IF(TYPE(VLOOKUP($A55,FB_14,R$5,0))=16,\"\",VLOOKUP($A55,FB_14,R$5,0))&IF(TYPE(VLOOKUP($A55,FB_15,R$5,0))=16,\"\",VLOOKUP($A55,FB_15,R$5,0))&IF(TYPE(VLOOKUP($A55,FB_16,R$5,0))=16,\"\",VLOOKUP($A55,FB_16,R$5,0))&IF(TYPE(VLOOKUP($A55,FB_17,R$5,0))=16,\"\",VLOOKUP($A55,FB_17,R$5,0))&IF(TYPE(VLOOKUP($A55,FB_18,R$5,0))=16,\"\",VLOOKUP($A55,FB_18,R$5,0))&IF(TYPE(VLOOKUP($A55,FB_19,R$5,0))=16,\"\",VLOOKUP($A55,FB_19,R$5,0))&IF(TYPE(VLOOKUP($A55,FB_20,R$5,0))=16,\"\",VLOOKUP($A55,FB_20,R$5,0))&IF(TYPE(VLOOKUP($A55,FB_21,R$5,0))=16,\"\",VLOOKUP($A55,FB_21,R$5,0))&IF(TYPE(VLOOKUP($A55,FB_22,R$5,0))=16,\"\",VLOOKUP($A55,FB_22,R$5,0))&IF(TYPE(VLOOKUP($A55,FB_23,R$5,0))=16,\"\",VLOOKUP($A55,FB_23,R$5,0))&IF(TYPE(VLOOKUP($A55,FB_24,R$5,0))=16,\"\",VLOOKUP($A55,FB_24,R$5,0))&IF(TYPE(VLOOKUP($A55,FB_25,R$5,0))=16,\"\",VLOOKUP($A55,FB_25,R$5,0))&IF(TYPE(VLOOKUP($A55,FB_26,R$5,0))=16,\"\",VLOOKUP($A55,FB_26,R$5,0))&IF(TYPE(VLOOKUP($A55,FB_27,R$5,0))=16,\"\",VLOOKUP($A55,FB_27,R$5,0))&IF(TYPE(VLOOKUP($A55,FB_28,R$5,0))=16,\"\",VLOOKUP($A55,FB_28,R$5,0))&IF(TYPE(VLOOKUP($A55,FB_29,R$5,0))=16,\"\",VLOOKUP($A55,FB_29,R$5,0))&IF(TYPE(VLOOKUP($A55,FB_30,R$5,0))=16,\"\",VLOOKUP($A55,FB_30,R$5,0))))","v":""},{"$f":"IF($B55=\"\",\"\",IF(TYPE(VLOOKUP($A55,FB_1,S$5,0))=16,\"\",VLOOKUP($A55,FB_1,S$5,0))&IF(TYPE(VLOOKUP($A55,FB_2,S$5,0))=16,\"\",VLOOKUP($A55,FB_2,S$5,0))&IF(TYPE(VLOOKUP($A55,FB_3,S$5,0))=16,\"\",VLOOKUP($A55,FB_3,S$5,0))&IF(TYPE(VLOOKUP($A55,FB_4,S$5,0))=16,\"\",VLOOKUP($A55,FB_4,S$5,0))&IF(TYPE(VLOOKUP($A55,FB_5,S$5,0))=16,\"\",VLOOKUP($A55,FB_5,S$5,0))&IF(TYPE(VLOOKUP($A55,FB_6,S$5,0))=16,\"\",VLOOKUP($A55,FB_6,S$5,0))&IF(TYPE(VLOOKUP($A55,FB_7,S$5,0))=16,\"\",VLOOKUP($A55,FB_7,S$5,0))&IF(TYPE(VLOOKUP($A55,FB_8,S$5,0))=16,\"\",VLOOKUP($A55,FB_8,S$5,0))&IF(TYPE(VLOOKUP($A55,FB_9,S$5,0))=16,\"\",VLOOKUP($A55,FB_9,S$5,0))&IF(TYPE(VLOOKUP($A55,FB_10,S$5,0))=16,\"\",VLOOKUP($A55,FB_10,S$5,0))&IF(TYPE(VLOOKUP($A55,FB_11,S$5,0))=16,\"\",VLOOKUP($A55,FB_11,S$5,0))&IF(TYPE(VLOOKUP($A55,FB_12,S$5,0))=16,\"\",VLOOKUP($A55,FB_12,S$5,0))&IF(TYPE(VLOOKUP($A55,FB_13,S$5,0))=16,\"\",VLOOKUP($A55,FB_13,S$5,0))&IF(TYPE(VLOOKUP($A55,FB_14,S$5,0))=16,\"\",VLOOKUP($A55,FB_14,S$5,0))&IF(TYPE(VLOOKUP($A55,FB_15,S$5,0))=16,\"\",VLOOKUP($A55,FB_15,S$5,0))&IF(TYPE(VLOOKUP($A55,FB_16,S$5,0))=16,\"\",VLOOKUP($A55,FB_16,S$5,0))&IF(TYPE(VLOOKUP($A55,FB_17,S$5,0))=16,\"\",VLOOKUP($A55,FB_17,S$5,0))&IF(TYPE(VLOOKUP($A55,FB_18,S$5,0))=16,\"\",VLOOKUP($A55,FB_18,S$5,0))&IF(TYPE(VLOOKUP($A55,FB_19,S$5,0))=16,\"\",VLOOKUP($A55,FB_19,S$5,0))&IF(TYPE(VLOOKUP($A55,FB_20,S$5,0))=16,\"\",VLOOKUP($A55,FB_20,S$5,0))&IF(TYPE(VLOOKUP($A55,FB_21,S$5,0))=16,\"\",VLOOKUP($A55,FB_21,S$5,0))&IF(TYPE(VLOOKUP($A55,FB_22,S$5,0))=16,\"\",VLOOKUP($A55,FB_22,S$5,0))&IF(TYPE(VLOOKUP($A55,FB_23,S$5,0))=16,\"\",VLOOKUP($A55,FB_23,S$5,0))&IF(TYPE(VLOOKUP($A55,FB_24,S$5,0))=16,\"\",VLOOKUP($A55,FB_24,S$5,0))&IF(TYPE(VLOOKUP($A55,FB_25,S$5,0))=16,\"\",VLOOKUP($A55,FB_25,S$5,0))&IF(TYPE(VLOOKUP($A55,FB_26,S$5,0))=16,\"\",VLOOKUP($A55,FB_26,S$5,0))&IF(TYPE(VLOOKUP($A55,FB_27,S$5,0))=16,\"\",VLOOKUP($A55,FB_27,S$5,0))&IF(TYPE(VLOOKUP($A55,FB_28,S$5,0))=16,\"\",VLOOKUP($A55,FB_28,S$5,0))&IF(TYPE(VLOOKUP($A55,FB_29,S$5,0))=16,\"\",VLOOKUP($A55,FB_29,S$5,0))&IF(TYPE(VLOOKUP($A55,FB_30,S$5,0))=16,\"\",VLOOKUP($A55,FB_30,S$5,0)))","v":""},null,null,null,null,null,null,null,null,null,null,null,null,null,null,null,null,"",":","","",""]
["27.",{"$f":"IF(TYPE(VLOOKUP($A56,FB_1,2,0))=16,\"\",VLOOKUP($A56,FB_1,2,0))&IF(TYPE(VLOOKUP($A56,FB_2,2,0))=16,\"\",VLOOKUP($A56,FB_2,2,0))&IF(TYPE(VLOOKUP($A56,FB_3,2,0))=16,\"\",VLOOKUP($A56,FB_3,2,0))&IF(TYPE(VLOOKUP($A56,FB_4,2,0))=16,\"\",VLOOKUP($A56,FB_4,2,0))&IF(TYPE(VLOOKUP($A56,FB_5,2,0))=16,\"\",VLOOKUP($A56,FB_5,2,0))&IF(TYPE(VLOOKUP($A56,FB_6,2,0))=16,\"\",VLOOKUP($A56,FB_6,2,0))&IF(TYPE(VLOOKUP($A56,FB_7,2,0))=16,\"\",VLOOKUP($A56,FB_7,2,0))&IF(TYPE(VLOOKUP($A56,FB_8,2,0))=16,\"\",VLOOKUP($A56,FB_8,2,0))&IF(TYPE(VLOOKUP($A56,FB_9,2,0))=16,\"\",VLOOKUP($A56,FB_9,2,0))&IF(TYPE(VLOOKUP($A56,FB_10,2,0))=16,\"\",VLOOKUP($A56,FB_10,2,0))&IF(TYPE(VLOOKUP($A56,FB_11,2,0))=16,\"\",VLOOKUP($A56,FB_11,2,0))&IF(TYPE(VLOOKUP($A56,FB_12,2,0))=16,\"\",VLOOKUP($A56,FB_12,2,0))&IF(TYPE(VLOOKUP($A56,FB_13,2,0))=16,\"\",VLOOKUP($A56,FB_13,2,0))&IF(TYPE(VLOOKUP($A56,FB_14,2,0))=16,\"\",VLOOKUP($A56,FB_14,2,0))&IF(TYPE(VLOOKUP($A56,FB_15,2,0))=16,\"\",VLOOKUP($A56,FB_15,2,0))&IF(TYPE(VLOOKUP($A56,FB_16,2,0))=16,\"\",VLOOKUP($A56,FB_16,2,0))&IF(TYPE(VLOOKUP($A56,FB_17,2,0))=16,\"\",VLOOKUP($A56,FB_17,2,0))&IF(TYPE(VLOOKUP($A56,FB_18,2,0))=16,\"\",VLOOKUP($A56,FB_18,2,0))&IF(TYPE(VLOOKUP($A56,FB_19,2,0))=16,\"\",VLOOKUP($A56,FB_19,2,0))&IF(TYPE(VLOOKUP($A56,FB_20,2,0))=16,\"\",VLOOKUP($A56,FB_20,2,0))&IF(TYPE(VLOOKUP($A56,FB_21,2,0))=16,\"\",VLOOKUP($A56,FB_21,2,0))&IF(TYPE(VLOOKUP($A56,FB_22,2,0))=16,\"\",VLOOKUP($A56,FB_22,2,0))&IF(TYPE(VLOOKUP($A56,FB_23,2,0))=16,\"\",VLOOKUP($A56,FB_23,2,0))&IF(TYPE(VLOOKUP($A56,FB_24,2,0))=16,\"\",VLOOKUP($A56,FB_24,2,0))&IF(TYPE(VLOOKUP($A56,FB_25,2,0))=16,\"\",VLOOKUP($A56,FB_25,2,0))&IF(TYPE(VLOOKUP($A56,FB_26,2,0))=16,\"\",VLOOKUP($A56,FB_26,2,0))&IF(TYPE(VLOOKUP($A56,FB_27,2,0))=16,\"\",VLOOKUP($A56,FB_27,2,0))&IF(TYPE(VLOOKUP($A56,FB_28,2,0))=16,\"\",VLOOKUP($A56,FB_28,2,0))&IF(TYPE(VLOOKUP($A56,FB_29,2,0))=16,\"\",VLOOKUP($A56,FB_29,2,0))&IF(TYPE(VLOOKUP($A56,FB_30,2,0))=16,\"\",VLOOKUP($A56,FB_30,2,0))","v":""},null,{"$f":"IF($B56=\"\",\"\",_xlfn.NUMBERVALUE(IF(TYPE(VLOOKUP($A56,FB_1,P$5,0))=16,\"\",VLOOKUP($A56,FB_1,P$5,0))&IF(TYPE(VLOOKUP($A56,FB_2,P$5,0))=16,\"\",VLOOKUP($A56,FB_2,P$5,0))&IF(TYPE(VLOOKUP($A56,FB_3,P$5,0))=16,\"\",VLOOKUP($A56,FB_3,P$5,0))&IF(TYPE(VLOOKUP($A56,FB_4,P$5,0))=16,\"\",VLOOKUP($A56,FB_4,P$5,0))&IF(TYPE(VLOOKUP($A56,FB_5,P$5,0))=16,\"\",VLOOKUP($A56,FB_5,P$5,0))&IF(TYPE(VLOOKUP($A56,FB_6,P$5,0))=16,\"\",VLOOKUP($A56,FB_6,P$5,0))&IF(TYPE(VLOOKUP($A56,FB_7,P$5,0))=16,\"\",VLOOKUP($A56,FB_7,P$5,0))&IF(TYPE(VLOOKUP($A56,FB_8,P$5,0))=16,\"\",VLOOKUP($A56,FB_8,P$5,0))&IF(TYPE(VLOOKUP($A56,FB_9,P$5,0))=16,\"\",VLOOKUP($A56,FB_9,P$5,0))&IF(TYPE(VLOOKUP($A56,FB_10,P$5,0))=16,\"\",VLOOKUP($A56,FB_10,P$5,0))&IF(TYPE(VLOOKUP($A56,FB_11,P$5,0))=16,\"\",VLOOKUP($A56,FB_11,P$5,0))&IF(TYPE(VLOOKUP($A56,FB_12,P$5,0))=16,\"\",VLOOKUP($A56,FB_12,P$5,0))&IF(TYPE(VLOOKUP($A56,FB_13,P$5,0))=16,\"\",VLOOKUP($A56,FB_13,P$5,0))&IF(TYPE(VLOOKUP($A56,FB_14,P$5,0))=16,\"\",VLOOKUP($A56,FB_14,P$5,0))&IF(TYPE(VLOOKUP($A56,FB_15,P$5,0))=16,\"\",VLOOKUP($A56,FB_15,P$5,0))&IF(TYPE(VLOOKUP($A56,FB_16,P$5,0))=16,\"\",VLOOKUP($A56,FB_16,P$5,0))&IF(TYPE(VLOOKUP($A56,FB_17,P$5,0))=16,\"\",VLOOKUP($A56,FB_17,P$5,0))&IF(TYPE(VLOOKUP($A56,FB_18,P$5,0))=16,\"\",VLOOKUP($A56,FB_18,P$5,0))&IF(TYPE(VLOOKUP($A56,FB_19,P$5,0))=16,\"\",VLOOKUP($A56,FB_19,P$5,0))&IF(TYPE(VLOOKUP($A56,FB_20,P$5,0))=16,\"\",VLOOKUP($A56,FB_20,P$5,0))&IF(TYPE(VLOOKUP($A56,FB_21,P$5,0))=16,\"\",VLOOKUP($A56,FB_21,P$5,0))&IF(TYPE(VLOOKUP($A56,FB_22,P$5,0))=16,\"\",VLOOKUP($A56,FB_22,P$5,0))&IF(TYPE(VLOOKUP($A56,FB_23,P$5,0))=16,\"\",VLOOKUP($A56,FB_23,P$5,0))&IF(TYPE(VLOOKUP($A56,FB_24,P$5,0))=16,\"\",VLOOKUP($A56,FB_24,P$5,0))&IF(TYPE(VLOOKUP($A56,FB_25,P$5,0))=16,\"\",VLOOKUP($A56,FB_25,P$5,0))&IF(TYPE(VLOOKUP($A56,FB_26,P$5,0))=16,\"\",VLOOKUP($A56,FB_26,P$5,0))&IF(TYPE(VLOOKUP($A56,FB_27,P$5,0))=16,\"\",VLOOKUP($A56,FB_27,P$5,0))&IF(TYPE(VLOOKUP($A56,FB_28,P$5,0))=16,\"\",VLOOKUP($A56,FB_28,P$5,0))&IF(TYPE(VLOOKUP($A56,FB_29,P$5,0))=16,\"\",VLOOKUP($A56,FB_29,P$5,0))&IF(TYPE(VLOOKUP($A56,FB_30,P$5,0))=16,\"\",VLOOKUP($A56,FB_30,P$5,0))))","v":""},"",{"$f":"IF($B56=\"\",\"\",_xlfn.NUMBERVALUE(IF(TYPE(VLOOKUP($A56,FB_1,R$5,0))=16,\"\",VLOOKUP($A56,FB_1,R$5,0))&IF(TYPE(VLOOKUP($A56,FB_2,R$5,0))=16,\"\",VLOOKUP($A56,FB_2,R$5,0))&IF(TYPE(VLOOKUP($A56,FB_3,R$5,0))=16,\"\",VLOOKUP($A56,FB_3,R$5,0))&IF(TYPE(VLOOKUP($A56,FB_4,R$5,0))=16,\"\",VLOOKUP($A56,FB_4,R$5,0))&IF(TYPE(VLOOKUP($A56,FB_5,R$5,0))=16,\"\",VLOOKUP($A56,FB_5,R$5,0))&IF(TYPE(VLOOKUP($A56,FB_6,R$5,0))=16,\"\",VLOOKUP($A56,FB_6,R$5,0))&IF(TYPE(VLOOKUP($A56,FB_7,R$5,0))=16,\"\",VLOOKUP($A56,FB_7,R$5,0))&IF(TYPE(VLOOKUP($A56,FB_8,R$5,0))=16,\"\",VLOOKUP($A56,FB_8,R$5,0))&IF(TYPE(VLOOKUP($A56,FB_9,R$5,0))=16,\"\",VLOOKUP($A56,FB_9,R$5,0))&IF(TYPE(VLOOKUP($A56,FB_10,R$5,0))=16,\"\",VLOOKUP($A56,FB_10,R$5,0))&IF(TYPE(VLOOKUP($A56,FB_11,R$5,0))=16,\"\",VLOOKUP($A56,FB_11,R$5,0))&IF(TYPE(VLOOKUP($A56,FB_12,R$5,0))=16,\"\",VLOOKUP($A56,FB_12,R$5,0))&IF(TYPE(VLOOKUP($A56,FB_13,R$5,0))=16,\"\",VLOOKUP($A56,FB_13,R$5,0))&IF(TYPE(VLOOKUP($A56,FB_14,R$5,0))=16,\"\",VLOOKUP($A56,FB_14,R$5,0))&IF(TYPE(VLOOKUP($A56,FB_15,R$5,0))=16,\"\",VLOOKUP($A56,FB_15,R$5,0))&IF(TYPE(VLOOKUP($A56,FB_16,R$5,0))=16,\"\",VLOOKUP($A56,FB_16,R$5,0))&IF(TYPE(VLOOKUP($A56,FB_17,R$5,0))=16,\"\",VLOOKUP($A56,FB_17,R$5,0))&IF(TYPE(VLOOKUP($A56,FB_18,R$5,0))=16,\"\",VLOOKUP($A56,FB_18,R$5,0))&IF(TYPE(VLOOKUP($A56,FB_19,R$5,0))=16,\"\",VLOOKUP($A56,FB_19,R$5,0))&IF(TYPE(VLOOKUP($A56,FB_20,R$5,0))=16,\"\",VLOOKUP($A56,FB_20,R$5,0))&IF(TYPE(VLOOKUP($A56,FB_21,R$5,0))=16,\"\",VLOOKUP($A56,FB_21,R$5,0))&IF(TYPE(VLOOKUP($A56,FB_22,R$5,0))=16,\"\",VLOOKUP($A56,FB_22,R$5,0))&IF(TYPE(VLOOKUP($A56,FB_23,R$5,0))=16,\"\",VLOOKUP($A56,FB_23,R$5,0))&IF(TYPE(VLOOKUP($A56,FB_24,R$5,0))=16,\"\",VLOOKUP($A56,FB_24,R$5,0))&IF(TYPE(VLOOKUP($A56,FB_25,R$5,0))=16,\"\",VLOOKUP($A56,FB_25,R$5,0))&IF(TYPE(VLOOKUP($A56,FB_26,R$5,0))=16,\"\",VLOOKUP($A56,FB_26,R$5,0))&IF(TYPE(VLOOKUP($A56,FB_27,R$5,0))=16,\"\",VLOOKUP($A56,FB_27,R$5,0))&IF(TYPE(VLOOKUP($A56,FB_28,R$5,0))=16,\"\",VLOOKUP($A56,FB_28,R$5,0))&IF(TYPE(VLOOKUP($A56,FB_29,R$5,0))=16,\"\",VLOOKUP($A56,FB_29,R$5,0))&IF(TYPE(VLOOKUP($A56,FB_30,R$5,0))=16,\"\",VLOOKUP($A56,FB_30,R$5,0))))","v":""},{"$f":"IF($B56=\"\",\"\",IF(TYPE(VLOOKUP($A56,FB_1,S$5,0))=16,\"\",VLOOKUP($A56,FB_1,S$5,0))&IF(TYPE(VLOOKUP($A56,FB_2,S$5,0))=16,\"\",VLOOKUP($A56,FB_2,S$5,0))&IF(TYPE(VLOOKUP($A56,FB_3,S$5,0))=16,\"\",VLOOKUP($A56,FB_3,S$5,0))&IF(TYPE(VLOOKUP($A56,FB_4,S$5,0))=16,\"\",VLOOKUP($A56,FB_4,S$5,0))&IF(TYPE(VLOOKUP($A56,FB_5,S$5,0))=16,\"\",VLOOKUP($A56,FB_5,S$5,0))&IF(TYPE(VLOOKUP($A56,FB_6,S$5,0))=16,\"\",VLOOKUP($A56,FB_6,S$5,0))&IF(TYPE(VLOOKUP($A56,FB_7,S$5,0))=16,\"\",VLOOKUP($A56,FB_7,S$5,0))&IF(TYPE(VLOOKUP($A56,FB_8,S$5,0))=16,\"\",VLOOKUP($A56,FB_8,S$5,0))&IF(TYPE(VLOOKUP($A56,FB_9,S$5,0))=16,\"\",VLOOKUP($A56,FB_9,S$5,0))&IF(TYPE(VLOOKUP($A56,FB_10,S$5,0))=16,\"\",VLOOKUP($A56,FB_10,S$5,0))&IF(TYPE(VLOOKUP($A56,FB_11,S$5,0))=16,\"\",VLOOKUP($A56,FB_11,S$5,0))&IF(TYPE(VLOOKUP($A56,FB_12,S$5,0))=16,\"\",VLOOKUP($A56,FB_12,S$5,0))&IF(TYPE(VLOOKUP($A56,FB_13,S$5,0))=16,\"\",VLOOKUP($A56,FB_13,S$5,0))&IF(TYPE(VLOOKUP($A56,FB_14,S$5,0))=16,\"\",VLOOKUP($A56,FB_14,S$5,0))&IF(TYPE(VLOOKUP($A56,FB_15,S$5,0))=16,\"\",VLOOKUP($A56,FB_15,S$5,0))&IF(TYPE(VLOOKUP($A56,FB_16,S$5,0))=16,\"\",VLOOKUP($A56,FB_16,S$5,0))&IF(TYPE(VLOOKUP($A56,FB_17,S$5,0))=16,\"\",VLOOKUP($A56,FB_17,S$5,0))&IF(TYPE(VLOOKUP($A56,FB_18,S$5,0))=16,\"\",VLOOKUP($A56,FB_18,S$5,0))&IF(TYPE(VLOOKUP($A56,FB_19,S$5,0))=16,\"\",VLOOKUP($A56,FB_19,S$5,0))&IF(TYPE(VLOOKUP($A56,FB_20,S$5,0))=16,\"\",VLOOKUP($A56,FB_20,S$5,0))&IF(TYPE(VLOOKUP($A56,FB_21,S$5,0))=16,\"\",VLOOKUP($A56,FB_21,S$5,0))&IF(TYPE(VLOOKUP($A56,FB_22,S$5,0))=16,\"\",VLOOKUP($A56,FB_22,S$5,0))&IF(TYPE(VLOOKUP($A56,FB_23,S$5,0))=16,\"\",VLOOKUP($A56,FB_23,S$5,0))&IF(TYPE(VLOOKUP($A56,FB_24,S$5,0))=16,\"\",VLOOKUP($A56,FB_24,S$5,0))&IF(TYPE(VLOOKUP($A56,FB_25,S$5,0))=16,\"\",VLOOKUP($A56,FB_25,S$5,0))&IF(TYPE(VLOOKUP($A56,FB_26,S$5,0))=16,\"\",VLOOKUP($A56,FB_26,S$5,0))&IF(TYPE(VLOOKUP($A56,FB_27,S$5,0))=16,\"\",VLOOKUP($A56,FB_27,S$5,0))&IF(TYPE(VLOOKUP($A56,FB_28,S$5,0))=16,\"\",VLOOKUP($A56,FB_28,S$5,0))&IF(TYPE(VLOOKUP($A56,FB_29,S$5,0))=16,\"\",VLOOKUP($A56,FB_29,S$5,0))&IF(TYPE(VLOOKUP($A56,FB_30,S$5,0))=16,\"\",VLOOKUP($A56,FB_30,S$5,0)))","v":""},null,null,null,null,null,null,null,null,null,null,null,null,null,null,null,null,"",":","","",""]
["28.",{"$f":"IF(TYPE(VLOOKUP($A57,FB_1,2,0))=16,\"\",VLOOKUP($A57,FB_1,2,0))&IF(TYPE(VLOOKUP($A57,FB_2,2,0))=16,\"\",VLOOKUP($A57,FB_2,2,0))&IF(TYPE(VLOOKUP($A57,FB_3,2,0))=16,\"\",VLOOKUP($A57,FB_3,2,0))&IF(TYPE(VLOOKUP($A57,FB_4,2,0))=16,\"\",VLOOKUP($A57,FB_4,2,0))&IF(TYPE(VLOOKUP($A57,FB_5,2,0))=16,\"\",VLOOKUP($A57,FB_5,2,0))&IF(TYPE(VLOOKUP($A57,FB_6,2,0))=16,\"\",VLOOKUP($A57,FB_6,2,0))&IF(TYPE(VLOOKUP($A57,FB_7,2,0))=16,\"\",VLOOKUP($A57,FB_7,2,0))&IF(TYPE(VLOOKUP($A57,FB_8,2,0))=16,\"\",VLOOKUP($A57,FB_8,2,0))&IF(TYPE(VLOOKUP($A57,FB_9,2,0))=16,\"\",VLOOKUP($A57,FB_9,2,0))&IF(TYPE(VLOOKUP($A57,FB_10,2,0))=16,\"\",VLOOKUP($A57,FB_10,2,0))&IF(TYPE(VLOOKUP($A57,FB_11,2,0))=16,\"\",VLOOKUP($A57,FB_11,2,0))&IF(TYPE(VLOOKUP($A57,FB_12,2,0))=16,\"\",VLOOKUP($A57,FB_12,2,0))&IF(TYPE(VLOOKUP($A57,FB_13,2,0))=16,\"\",VLOOKUP($A57,FB_13,2,0))&IF(TYPE(VLOOKUP($A57,FB_14,2,0))=16,\"\",VLOOKUP($A57,FB_14,2,0))&IF(TYPE(VLOOKUP($A57,FB_15,2,0))=16,\"\",VLOOKUP($A57,FB_15,2,0))&IF(TYPE(VLOOKUP($A57,FB_16,2,0))=16,\"\",VLOOKUP($A57,FB_16,2,0))&IF(TYPE(VLOOKUP($A57,FB_17,2,0))=16,\"\",VLOOKUP($A57,FB_17,2,0))&IF(TYPE(VLOOKUP($A57,FB_18,2,0))=16,\"\",VLOOKUP($A57,FB_18,2,0))&IF(TYPE(VLOOKUP($A57,FB_19,2,0))=16,\"\",VLOOKUP($A57,FB_19,2,0))&IF(TYPE(VLOOKUP($A57,FB_20,2,0))=16,\"\",VLOOKUP($A57,FB_20,2,0))&IF(TYPE(VLOOKUP($A57,FB_21,2,0))=16,\"\",VLOOKUP($A57,FB_21,2,0))&IF(TYPE(VLOOKUP($A57,FB_22,2,0))=16,\"\",VLOOKUP($A57,FB_22,2,0))&IF(TYPE(VLOOKUP($A57,FB_23,2,0))=16,\"\",VLOOKUP($A57,FB_23,2,0))&IF(TYPE(VLOOKUP($A57,FB_24,2,0))=16,\"\",VLOOKUP($A57,FB_24,2,0))&IF(TYPE(VLOOKUP($A57,FB_25,2,0))=16,\"\",VLOOKUP($A57,FB_25,2,0))&IF(TYPE(VLOOKUP($A57,FB_26,2,0))=16,\"\",VLOOKUP($A57,FB_26,2,0))&IF(TYPE(VLOOKUP($A57,FB_27,2,0))=16,\"\",VLOOKUP($A57,FB_27,2,0))&IF(TYPE(VLOOKUP($A57,FB_28,2,0))=16,\"\",VLOOKUP($A57,FB_28,2,0))&IF(TYPE(VLOOKUP($A57,FB_29,2,0))=16,\"\",VLOOKUP($A57,FB_29,2,0))&IF(TYPE(VLOOKUP($A57,FB_30,2,0))=16,\"\",VLOOKUP($A57,FB_30,2,0))","v":""},null,{"$f":"IF($B57=\"\",\"\",_xlfn.NUMBERVALUE(IF(TYPE(VLOOKUP($A57,FB_1,P$5,0))=16,\"\",VLOOKUP($A57,FB_1,P$5,0))&IF(TYPE(VLOOKUP($A57,FB_2,P$5,0))=16,\"\",VLOOKUP($A57,FB_2,P$5,0))&IF(TYPE(VLOOKUP($A57,FB_3,P$5,0))=16,\"\",VLOOKUP($A57,FB_3,P$5,0))&IF(TYPE(VLOOKUP($A57,FB_4,P$5,0))=16,\"\",VLOOKUP($A57,FB_4,P$5,0))&IF(TYPE(VLOOKUP($A57,FB_5,P$5,0))=16,\"\",VLOOKUP($A57,FB_5,P$5,0))&IF(TYPE(VLOOKUP($A57,FB_6,P$5,0))=16,\"\",VLOOKUP($A57,FB_6,P$5,0))&IF(TYPE(VLOOKUP($A57,FB_7,P$5,0))=16,\"\",VLOOKUP($A57,FB_7,P$5,0))&IF(TYPE(VLOOKUP($A57,FB_8,P$5,0))=16,\"\",VLOOKUP($A57,FB_8,P$5,0))&IF(TYPE(VLOOKUP($A57,FB_9,P$5,0))=16,\"\",VLOOKUP($A57,FB_9,P$5,0))&IF(TYPE(VLOOKUP($A57,FB_10,P$5,0))=16,\"\",VLOOKUP($A57,FB_10,P$5,0))&IF(TYPE(VLOOKUP($A57,FB_11,P$5,0))=16,\"\",VLOOKUP($A57,FB_11,P$5,0))&IF(TYPE(VLOOKUP($A57,FB_12,P$5,0))=16,\"\",VLOOKUP($A57,FB_12,P$5,0))&IF(TYPE(VLOOKUP($A57,FB_13,P$5,0))=16,\"\",VLOOKUP($A57,FB_13,P$5,0))&IF(TYPE(VLOOKUP($A57,FB_14,P$5,0))=16,\"\",VLOOKUP($A57,FB_14,P$5,0))&IF(TYPE(VLOOKUP($A57,FB_15,P$5,0))=16,\"\",VLOOKUP($A57,FB_15,P$5,0))&IF(TYPE(VLOOKUP($A57,FB_16,P$5,0))=16,\"\",VLOOKUP($A57,FB_16,P$5,0))&IF(TYPE(VLOOKUP($A57,FB_17,P$5,0))=16,\"\",VLOOKUP($A57,FB_17,P$5,0))&IF(TYPE(VLOOKUP($A57,FB_18,P$5,0))=16,\"\",VLOOKUP($A57,FB_18,P$5,0))&IF(TYPE(VLOOKUP($A57,FB_19,P$5,0))=16,\"\",VLOOKUP($A57,FB_19,P$5,0))&IF(TYPE(VLOOKUP($A57,FB_20,P$5,0))=16,\"\",VLOOKUP($A57,FB_20,P$5,0))&IF(TYPE(VLOOKUP($A57,FB_21,P$5,0))=16,\"\",VLOOKUP($A57,FB_21,P$5,0))&IF(TYPE(VLOOKUP($A57,FB_22,P$5,0))=16,\"\",VLOOKUP($A57,FB_22,P$5,0))&IF(TYPE(VLOOKUP($A57,FB_23,P$5,0))=16,\"\",VLOOKUP($A57,FB_23,P$5,0))&IF(TYPE(VLOOKUP($A57,FB_24,P$5,0))=16,\"\",VLOOKUP($A57,FB_24,P$5,0))&IF(TYPE(VLOOKUP($A57,FB_25,P$5,0))=16,\"\",VLOOKUP($A57,FB_25,P$5,0))&IF(TYPE(VLOOKUP($A57,FB_26,P$5,0))=16,\"\",VLOOKUP($A57,FB_26,P$5,0))&IF(TYPE(VLOOKUP($A57,FB_27,P$5,0))=16,\"\",VLOOKUP($A57,FB_27,P$5,0))&IF(TYPE(VLOOKUP($A57,FB_28,P$5,0))=16,\"\",VLOOKUP($A57,FB_28,P$5,0))&IF(TYPE(VLOOKUP($A57,FB_29,P$5,0))=16,\"\",VLOOKUP($A57,FB_29,P$5,0))&IF(TYPE(VLOOKUP($A57,FB_30,P$5,0))=16,\"\",VLOOKUP($A57,FB_30,P$5,0))))","v":""},"",{"$f":"IF($B57=\"\",\"\",_xlfn.NUMBERVALUE(IF(TYPE(VLOOKUP($A57,FB_1,R$5,0))=16,\"\",VLOOKUP($A57,FB_1,R$5,0))&IF(TYPE(VLOOKUP($A57,FB_2,R$5,0))=16,\"\",VLOOKUP($A57,FB_2,R$5,0))&IF(TYPE(VLOOKUP($A57,FB_3,R$5,0))=16,\"\",VLOOKUP($A57,FB_3,R$5,0))&IF(TYPE(VLOOKUP($A57,FB_4,R$5,0))=16,\"\",VLOOKUP($A57,FB_4,R$5,0))&IF(TYPE(VLOOKUP($A57,FB_5,R$5,0))=16,\"\",VLOOKUP($A57,FB_5,R$5,0))&IF(TYPE(VLOOKUP($A57,FB_6,R$5,0))=16,\"\",VLOOKUP($A57,FB_6,R$5,0))&IF(TYPE(VLOOKUP($A57,FB_7,R$5,0))=16,\"\",VLOOKUP($A57,FB_7,R$5,0))&IF(TYPE(VLOOKUP($A57,FB_8,R$5,0))=16,\"\",VLOOKUP($A57,FB_8,R$5,0))&IF(TYPE(VLOOKUP($A57,FB_9,R$5,0))=16,\"\",VLOOKUP($A57,FB_9,R$5,0))&IF(TYPE(VLOOKUP($A57,FB_10,R$5,0))=16,\"\",VLOOKUP($A57,FB_10,R$5,0))&IF(TYPE(VLOOKUP($A57,FB_11,R$5,0))=16,\"\",VLOOKUP($A57,FB_11,R$5,0))&IF(TYPE(VLOOKUP($A57,FB_12,R$5,0))=16,\"\",VLOOKUP($A57,FB_12,R$5,0))&IF(TYPE(VLOOKUP($A57,FB_13,R$5,0))=16,\"\",VLOOKUP($A57,FB_13,R$5,0))&IF(TYPE(VLOOKUP($A57,FB_14,R$5,0))=16,\"\",VLOOKUP($A57,FB_14,R$5,0))&IF(TYPE(VLOOKUP($A57,FB_15,R$5,0))=16,\"\",VLOOKUP($A57,FB_15,R$5,0))&IF(TYPE(VLOOKUP($A57,FB_16,R$5,0))=16,\"\",VLOOKUP($A57,FB_16,R$5,0))&IF(TYPE(VLOOKUP($A57,FB_17,R$5,0))=16,\"\",VLOOKUP($A57,FB_17,R$5,0))&IF(TYPE(VLOOKUP($A57,FB_18,R$5,0))=16,\"\",VLOOKUP($A57,FB_18,R$5,0))&IF(TYPE(VLOOKUP($A57,FB_19,R$5,0))=16,\"\",VLOOKUP($A57,FB_19,R$5,0))&IF(TYPE(VLOOKUP($A57,FB_20,R$5,0))=16,\"\",VLOOKUP($A57,FB_20,R$5,0))&IF(TYPE(VLOOKUP($A57,FB_21,R$5,0))=16,\"\",VLOOKUP($A57,FB_21,R$5,0))&IF(TYPE(VLOOKUP($A57,FB_22,R$5,0))=16,\"\",VLOOKUP($A57,FB_22,R$5,0))&IF(TYPE(VLOOKUP($A57,FB_23,R$5,0))=16,\"\",VLOOKUP($A57,FB_23,R$5,0))&IF(TYPE(VLOOKUP($A57,FB_24,R$5,0))=16,\"\",VLOOKUP($A57,FB_24,R$5,0))&IF(TYPE(VLOOKUP($A57,FB_25,R$5,0))=16,\"\",VLOOKUP($A57,FB_25,R$5,0))&IF(TYPE(VLOOKUP($A57,FB_26,R$5,0))=16,\"\",VLOOKUP($A57,FB_26,R$5,0))&IF(TYPE(VLOOKUP($A57,FB_27,R$5,0))=16,\"\",VLOOKUP($A57,FB_27,R$5,0))&IF(TYPE(VLOOKUP($A57,FB_28,R$5,0))=16,\"\",VLOOKUP($A57,FB_28,R$5,0))&IF(TYPE(VLOOKUP($A57,FB_29,R$5,0))=16,\"\",VLOOKUP($A57,FB_29,R$5,0))&IF(TYPE(VLOOKUP($A57,FB_30,R$5,0))=16,\"\",VLOOKUP($A57,FB_30,R$5,0))))","v":""},{"$f":"IF($B57=\"\",\"\",IF(TYPE(VLOOKUP($A57,FB_1,S$5,0))=16,\"\",VLOOKUP($A57,FB_1,S$5,0))&IF(TYPE(VLOOKUP($A57,FB_2,S$5,0))=16,\"\",VLOOKUP($A57,FB_2,S$5,0))&IF(TYPE(VLOOKUP($A57,FB_3,S$5,0))=16,\"\",VLOOKUP($A57,FB_3,S$5,0))&IF(TYPE(VLOOKUP($A57,FB_4,S$5,0))=16,\"\",VLOOKUP($A57,FB_4,S$5,0))&IF(TYPE(VLOOKUP($A57,FB_5,S$5,0))=16,\"\",VLOOKUP($A57,FB_5,S$5,0))&IF(TYPE(VLOOKUP($A57,FB_6,S$5,0))=16,\"\",VLOOKUP($A57,FB_6,S$5,0))&IF(TYPE(VLOOKUP($A57,FB_7,S$5,0))=16,\"\",VLOOKUP($A57,FB_7,S$5,0))&IF(TYPE(VLOOKUP($A57,FB_8,S$5,0))=16,\"\",VLOOKUP($A57,FB_8,S$5,0))&IF(TYPE(VLOOKUP($A57,FB_9,S$5,0))=16,\"\",VLOOKUP($A57,FB_9,S$5,0))&IF(TYPE(VLOOKUP($A57,FB_10,S$5,0))=16,\"\",VLOOKUP($A57,FB_10,S$5,0))&IF(TYPE(VLOOKUP($A57,FB_11,S$5,0))=16,\"\",VLOOKUP($A57,FB_11,S$5,0))&IF(TYPE(VLOOKUP($A57,FB_12,S$5,0))=16,\"\",VLOOKUP($A57,FB_12,S$5,0))&IF(TYPE(VLOOKUP($A57,FB_13,S$5,0))=16,\"\",VLOOKUP($A57,FB_13,S$5,0))&IF(TYPE(VLOOKUP($A57,FB_14,S$5,0))=16,\"\",VLOOKUP($A57,FB_14,S$5,0))&IF(TYPE(VLOOKUP($A57,FB_15,S$5,0))=16,\"\",VLOOKUP($A57,FB_15,S$5,0))&IF(TYPE(VLOOKUP($A57,FB_16,S$5,0))=16,\"\",VLOOKUP($A57,FB_16,S$5,0))&IF(TYPE(VLOOKUP($A57,FB_17,S$5,0))=16,\"\",VLOOKUP($A57,FB_17,S$5,0))&IF(TYPE(VLOOKUP($A57,FB_18,S$5,0))=16,\"\",VLOOKUP($A57,FB_18,S$5,0))&IF(TYPE(VLOOKUP($A57,FB_19,S$5,0))=16,\"\",VLOOKUP($A57,FB_19,S$5,0))&IF(TYPE(VLOOKUP($A57,FB_20,S$5,0))=16,\"\",VLOOKUP($A57,FB_20,S$5,0))&IF(TYPE(VLOOKUP($A57,FB_21,S$5,0))=16,\"\",VLOOKUP($A57,FB_21,S$5,0))&IF(TYPE(VLOOKUP($A57,FB_22,S$5,0))=16,\"\",VLOOKUP($A57,FB_22,S$5,0))&IF(TYPE(VLOOKUP($A57,FB_23,S$5,0))=16,\"\",VLOOKUP($A57,FB_23,S$5,0))&IF(TYPE(VLOOKUP($A57,FB_24,S$5,0))=16,\"\",VLOOKUP($A57,FB_24,S$5,0))&IF(TYPE(VLOOKUP($A57,FB_25,S$5,0))=16,\"\",VLOOKUP($A57,FB_25,S$5,0))&IF(TYPE(VLOOKUP($A57,FB_26,S$5,0))=16,\"\",VLOOKUP($A57,FB_26,S$5,0))&IF(TYPE(VLOOKUP($A57,FB_27,S$5,0))=16,\"\",VLOOKUP($A57,FB_27,S$5,0))&IF(TYPE(VLOOKUP($A57,FB_28,S$5,0))=16,\"\",VLOOKUP($A57,FB_28,S$5,0))&IF(TYPE(VLOOKUP($A57,FB_29,S$5,0))=16,\"\",VLOOKUP($A57,FB_29,S$5,0))&IF(TYPE(VLOOKUP($A57,FB_30,S$5,0))=16,\"\",VLOOKUP($A57,FB_30,S$5,0)))","v":""},null,null,null,null,null,null,null,null,null,null,null,null,null,null,null,null,"",":","","",""]
["29.",{"$f":"IF(TYPE(VLOOKUP($A58,FB_1,2,0))=16,\"\",VLOOKUP($A58,FB_1,2,0))&IF(TYPE(VLOOKUP($A58,FB_2,2,0))=16,\"\",VLOOKUP($A58,FB_2,2,0))&IF(TYPE(VLOOKUP($A58,FB_3,2,0))=16,\"\",VLOOKUP($A58,FB_3,2,0))&IF(TYPE(VLOOKUP($A58,FB_4,2,0))=16,\"\",VLOOKUP($A58,FB_4,2,0))&IF(TYPE(VLOOKUP($A58,FB_5,2,0))=16,\"\",VLOOKUP($A58,FB_5,2,0))&IF(TYPE(VLOOKUP($A58,FB_6,2,0))=16,\"\",VLOOKUP($A58,FB_6,2,0))&IF(TYPE(VLOOKUP($A58,FB_7,2,0))=16,\"\",VLOOKUP($A58,FB_7,2,0))&IF(TYPE(VLOOKUP($A58,FB_8,2,0))=16,\"\",VLOOKUP($A58,FB_8,2,0))&IF(TYPE(VLOOKUP($A58,FB_9,2,0))=16,\"\",VLOOKUP($A58,FB_9,2,0))&IF(TYPE(VLOOKUP($A58,FB_10,2,0))=16,\"\",VLOOKUP($A58,FB_10,2,0))&IF(TYPE(VLOOKUP($A58,FB_11,2,0))=16,\"\",VLOOKUP($A58,FB_11,2,0))&IF(TYPE(VLOOKUP($A58,FB_12,2,0))=16,\"\",VLOOKUP($A58,FB_12,2,0))&IF(TYPE(VLOOKUP($A58,FB_13,2,0))=16,\"\",VLOOKUP($A58,FB_13,2,0))&IF(TYPE(VLOOKUP($A58,FB_14,2,0))=16,\"\",VLOOKUP($A58,FB_14,2,0))&IF(TYPE(VLOOKUP($A58,FB_15,2,0))=16,\"\",VLOOKUP($A58,FB_15,2,0))&IF(TYPE(VLOOKUP($A58,FB_16,2,0))=16,\"\",VLOOKUP($A58,FB_16,2,0))&IF(TYPE(VLOOKUP($A58,FB_17,2,0))=16,\"\",VLOOKUP($A58,FB_17,2,0))&IF(TYPE(VLOOKUP($A58,FB_18,2,0))=16,\"\",VLOOKUP($A58,FB_18,2,0))&IF(TYPE(VLOOKUP($A58,FB_19,2,0))=16,\"\",VLOOKUP($A58,FB_19,2,0))&IF(TYPE(VLOOKUP($A58,FB_20,2,0))=16,\"\",VLOOKUP($A58,FB_20,2,0))&IF(TYPE(VLOOKUP($A58,FB_21,2,0))=16,\"\",VLOOKUP($A58,FB_21,2,0))&IF(TYPE(VLOOKUP($A58,FB_22,2,0))=16,\"\",VLOOKUP($A58,FB_22,2,0))&IF(TYPE(VLOOKUP($A58,FB_23,2,0))=16,\"\",VLOOKUP($A58,FB_23,2,0))&IF(TYPE(VLOOKUP($A58,FB_24,2,0))=16,\"\",VLOOKUP($A58,FB_24,2,0))&IF(TYPE(VLOOKUP($A58,FB_25,2,0))=16,\"\",VLOOKUP($A58,FB_25,2,0))&IF(TYPE(VLOOKUP($A58,FB_26,2,0))=16,\"\",VLOOKUP($A58,FB_26,2,0))&IF(TYPE(VLOOKUP($A58,FB_27,2,0))=16,\"\",VLOOKUP($A58,FB_27,2,0))&IF(TYPE(VLOOKUP($A58,FB_28,2,0))=16,\"\",VLOOKUP($A58,FB_28,2,0))&IF(TYPE(VLOOKUP($A58,FB_29,2,0))=16,\"\",VLOOKUP($A58,FB_29,2,0))&IF(TYPE(VLOOKUP($A58,FB_30,2,0))=16,\"\",VLOOKUP($A58,FB_30,2,0))","v":""},null,{"$f":"IF($B58=\"\",\"\",_xlfn.NUMBERVALUE(IF(TYPE(VLOOKUP($A58,FB_1,P$5,0))=16,\"\",VLOOKUP($A58,FB_1,P$5,0))&IF(TYPE(VLOOKUP($A58,FB_2,P$5,0))=16,\"\",VLOOKUP($A58,FB_2,P$5,0))&IF(TYPE(VLOOKUP($A58,FB_3,P$5,0))=16,\"\",VLOOKUP($A58,FB_3,P$5,0))&IF(TYPE(VLOOKUP($A58,FB_4,P$5,0))=16,\"\",VLOOKUP($A58,FB_4,P$5,0))&IF(TYPE(VLOOKUP($A58,FB_5,P$5,0))=16,\"\",VLOOKUP($A58,FB_5,P$5,0))&IF(TYPE(VLOOKUP($A58,FB_6,P$5,0))=16,\"\",VLOOKUP($A58,FB_6,P$5,0))&IF(TYPE(VLOOKUP($A58,FB_7,P$5,0))=16,\"\",VLOOKUP($A58,FB_7,P$5,0))&IF(TYPE(VLOOKUP($A58,FB_8,P$5,0))=16,\"\",VLOOKUP($A58,FB_8,P$5,0))&IF(TYPE(VLOOKUP($A58,FB_9,P$5,0))=16,\"\",VLOOKUP($A58,FB_9,P$5,0))&IF(TYPE(VLOOKUP($A58,FB_10,P$5,0))=16,\"\",VLOOKUP($A58,FB_10,P$5,0))&IF(TYPE(VLOOKUP($A58,FB_11,P$5,0))=16,\"\",VLOOKUP($A58,FB_11,P$5,0))&IF(TYPE(VLOOKUP($A58,FB_12,P$5,0))=16,\"\",VLOOKUP($A58,FB_12,P$5,0))&IF(TYPE(VLOOKUP($A58,FB_13,P$5,0))=16,\"\",VLOOKUP($A58,FB_13,P$5,0))&IF(TYPE(VLOOKUP($A58,FB_14,P$5,0))=16,\"\",VLOOKUP($A58,FB_14,P$5,0))&IF(TYPE(VLOOKUP($A58,FB_15,P$5,0))=16,\"\",VLOOKUP($A58,FB_15,P$5,0))&IF(TYPE(VLOOKUP($A58,FB_16,P$5,0))=16,\"\",VLOOKUP($A58,FB_16,P$5,0))&IF(TYPE(VLOOKUP($A58,FB_17,P$5,0))=16,\"\",VLOOKUP($A58,FB_17,P$5,0))&IF(TYPE(VLOOKUP($A58,FB_18,P$5,0))=16,\"\",VLOOKUP($A58,FB_18,P$5,0))&IF(TYPE(VLOOKUP($A58,FB_19,P$5,0))=16,\"\",VLOOKUP($A58,FB_19,P$5,0))&IF(TYPE(VLOOKUP($A58,FB_20,P$5,0))=16,\"\",VLOOKUP($A58,FB_20,P$5,0))&IF(TYPE(VLOOKUP($A58,FB_21,P$5,0))=16,\"\",VLOOKUP($A58,FB_21,P$5,0))&IF(TYPE(VLOOKUP($A58,FB_22,P$5,0))=16,\"\",VLOOKUP($A58,FB_22,P$5,0))&IF(TYPE(VLOOKUP($A58,FB_23,P$5,0))=16,\"\",VLOOKUP($A58,FB_23,P$5,0))&IF(TYPE(VLOOKUP($A58,FB_24,P$5,0))=16,\"\",VLOOKUP($A58,FB_24,P$5,0))&IF(TYPE(VLOOKUP($A58,FB_25,P$5,0))=16,\"\",VLOOKUP($A58,FB_25,P$5,0))&IF(TYPE(VLOOKUP($A58,FB_26,P$5,0))=16,\"\",VLOOKUP($A58,FB_26,P$5,0))&IF(TYPE(VLOOKUP($A58,FB_27,P$5,0))=16,\"\",VLOOKUP($A58,FB_27,P$5,0))&IF(TYPE(VLOOKUP($A58,FB_28,P$5,0))=16,\"\",VLOOKUP($A58,FB_28,P$5,0))&IF(TYPE(VLOOKUP($A58,FB_29,P$5,0))=16,\"\",VLOOKUP($A58,FB_29,P$5,0))&IF(TYPE(VLOOKUP($A58,FB_30,P$5,0))=16,\"\",VLOOKUP($A58,FB_30,P$5,0))))","v":""},"",{"$f":"IF($B58=\"\",\"\",_xlfn.NUMBERVALUE(IF(TYPE(VLOOKUP($A58,FB_1,R$5,0))=16,\"\",VLOOKUP($A58,FB_1,R$5,0))&IF(TYPE(VLOOKUP($A58,FB_2,R$5,0))=16,\"\",VLOOKUP($A58,FB_2,R$5,0))&IF(TYPE(VLOOKUP($A58,FB_3,R$5,0))=16,\"\",VLOOKUP($A58,FB_3,R$5,0))&IF(TYPE(VLOOKUP($A58,FB_4,R$5,0))=16,\"\",VLOOKUP($A58,FB_4,R$5,0))&IF(TYPE(VLOOKUP($A58,FB_5,R$5,0))=16,\"\",VLOOKUP($A58,FB_5,R$5,0))&IF(TYPE(VLOOKUP($A58,FB_6,R$5,0))=16,\"\",VLOOKUP($A58,FB_6,R$5,0))&IF(TYPE(VLOOKUP($A58,FB_7,R$5,0))=16,\"\",VLOOKUP($A58,FB_7,R$5,0))&IF(TYPE(VLOOKUP($A58,FB_8,R$5,0))=16,\"\",VLOOKUP($A58,FB_8,R$5,0))&IF(TYPE(VLOOKUP($A58,FB_9,R$5,0))=16,\"\",VLOOKUP($A58,FB_9,R$5,0))&IF(TYPE(VLOOKUP($A58,FB_10,R$5,0))=16,\"\",VLOOKUP($A58,FB_10,R$5,0))&IF(TYPE(VLOOKUP($A58,FB_11,R$5,0))=16,\"\",VLOOKUP($A58,FB_11,R$5,0))&IF(TYPE(VLOOKUP($A58,FB_12,R$5,0))=16,\"\",VLOOKUP($A58,FB_12,R$5,0))&IF(TYPE(VLOOKUP($A58,FB_13,R$5,0))=16,\"\",VLOOKUP($A58,FB_13,R$5,0))&IF(TYPE(VLOOKUP($A58,FB_14,R$5,0))=16,\"\",VLOOKUP($A58,FB_14,R$5,0))&IF(TYPE(VLOOKUP($A58,FB_15,R$5,0))=16,\"\",VLOOKUP($A58,FB_15,R$5,0))&IF(TYPE(VLOOKUP($A58,FB_16,R$5,0))=16,\"\",VLOOKUP($A58,FB_16,R$5,0))&IF(TYPE(VLOOKUP($A58,FB_17,R$5,0))=16,\"\",VLOOKUP($A58,FB_17,R$5,0))&IF(TYPE(VLOOKUP($A58,FB_18,R$5,0))=16,\"\",VLOOKUP($A58,FB_18,R$5,0))&IF(TYPE(VLOOKUP($A58,FB_19,R$5,0))=16,\"\",VLOOKUP($A58,FB_19,R$5,0))&IF(TYPE(VLOOKUP($A58,FB_20,R$5,0))=16,\"\",VLOOKUP($A58,FB_20,R$5,0))&IF(TYPE(VLOOKUP($A58,FB_21,R$5,0))=16,\"\",VLOOKUP($A58,FB_21,R$5,0))&IF(TYPE(VLOOKUP($A58,FB_22,R$5,0))=16,\"\",VLOOKUP($A58,FB_22,R$5,0))&IF(TYPE(VLOOKUP($A58,FB_23,R$5,0))=16,\"\",VLOOKUP($A58,FB_23,R$5,0))&IF(TYPE(VLOOKUP($A58,FB_24,R$5,0))=16,\"\",VLOOKUP($A58,FB_24,R$5,0))&IF(TYPE(VLOOKUP($A58,FB_25,R$5,0))=16,\"\",VLOOKUP($A58,FB_25,R$5,0))&IF(TYPE(VLOOKUP($A58,FB_26,R$5,0))=16,\"\",VLOOKUP($A58,FB_26,R$5,0))&IF(TYPE(VLOOKUP($A58,FB_27,R$5,0))=16,\"\",VLOOKUP($A58,FB_27,R$5,0))&IF(TYPE(VLOOKUP($A58,FB_28,R$5,0))=16,\"\",VLOOKUP($A58,FB_28,R$5,0))&IF(TYPE(VLOOKUP($A58,FB_29,R$5,0))=16,\"\",VLOOKUP($A58,FB_29,R$5,0))&IF(TYPE(VLOOKUP($A58,FB_30,R$5,0))=16,\"\",VLOOKUP($A58,FB_30,R$5,0))))","v":""},{"$f":"IF($B58=\"\",\"\",IF(TYPE(VLOOKUP($A58,FB_1,S$5,0))=16,\"\",VLOOKUP($A58,FB_1,S$5,0))&IF(TYPE(VLOOKUP($A58,FB_2,S$5,0))=16,\"\",VLOOKUP($A58,FB_2,S$5,0))&IF(TYPE(VLOOKUP($A58,FB_3,S$5,0))=16,\"\",VLOOKUP($A58,FB_3,S$5,0))&IF(TYPE(VLOOKUP($A58,FB_4,S$5,0))=16,\"\",VLOOKUP($A58,FB_4,S$5,0))&IF(TYPE(VLOOKUP($A58,FB_5,S$5,0))=16,\"\",VLOOKUP($A58,FB_5,S$5,0))&IF(TYPE(VLOOKUP($A58,FB_6,S$5,0))=16,\"\",VLOOKUP($A58,FB_6,S$5,0))&IF(TYPE(VLOOKUP($A58,FB_7,S$5,0))=16,\"\",VLOOKUP($A58,FB_7,S$5,0))&IF(TYPE(VLOOKUP($A58,FB_8,S$5,0))=16,\"\",VLOOKUP($A58,FB_8,S$5,0))&IF(TYPE(VLOOKUP($A58,FB_9,S$5,0))=16,\"\",VLOOKUP($A58,FB_9,S$5,0))&IF(TYPE(VLOOKUP($A58,FB_10,S$5,0))=16,\"\",VLOOKUP($A58,FB_10,S$5,0))&IF(TYPE(VLOOKUP($A58,FB_11,S$5,0))=16,\"\",VLOOKUP($A58,FB_11,S$5,0))&IF(TYPE(VLOOKUP($A58,FB_12,S$5,0))=16,\"\",VLOOKUP($A58,FB_12,S$5,0))&IF(TYPE(VLOOKUP($A58,FB_13,S$5,0))=16,\"\",VLOOKUP($A58,FB_13,S$5,0))&IF(TYPE(VLOOKUP($A58,FB_14,S$5,0))=16,\"\",VLOOKUP($A58,FB_14,S$5,0))&IF(TYPE(VLOOKUP($A58,FB_15,S$5,0))=16,\"\",VLOOKUP($A58,FB_15,S$5,0))&IF(TYPE(VLOOKUP($A58,FB_16,S$5,0))=16,\"\",VLOOKUP($A58,FB_16,S$5,0))&IF(TYPE(VLOOKUP($A58,FB_17,S$5,0))=16,\"\",VLOOKUP($A58,FB_17,S$5,0))&IF(TYPE(VLOOKUP($A58,FB_18,S$5,0))=16,\"\",VLOOKUP($A58,FB_18,S$5,0))&IF(TYPE(VLOOKUP($A58,FB_19,S$5,0))=16,\"\",VLOOKUP($A58,FB_19,S$5,0))&IF(TYPE(VLOOKUP($A58,FB_20,S$5,0))=16,\"\",VLOOKUP($A58,FB_20,S$5,0))&IF(TYPE(VLOOKUP($A58,FB_21,S$5,0))=16,\"\",VLOOKUP($A58,FB_21,S$5,0))&IF(TYPE(VLOOKUP($A58,FB_22,S$5,0))=16,\"\",VLOOKUP($A58,FB_22,S$5,0))&IF(TYPE(VLOOKUP($A58,FB_23,S$5,0))=16,\"\",VLOOKUP($A58,FB_23,S$5,0))&IF(TYPE(VLOOKUP($A58,FB_24,S$5,0))=16,\"\",VLOOKUP($A58,FB_24,S$5,0))&IF(TYPE(VLOOKUP($A58,FB_25,S$5,0))=16,\"\",VLOOKUP($A58,FB_25,S$5,0))&IF(TYPE(VLOOKUP($A58,FB_26,S$5,0))=16,\"\",VLOOKUP($A58,FB_26,S$5,0))&IF(TYPE(VLOOKUP($A58,FB_27,S$5,0))=16,\"\",VLOOKUP($A58,FB_27,S$5,0))&IF(TYPE(VLOOKUP($A58,FB_28,S$5,0))=16,\"\",VLOOKUP($A58,FB_28,S$5,0))&IF(TYPE(VLOOKUP($A58,FB_29,S$5,0))=16,\"\",VLOOKUP($A58,FB_29,S$5,0))&IF(TYPE(VLOOKUP($A58,FB_30,S$5,0))=16,\"\",VLOOKUP($A58,FB_30,S$5,0)))","v":""},null,null,null,null,null,null,null,null,null,null,null,null,null,null,null,null,"",":","","",""]
["30.",{"$f":"IF(TYPE(VLOOKUP($A59,FB_1,2,0))=16,\"\",VLOOKUP($A59,FB_1,2,0))&IF(TYPE(VLOOKUP($A59,FB_2,2,0))=16,\"\",VLOOKUP($A59,FB_2,2,0))&IF(TYPE(VLOOKUP($A59,FB_3,2,0))=16,\"\",VLOOKUP($A59,FB_3,2,0))&IF(TYPE(VLOOKUP($A59,FB_4,2,0))=16,\"\",VLOOKUP($A59,FB_4,2,0))&IF(TYPE(VLOOKUP($A59,FB_5,2,0))=16,\"\",VLOOKUP($A59,FB_5,2,0))&IF(TYPE(VLOOKUP($A59,FB_6,2,0))=16,\"\",VLOOKUP($A59,FB_6,2,0))&IF(TYPE(VLOOKUP($A59,FB_7,2,0))=16,\"\",VLOOKUP($A59,FB_7,2,0))&IF(TYPE(VLOOKUP($A59,FB_8,2,0))=16,\"\",VLOOKUP($A59,FB_8,2,0))&IF(TYPE(VLOOKUP($A59,FB_9,2,0))=16,\"\",VLOOKUP($A59,FB_9,2,0))&IF(TYPE(VLOOKUP($A59,FB_10,2,0))=16,\"\",VLOOKUP($A59,FB_10,2,0))&IF(TYPE(VLOOKUP($A59,FB_11,2,0))=16,\"\",VLOOKUP($A59,FB_11,2,0))&IF(TYPE(VLOOKUP($A59,FB_12,2,0))=16,\"\",VLOOKUP($A59,FB_12,2,0))&IF(TYPE(VLOOKUP($A59,FB_13,2,0))=16,\"\",VLOOKUP($A59,FB_13,2,0))&IF(TYPE(VLOOKUP($A59,FB_14,2,0))=16,\"\",VLOOKUP($A59,FB_14,2,0))&IF(TYPE(VLOOKUP($A59,FB_15,2,0))=16,\"\",VLOOKUP($A59,FB_15,2,0))&IF(TYPE(VLOOKUP($A59,FB_16,2,0))=16,\"\",VLOOKUP($A59,FB_16,2,0))&IF(TYPE(VLOOKUP($A59,FB_17,2,0))=16,\"\",VLOOKUP($A59,FB_17,2,0))&IF(TYPE(VLOOKUP($A59,FB_18,2,0))=16,\"\",VLOOKUP($A59,FB_18,2,0))&IF(TYPE(VLOOKUP($A59,FB_19,2,0))=16,\"\",VLOOKUP($A59,FB_19,2,0))&IF(TYPE(VLOOKUP($A59,FB_20,2,0))=16,\"\",VLOOKUP($A59,FB_20,2,0))&IF(TYPE(VLOOKUP($A59,FB_21,2,0))=16,\"\",VLOOKUP($A59,FB_21,2,0))&IF(TYPE(VLOOKUP($A59,FB_22,2,0))=16,\"\",VLOOKUP($A59,FB_22,2,0))&IF(TYPE(VLOOKUP($A59,FB_23,2,0))=16,\"\",VLOOKUP($A59,FB_23,2,0))&IF(TYPE(VLOOKUP($A59,FB_24,2,0))=16,\"\",VLOOKUP($A59,FB_24,2,0))&IF(TYPE(VLOOKUP($A59,FB_25,2,0))=16,\"\",VLOOKUP($A59,FB_25,2,0))&IF(TYPE(VLOOKUP($A59,FB_26,2,0))=16,\"\",VLOOKUP($A59,FB_26,2,0))&IF(TYPE(VLOOKUP($A59,FB_27,2,0))=16,\"\",VLOOKUP($A59,FB_27,2,0))&IF(TYPE(VLOOKUP($A59,FB_28,2,0))=16,\"\",VLOOKUP($A59,FB_28,2,0))&IF(TYPE(VLOOKUP($A59,FB_29,2,0))=16,\"\",VLOOKUP($A59,FB_29,2,0))&IF(TYPE(VLOOKUP($A59,FB_30,2,0))=16,\"\",VLOOKUP($A59,FB_30,2,0))","v":""},null,{"$f":"IF($B59=\"\",\"\",_xlfn.NUMBERVALUE(IF(TYPE(VLOOKUP($A59,FB_1,P$5,0))=16,\"\",VLOOKUP($A59,FB_1,P$5,0))&IF(TYPE(VLOOKUP($A59,FB_2,P$5,0))=16,\"\",VLOOKUP($A59,FB_2,P$5,0))&IF(TYPE(VLOOKUP($A59,FB_3,P$5,0))=16,\"\",VLOOKUP($A59,FB_3,P$5,0))&IF(TYPE(VLOOKUP($A59,FB_4,P$5,0))=16,\"\",VLOOKUP($A59,FB_4,P$5,0))&IF(TYPE(VLOOKUP($A59,FB_5,P$5,0))=16,\"\",VLOOKUP($A59,FB_5,P$5,0))&IF(TYPE(VLOOKUP($A59,FB_6,P$5,0))=16,\"\",VLOOKUP($A59,FB_6,P$5,0))&IF(TYPE(VLOOKUP($A59,FB_7,P$5,0))=16,\"\",VLOOKUP($A59,FB_7,P$5,0))&IF(TYPE(VLOOKUP($A59,FB_8,P$5,0))=16,\"\",VLOOKUP($A59,FB_8,P$5,0))&IF(TYPE(VLOOKUP($A59,FB_9,P$5,0))=16,\"\",VLOOKUP($A59,FB_9,P$5,0))&IF(TYPE(VLOOKUP($A59,FB_10,P$5,0))=16,\"\",VLOOKUP($A59,FB_10,P$5,0))&IF(TYPE(VLOOKUP($A59,FB_11,P$5,0))=16,\"\",VLOOKUP($A59,FB_11,P$5,0))&IF(TYPE(VLOOKUP($A59,FB_12,P$5,0))=16,\"\",VLOOKUP($A59,FB_12,P$5,0))&IF(TYPE(VLOOKUP($A59,FB_13,P$5,0))=16,\"\",VLOOKUP($A59,FB_13,P$5,0))&IF(TYPE(VLOOKUP($A59,FB_14,P$5,0))=16,\"\",VLOOKUP($A59,FB_14,P$5,0))&IF(TYPE(VLOOKUP($A59,FB_15,P$5,0))=16,\"\",VLOOKUP($A59,FB_15,P$5,0))&IF(TYPE(VLOOKUP($A59,FB_16,P$5,0))=16,\"\",VLOOKUP($A59,FB_16,P$5,0))&IF(TYPE(VLOOKUP($A59,FB_17,P$5,0))=16,\"\",VLOOKUP($A59,FB_17,P$5,0))&IF(TYPE(VLOOKUP($A59,FB_18,P$5,0))=16,\"\",VLOOKUP($A59,FB_18,P$5,0))&IF(TYPE(VLOOKUP($A59,FB_19,P$5,0))=16,\"\",VLOOKUP($A59,FB_19,P$5,0))&IF(TYPE(VLOOKUP($A59,FB_20,P$5,0))=16,\"\",VLOOKUP($A59,FB_20,P$5,0))&IF(TYPE(VLOOKUP($A59,FB_21,P$5,0))=16,\"\",VLOOKUP($A59,FB_21,P$5,0))&IF(TYPE(VLOOKUP($A59,FB_22,P$5,0))=16,\"\",VLOOKUP($A59,FB_22,P$5,0))&IF(TYPE(VLOOKUP($A59,FB_23,P$5,0))=16,\"\",VLOOKUP($A59,FB_23,P$5,0))&IF(TYPE(VLOOKUP($A59,FB_24,P$5,0))=16,\"\",VLOOKUP($A59,FB_24,P$5,0))&IF(TYPE(VLOOKUP($A59,FB_25,P$5,0))=16,\"\",VLOOKUP($A59,FB_25,P$5,0))&IF(TYPE(VLOOKUP($A59,FB_26,P$5,0))=16,\"\",VLOOKUP($A59,FB_26,P$5,0))&IF(TYPE(VLOOKUP($A59,FB_27,P$5,0))=16,\"\",VLOOKUP($A59,FB_27,P$5,0))&IF(TYPE(VLOOKUP($A59,FB_28,P$5,0))=16,\"\",VLOOKUP($A59,FB_28,P$5,0))&IF(TYPE(VLOOKUP($A59,FB_29,P$5,0))=16,\"\",VLOOKUP($A59,FB_29,P$5,0))&IF(TYPE(VLOOKUP($A59,FB_30,P$5,0))=16,\"\",VLOOKUP($A59,FB_30,P$5,0))))","v":""},"",{"$f":"IF($B59=\"\",\"\",_xlfn.NUMBERVALUE(IF(TYPE(VLOOKUP($A59,FB_1,R$5,0))=16,\"\",VLOOKUP($A59,FB_1,R$5,0))&IF(TYPE(VLOOKUP($A59,FB_2,R$5,0))=16,\"\",VLOOKUP($A59,FB_2,R$5,0))&IF(TYPE(VLOOKUP($A59,FB_3,R$5,0))=16,\"\",VLOOKUP($A59,FB_3,R$5,0))&IF(TYPE(VLOOKUP($A59,FB_4,R$5,0))=16,\"\",VLOOKUP($A59,FB_4,R$5,0))&IF(TYPE(VLOOKUP($A59,FB_5,R$5,0))=16,\"\",VLOOKUP($A59,FB_5,R$5,0))&IF(TYPE(VLOOKUP($A59,FB_6,R$5,0))=16,\"\",VLOOKUP($A59,FB_6,R$5,0))&IF(TYPE(VLOOKUP($A59,FB_7,R$5,0))=16,\"\",VLOOKUP($A59,FB_7,R$5,0))&IF(TYPE(VLOOKUP($A59,FB_8,R$5,0))=16,\"\",VLOOKUP($A59,FB_8,R$5,0))&IF(TYPE(VLOOKUP($A59,FB_9,R$5,0))=16,\"\",VLOOKUP($A59,FB_9,R$5,0))&IF(TYPE(VLOOKUP($A59,FB_10,R$5,0))=16,\"\",VLOOKUP($A59,FB_10,R$5,0))&IF(TYPE(VLOOKUP($A59,FB_11,R$5,0))=16,\"\",VLOOKUP($A59,FB_11,R$5,0))&IF(TYPE(VLOOKUP($A59,FB_12,R$5,0))=16,\"\",VLOOKUP($A59,FB_12,R$5,0))&IF(TYPE(VLOOKUP($A59,FB_13,R$5,0))=16,\"\",VLOOKUP($A59,FB_13,R$5,0))&IF(TYPE(VLOOKUP($A59,FB_14,R$5,0))=16,\"\",VLOOKUP($A59,FB_14,R$5,0))&IF(TYPE(VLOOKUP($A59,FB_15,R$5,0))=16,\"\",VLOOKUP($A59,FB_15,R$5,0))&IF(TYPE(VLOOKUP($A59,FB_16,R$5,0))=16,\"\",VLOOKUP($A59,FB_16,R$5,0))&IF(TYPE(VLOOKUP($A59,FB_17,R$5,0))=16,\"\",VLOOKUP($A59,FB_17,R$5,0))&IF(TYPE(VLOOKUP($A59,FB_18,R$5,0))=16,\"\",VLOOKUP($A59,FB_18,R$5,0))&IF(TYPE(VLOOKUP($A59,FB_19,R$5,0))=16,\"\",VLOOKUP($A59,FB_19,R$5,0))&IF(TYPE(VLOOKUP($A59,FB_20,R$5,0))=16,\"\",VLOOKUP($A59,FB_20,R$5,0))&IF(TYPE(VLOOKUP($A59,FB_21,R$5,0))=16,\"\",VLOOKUP($A59,FB_21,R$5,0))&IF(TYPE(VLOOKUP($A59,FB_22,R$5,0))=16,\"\",VLOOKUP($A59,FB_22,R$5,0))&IF(TYPE(VLOOKUP($A59,FB_23,R$5,0))=16,\"\",VLOOKUP($A59,FB_23,R$5,0))&IF(TYPE(VLOOKUP($A59,FB_24,R$5,0))=16,\"\",VLOOKUP($A59,FB_24,R$5,0))&IF(TYPE(VLOOKUP($A59,FB_25,R$5,0))=16,\"\",VLOOKUP($A59,FB_25,R$5,0))&IF(TYPE(VLOOKUP($A59,FB_26,R$5,0))=16,\"\",VLOOKUP($A59,FB_26,R$5,0))&IF(TYPE(VLOOKUP($A59,FB_27,R$5,0))=16,\"\",VLOOKUP($A59,FB_27,R$5,0))&IF(TYPE(VLOOKUP($A59,FB_28,R$5,0))=16,\"\",VLOOKUP($A59,FB_28,R$5,0))&IF(TYPE(VLOOKUP($A59,FB_29,R$5,0))=16,\"\",VLOOKUP($A59,FB_29,R$5,0))&IF(TYPE(VLOOKUP($A59,FB_30,R$5,0))=16,\"\",VLOOKUP($A59,FB_30,R$5,0))))","v":""},{"$f":"IF($B59=\"\",\"\",IF(TYPE(VLOOKUP($A59,FB_1,S$5,0))=16,\"\",VLOOKUP($A59,FB_1,S$5,0))&IF(TYPE(VLOOKUP($A59,FB_2,S$5,0))=16,\"\",VLOOKUP($A59,FB_2,S$5,0))&IF(TYPE(VLOOKUP($A59,FB_3,S$5,0))=16,\"\",VLOOKUP($A59,FB_3,S$5,0))&IF(TYPE(VLOOKUP($A59,FB_4,S$5,0))=16,\"\",VLOOKUP($A59,FB_4,S$5,0))&IF(TYPE(VLOOKUP($A59,FB_5,S$5,0))=16,\"\",VLOOKUP($A59,FB_5,S$5,0))&IF(TYPE(VLOOKUP($A59,FB_6,S$5,0))=16,\"\",VLOOKUP($A59,FB_6,S$5,0))&IF(TYPE(VLOOKUP($A59,FB_7,S$5,0))=16,\"\",VLOOKUP($A59,FB_7,S$5,0))&IF(TYPE(VLOOKUP($A59,FB_8,S$5,0))=16,\"\",VLOOKUP($A59,FB_8,S$5,0))&IF(TYPE(VLOOKUP($A59,FB_9,S$5,0))=16,\"\",VLOOKUP($A59,FB_9,S$5,0))&IF(TYPE(VLOOKUP($A59,FB_10,S$5,0))=16,\"\",VLOOKUP($A59,FB_10,S$5,0))&IF(TYPE(VLOOKUP($A59,FB_11,S$5,0))=16,\"\",VLOOKUP($A59,FB_11,S$5,0))&IF(TYPE(VLOOKUP($A59,FB_12,S$5,0))=16,\"\",VLOOKUP($A59,FB_12,S$5,0))&IF(TYPE(VLOOKUP($A59,FB_13,S$5,0))=16,\"\",VLOOKUP($A59,FB_13,S$5,0))&IF(TYPE(VLOOKUP($A59,FB_14,S$5,0))=16,\"\",VLOOKUP($A59,FB_14,S$5,0))&IF(TYPE(VLOOKUP($A59,FB_15,S$5,0))=16,\"\",VLOOKUP($A59,FB_15,S$5,0))&IF(TYPE(VLOOKUP($A59,FB_16,S$5,0))=16,\"\",VLOOKUP($A59,FB_16,S$5,0))&IF(TYPE(VLOOKUP($A59,FB_17,S$5,0))=16,\"\",VLOOKUP($A59,FB_17,S$5,0))&IF(TYPE(VLOOKUP($A59,FB_18,S$5,0))=16,\"\",VLOOKUP($A59,FB_18,S$5,0))&IF(TYPE(VLOOKUP($A59,FB_19,S$5,0))=16,\"\",VLOOKUP($A59,FB_19,S$5,0))&IF(TYPE(VLOOKUP($A59,FB_20,S$5,0))=16,\"\",VLOOKUP($A59,FB_20,S$5,0))&IF(TYPE(VLOOKUP($A59,FB_21,S$5,0))=16,\"\",VLOOKUP($A59,FB_21,S$5,0))&IF(TYPE(VLOOKUP($A59,FB_22,S$5,0))=16,\"\",VLOOKUP($A59,FB_22,S$5,0))&IF(TYPE(VLOOKUP($A59,FB_23,S$5,0))=16,\"\",VLOOKUP($A59,FB_23,S$5,0))&IF(TYPE(VLOOKUP($A59,FB_24,S$5,0))=16,\"\",VLOOKUP($A59,FB_24,S$5,0))&IF(TYPE(VLOOKUP($A59,FB_25,S$5,0))=16,\"\",VLOOKUP($A59,FB_25,S$5,0))&IF(TYPE(VLOOKUP($A59,FB_26,S$5,0))=16,\"\",VLOOKUP($A59,FB_26,S$5,0))&IF(TYPE(VLOOKUP($A59,FB_27,S$5,0))=16,\"\",VLOOKUP($A59,FB_27,S$5,0))&IF(TYPE(VLOOKUP($A59,FB_28,S$5,0))=16,\"\",VLOOKUP($A59,FB_28,S$5,0))&IF(TYPE(VLOOKUP($A59,FB_29,S$5,0))=16,\"\",VLOOKUP($A59,FB_29,S$5,0))&IF(TYPE(VLOOKUP($A59,FB_30,S$5,0))=16,\"\",VLOOKUP($A59,FB_30,S$5,0)))","v":""},null,null,null,null,null,null,null,null,null,null,null,null,null,null,null,null,"",":","","",""]
["31.",{"$f":"IF(TYPE(VLOOKUP($A60,FB_1,2,0))=16,\"\",VLOOKUP($A60,FB_1,2,0))&IF(TYPE(VLOOKUP($A60,FB_2,2,0))=16,\"\",VLOOKUP($A60,FB_2,2,0))&IF(TYPE(VLOOKUP($A60,FB_3,2,0))=16,\"\",VLOOKUP($A60,FB_3,2,0))&IF(TYPE(VLOOKUP($A60,FB_4,2,0))=16,\"\",VLOOKUP($A60,FB_4,2,0))&IF(TYPE(VLOOKUP($A60,FB_5,2,0))=16,\"\",VLOOKUP($A60,FB_5,2,0))&IF(TYPE(VLOOKUP($A60,FB_6,2,0))=16,\"\",VLOOKUP($A60,FB_6,2,0))&IF(TYPE(VLOOKUP($A60,FB_7,2,0))=16,\"\",VLOOKUP($A60,FB_7,2,0))&IF(TYPE(VLOOKUP($A60,FB_8,2,0))=16,\"\",VLOOKUP($A60,FB_8,2,0))&IF(TYPE(VLOOKUP($A60,FB_9,2,0))=16,\"\",VLOOKUP($A60,FB_9,2,0))&IF(TYPE(VLOOKUP($A60,FB_10,2,0))=16,\"\",VLOOKUP($A60,FB_10,2,0))&IF(TYPE(VLOOKUP($A60,FB_11,2,0))=16,\"\",VLOOKUP($A60,FB_11,2,0))&IF(TYPE(VLOOKUP($A60,FB_12,2,0))=16,\"\",VLOOKUP($A60,FB_12,2,0))&IF(TYPE(VLOOKUP($A60,FB_13,2,0))=16,\"\",VLOOKUP($A60,FB_13,2,0))&IF(TYPE(VLOOKUP($A60,FB_14,2,0))=16,\"\",VLOOKUP($A60,FB_14,2,0))&IF(TYPE(VLOOKUP($A60,FB_15,2,0))=16,\"\",VLOOKUP($A60,FB_15,2,0))&IF(TYPE(VLOOKUP($A60,FB_16,2,0))=16,\"\",VLOOKUP($A60,FB_16,2,0))&IF(TYPE(VLOOKUP($A60,FB_17,2,0))=16,\"\",VLOOKUP($A60,FB_17,2,0))&IF(TYPE(VLOOKUP($A60,FB_18,2,0))=16,\"\",VLOOKUP($A60,FB_18,2,0))&IF(TYPE(VLOOKUP($A60,FB_19,2,0))=16,\"\",VLOOKUP($A60,FB_19,2,0))&IF(TYPE(VLOOKUP($A60,FB_20,2,0))=16,\"\",VLOOKUP($A60,FB_20,2,0))&IF(TYPE(VLOOKUP($A60,FB_21,2,0))=16,\"\",VLOOKUP($A60,FB_21,2,0))&IF(TYPE(VLOOKUP($A60,FB_22,2,0))=16,\"\",VLOOKUP($A60,FB_22,2,0))&IF(TYPE(VLOOKUP($A60,FB_23,2,0))=16,\"\",VLOOKUP($A60,FB_23,2,0))&IF(TYPE(VLOOKUP($A60,FB_24,2,0))=16,\"\",VLOOKUP($A60,FB_24,2,0))&IF(TYPE(VLOOKUP($A60,FB_25,2,0))=16,\"\",VLOOKUP($A60,FB_25,2,0))&IF(TYPE(VLOOKUP($A60,FB_26,2,0))=16,\"\",VLOOKUP($A60,FB_26,2,0))&IF(TYPE(VLOOKUP($A60,FB_27,2,0))=16,\"\",VLOOKUP($A60,FB_27,2,0))&IF(TYPE(VLOOKUP($A60,FB_28,2,0))=16,\"\",VLOOKUP($A60,FB_28,2,0))&IF(TYPE(VLOOKUP($A60,FB_29,2,0))=16,\"\",VLOOKUP($A60,FB_29,2,0))&IF(TYPE(VLOOKUP($A60,FB_30,2,0))=16,\"\",VLOOKUP($A60,FB_30,2,0))","v":""},null,{"$f":"IF($B60=\"\",\"\",_xlfn.NUMBERVALUE(IF(TYPE(VLOOKUP($A60,FB_1,P$5,0))=16,\"\",VLOOKUP($A60,FB_1,P$5,0))&IF(TYPE(VLOOKUP($A60,FB_2,P$5,0))=16,\"\",VLOOKUP($A60,FB_2,P$5,0))&IF(TYPE(VLOOKUP($A60,FB_3,P$5,0))=16,\"\",VLOOKUP($A60,FB_3,P$5,0))&IF(TYPE(VLOOKUP($A60,FB_4,P$5,0))=16,\"\",VLOOKUP($A60,FB_4,P$5,0))&IF(TYPE(VLOOKUP($A60,FB_5,P$5,0))=16,\"\",VLOOKUP($A60,FB_5,P$5,0))&IF(TYPE(VLOOKUP($A60,FB_6,P$5,0))=16,\"\",VLOOKUP($A60,FB_6,P$5,0))&IF(TYPE(VLOOKUP($A60,FB_7,P$5,0))=16,\"\",VLOOKUP($A60,FB_7,P$5,0))&IF(TYPE(VLOOKUP($A60,FB_8,P$5,0))=16,\"\",VLOOKUP($A60,FB_8,P$5,0))&IF(TYPE(VLOOKUP($A60,FB_9,P$5,0))=16,\"\",VLOOKUP($A60,FB_9,P$5,0))&IF(TYPE(VLOOKUP($A60,FB_10,P$5,0))=16,\"\",VLOOKUP($A60,FB_10,P$5,0))&IF(TYPE(VLOOKUP($A60,FB_11,P$5,0))=16,\"\",VLOOKUP($A60,FB_11,P$5,0))&IF(TYPE(VLOOKUP($A60,FB_12,P$5,0))=16,\"\",VLOOKUP($A60,FB_12,P$5,0))&IF(TYPE(VLOOKUP($A60,FB_13,P$5,0))=16,\"\",VLOOKUP($A60,FB_13,P$5,0))&IF(TYPE(VLOOKUP($A60,FB_14,P$5,0))=16,\"\",VLOOKUP($A60,FB_14,P$5,0))&IF(TYPE(VLOOKUP($A60,FB_15,P$5,0))=16,\"\",VLOOKUP($A60,FB_15,P$5,0))&IF(TYPE(VLOOKUP($A60,FB_16,P$5,0))=16,\"\",VLOOKUP($A60,FB_16,P$5,0))&IF(TYPE(VLOOKUP($A60,FB_17,P$5,0))=16,\"\",VLOOKUP($A60,FB_17,P$5,0))&IF(TYPE(VLOOKUP($A60,FB_18,P$5,0))=16,\"\",VLOOKUP($A60,FB_18,P$5,0))&IF(TYPE(VLOOKUP($A60,FB_19,P$5,0))=16,\"\",VLOOKUP($A60,FB_19,P$5,0))&IF(TYPE(VLOOKUP($A60,FB_20,P$5,0))=16,\"\",VLOOKUP($A60,FB_20,P$5,0))&IF(TYPE(VLOOKUP($A60,FB_21,P$5,0))=16,\"\",VLOOKUP($A60,FB_21,P$5,0))&IF(TYPE(VLOOKUP($A60,FB_22,P$5,0))=16,\"\",VLOOKUP($A60,FB_22,P$5,0))&IF(TYPE(VLOOKUP($A60,FB_23,P$5,0))=16,\"\",VLOOKUP($A60,FB_23,P$5,0))&IF(TYPE(VLOOKUP($A60,FB_24,P$5,0))=16,\"\",VLOOKUP($A60,FB_24,P$5,0))&IF(TYPE(VLOOKUP($A60,FB_25,P$5,0))=16,\"\",VLOOKUP($A60,FB_25,P$5,0))&IF(TYPE(VLOOKUP($A60,FB_26,P$5,0))=16,\"\",VLOOKUP($A60,FB_26,P$5,0))&IF(TYPE(VLOOKUP($A60,FB_27,P$5,0))=16,\"\",VLOOKUP($A60,FB_27,P$5,0))&IF(TYPE(VLOOKUP($A60,FB_28,P$5,0))=16,\"\",VLOOKUP($A60,FB_28,P$5,0))&IF(TYPE(VLOOKUP($A60,FB_29,P$5,0))=16,\"\",VLOOKUP($A60,FB_29,P$5,0))&IF(TYPE(VLOOKUP($A60,FB_30,P$5,0))=16,\"\",VLOOKUP($A60,FB_30,P$5,0))))","v":""},"",{"$f":"IF($B60=\"\",\"\",_xlfn.NUMBERVALUE(IF(TYPE(VLOOKUP($A60,FB_1,R$5,0))=16,\"\",VLOOKUP($A60,FB_1,R$5,0))&IF(TYPE(VLOOKUP($A60,FB_2,R$5,0))=16,\"\",VLOOKUP($A60,FB_2,R$5,0))&IF(TYPE(VLOOKUP($A60,FB_3,R$5,0))=16,\"\",VLOOKUP($A60,FB_3,R$5,0))&IF(TYPE(VLOOKUP($A60,FB_4,R$5,0))=16,\"\",VLOOKUP($A60,FB_4,R$5,0))&IF(TYPE(VLOOKUP($A60,FB_5,R$5,0))=16,\"\",VLOOKUP($A60,FB_5,R$5,0))&IF(TYPE(VLOOKUP($A60,FB_6,R$5,0))=16,\"\",VLOOKUP($A60,FB_6,R$5,0))&IF(TYPE(VLOOKUP($A60,FB_7,R$5,0))=16,\"\",VLOOKUP($A60,FB_7,R$5,0))&IF(TYPE(VLOOKUP($A60,FB_8,R$5,0))=16,\"\",VLOOKUP($A60,FB_8,R$5,0))&IF(TYPE(VLOOKUP($A60,FB_9,R$5,0))=16,\"\",VLOOKUP($A60,FB_9,R$5,0))&IF(TYPE(VLOOKUP($A60,FB_10,R$5,0))=16,\"\",VLOOKUP($A60,FB_10,R$5,0))&IF(TYPE(VLOOKUP($A60,FB_11,R$5,0))=16,\"\",VLOOKUP($A60,FB_11,R$5,0))&IF(TYPE(VLOOKUP($A60,FB_12,R$5,0))=16,\"\",VLOOKUP($A60,FB_12,R$5,0))&IF(TYPE(VLOOKUP($A60,FB_13,R$5,0))=16,\"\",VLOOKUP($A60,FB_13,R$5,0))&IF(TYPE(VLOOKUP($A60,FB_14,R$5,0))=16,\"\",VLOOKUP($A60,FB_14,R$5,0))&IF(TYPE(VLOOKUP($A60,FB_15,R$5,0))=16,\"\",VLOOKUP($A60,FB_15,R$5,0))&IF(TYPE(VLOOKUP($A60,FB_16,R$5,0))=16,\"\",VLOOKUP($A60,FB_16,R$5,0))&IF(TYPE(VLOOKUP($A60,FB_17,R$5,0))=16,\"\",VLOOKUP($A60,FB_17,R$5,0))&IF(TYPE(VLOOKUP($A60,FB_18,R$5,0))=16,\"\",VLOOKUP($A60,FB_18,R$5,0))&IF(TYPE(VLOOKUP($A60,FB_19,R$5,0))=16,\"\",VLOOKUP($A60,FB_19,R$5,0))&IF(TYPE(VLOOKUP($A60,FB_20,R$5,0))=16,\"\",VLOOKUP($A60,FB_20,R$5,0))&IF(TYPE(VLOOKUP($A60,FB_21,R$5,0))=16,\"\",VLOOKUP($A60,FB_21,R$5,0))&IF(TYPE(VLOOKUP($A60,FB_22,R$5,0))=16,\"\",VLOOKUP($A60,FB_22,R$5,0))&IF(TYPE(VLOOKUP($A60,FB_23,R$5,0))=16,\"\",VLOOKUP($A60,FB_23,R$5,0))&IF(TYPE(VLOOKUP($A60,FB_24,R$5,0))=16,\"\",VLOOKUP($A60,FB_24,R$5,0))&IF(TYPE(VLOOKUP($A60,FB_25,R$5,0))=16,\"\",VLOOKUP($A60,FB_25,R$5,0))&IF(TYPE(VLOOKUP($A60,FB_26,R$5,0))=16,\"\",VLOOKUP($A60,FB_26,R$5,0))&IF(TYPE(VLOOKUP($A60,FB_27,R$5,0))=16,\"\",VLOOKUP($A60,FB_27,R$5,0))&IF(TYPE(VLOOKUP($A60,FB_28,R$5,0))=16,\"\",VLOOKUP($A60,FB_28,R$5,0))&IF(TYPE(VLOOKUP($A60,FB_29,R$5,0))=16,\"\",VLOOKUP($A60,FB_29,R$5,0))&IF(TYPE(VLOOKUP($A60,FB_30,R$5,0))=16,\"\",VLOOKUP($A60,FB_30,R$5,0))))","v":""},{"$f":"IF($B60=\"\",\"\",IF(TYPE(VLOOKUP($A60,FB_1,S$5,0))=16,\"\",VLOOKUP($A60,FB_1,S$5,0))&IF(TYPE(VLOOKUP($A60,FB_2,S$5,0))=16,\"\",VLOOKUP($A60,FB_2,S$5,0))&IF(TYPE(VLOOKUP($A60,FB_3,S$5,0))=16,\"\",VLOOKUP($A60,FB_3,S$5,0))&IF(TYPE(VLOOKUP($A60,FB_4,S$5,0))=16,\"\",VLOOKUP($A60,FB_4,S$5,0))&IF(TYPE(VLOOKUP($A60,FB_5,S$5,0))=16,\"\",VLOOKUP($A60,FB_5,S$5,0))&IF(TYPE(VLOOKUP($A60,FB_6,S$5,0))=16,\"\",VLOOKUP($A60,FB_6,S$5,0))&IF(TYPE(VLOOKUP($A60,FB_7,S$5,0))=16,\"\",VLOOKUP($A60,FB_7,S$5,0))&IF(TYPE(VLOOKUP($A60,FB_8,S$5,0))=16,\"\",VLOOKUP($A60,FB_8,S$5,0))&IF(TYPE(VLOOKUP($A60,FB_9,S$5,0))=16,\"\",VLOOKUP($A60,FB_9,S$5,0))&IF(TYPE(VLOOKUP($A60,FB_10,S$5,0))=16,\"\",VLOOKUP($A60,FB_10,S$5,0))&IF(TYPE(VLOOKUP($A60,FB_11,S$5,0))=16,\"\",VLOOKUP($A60,FB_11,S$5,0))&IF(TYPE(VLOOKUP($A60,FB_12,S$5,0))=16,\"\",VLOOKUP($A60,FB_12,S$5,0))&IF(TYPE(VLOOKUP($A60,FB_13,S$5,0))=16,\"\",VLOOKUP($A60,FB_13,S$5,0))&IF(TYPE(VLOOKUP($A60,FB_14,S$5,0))=16,\"\",VLOOKUP($A60,FB_14,S$5,0))&IF(TYPE(VLOOKUP($A60,FB_15,S$5,0))=16,\"\",VLOOKUP($A60,FB_15,S$5,0))&IF(TYPE(VLOOKUP($A60,FB_16,S$5,0))=16,\"\",VLOOKUP($A60,FB_16,S$5,0))&IF(TYPE(VLOOKUP($A60,FB_17,S$5,0))=16,\"\",VLOOKUP($A60,FB_17,S$5,0))&IF(TYPE(VLOOKUP($A60,FB_18,S$5,0))=16,\"\",VLOOKUP($A60,FB_18,S$5,0))&IF(TYPE(VLOOKUP($A60,FB_19,S$5,0))=16,\"\",VLOOKUP($A60,FB_19,S$5,0))&IF(TYPE(VLOOKUP($A60,FB_20,S$5,0))=16,\"\",VLOOKUP($A60,FB_20,S$5,0))&IF(TYPE(VLOOKUP($A60,FB_21,S$5,0))=16,\"\",VLOOKUP($A60,FB_21,S$5,0))&IF(TYPE(VLOOKUP($A60,FB_22,S$5,0))=16,\"\",VLOOKUP($A60,FB_22,S$5,0))&IF(TYPE(VLOOKUP($A60,FB_23,S$5,0))=16,\"\",VLOOKUP($A60,FB_23,S$5,0))&IF(TYPE(VLOOKUP($A60,FB_24,S$5,0))=16,\"\",VLOOKUP($A60,FB_24,S$5,0))&IF(TYPE(VLOOKUP($A60,FB_25,S$5,0))=16,\"\",VLOOKUP($A60,FB_25,S$5,0))&IF(TYPE(VLOOKUP($A60,FB_26,S$5,0))=16,\"\",VLOOKUP($A60,FB_26,S$5,0))&IF(TYPE(VLOOKUP($A60,FB_27,S$5,0))=16,\"\",VLOOKUP($A60,FB_27,S$5,0))&IF(TYPE(VLOOKUP($A60,FB_28,S$5,0))=16,\"\",VLOOKUP($A60,FB_28,S$5,0))&IF(TYPE(VLOOKUP($A60,FB_29,S$5,0))=16,\"\",VLOOKUP($A60,FB_29,S$5,0))&IF(TYPE(VLOOKUP($A60,FB_30,S$5,0))=16,\"\",VLOOKUP($A60,FB_30,S$5,0)))","v":""},null,null,null,null,null,null,null,null,null,null,null,null,null,null,null,null,"",":","","",""]
["32.",{"$f":"IF(TYPE(VLOOKUP($A61,FB_1,2,0))=16,\"\",VLOOKUP($A61,FB_1,2,0))&IF(TYPE(VLOOKUP($A61,FB_2,2,0))=16,\"\",VLOOKUP($A61,FB_2,2,0))&IF(TYPE(VLOOKUP($A61,FB_3,2,0))=16,\"\",VLOOKUP($A61,FB_3,2,0))&IF(TYPE(VLOOKUP($A61,FB_4,2,0))=16,\"\",VLOOKUP($A61,FB_4,2,0))&IF(TYPE(VLOOKUP($A61,FB_5,2,0))=16,\"\",VLOOKUP($A61,FB_5,2,0))&IF(TYPE(VLOOKUP($A61,FB_6,2,0))=16,\"\",VLOOKUP($A61,FB_6,2,0))&IF(TYPE(VLOOKUP($A61,FB_7,2,0))=16,\"\",VLOOKUP($A61,FB_7,2,0))&IF(TYPE(VLOOKUP($A61,FB_8,2,0))=16,\"\",VLOOKUP($A61,FB_8,2,0))&IF(TYPE(VLOOKUP($A61,FB_9,2,0))=16,\"\",VLOOKUP($A61,FB_9,2,0))&IF(TYPE(VLOOKUP($A61,FB_10,2,0))=16,\"\",VLOOKUP($A61,FB_10,2,0))&IF(TYPE(VLOOKUP($A61,FB_11,2,0))=16,\"\",VLOOKUP($A61,FB_11,2,0))&IF(TYPE(VLOOKUP($A61,FB_12,2,0))=16,\"\",VLOOKUP($A61,FB_12,2,0))&IF(TYPE(VLOOKUP($A61,FB_13,2,0))=16,\"\",VLOOKUP($A61,FB_13,2,0))&IF(TYPE(VLOOKUP($A61,FB_14,2,0))=16,\"\",VLOOKUP($A61,FB_14,2,0))&IF(TYPE(VLOOKUP($A61,FB_15,2,0))=16,\"\",VLOOKUP($A61,FB_15,2,0))&IF(TYPE(VLOOKUP($A61,FB_16,2,0))=16,\"\",VLOOKUP($A61,FB_16,2,0))&IF(TYPE(VLOOKUP($A61,FB_17,2,0))=16,\"\",VLOOKUP($A61,FB_17,2,0))&IF(TYPE(VLOOKUP($A61,FB_18,2,0))=16,\"\",VLOOKUP($A61,FB_18,2,0))&IF(TYPE(VLOOKUP($A61,FB_19,2,0))=16,\"\",VLOOKUP($A61,FB_19,2,0))&IF(TYPE(VLOOKUP($A61,FB_20,2,0))=16,\"\",VLOOKUP($A61,FB_20,2,0))&IF(TYPE(VLOOKUP($A61,FB_21,2,0))=16,\"\",VLOOKUP($A61,FB_21,2,0))&IF(TYPE(VLOOKUP($A61,FB_22,2,0))=16,\"\",VLOOKUP($A61,FB_22,2,0))&IF(TYPE(VLOOKUP($A61,FB_23,2,0))=16,\"\",VLOOKUP($A61,FB_23,2,0))&IF(TYPE(VLOOKUP($A61,FB_24,2,0))=16,\"\",VLOOKUP($A61,FB_24,2,0))&IF(TYPE(VLOOKUP($A61,FB_25,2,0))=16,\"\",VLOOKUP($A61,FB_25,2,0))&IF(TYPE(VLOOKUP($A61,FB_26,2,0))=16,\"\",VLOOKUP($A61,FB_26,2,0))&IF(TYPE(VLOOKUP($A61,FB_27,2,0))=16,\"\",VLOOKUP($A61,FB_27,2,0))&IF(TYPE(VLOOKUP($A61,FB_28,2,0))=16,\"\",VLOOKUP($A61,FB_28,2,0))&IF(TYPE(VLOOKUP($A61,FB_29,2,0))=16,\"\",VLOOKUP($A61,FB_29,2,0))&IF(TYPE(VLOOKUP($A61,FB_30,2,0))=16,\"\",VLOOKUP($A61,FB_30,2,0))","v":""},null,{"$f":"IF($B61=\"\",\"\",_xlfn.NUMBERVALUE(IF(TYPE(VLOOKUP($A61,FB_1,P$5,0))=16,\"\",VLOOKUP($A61,FB_1,P$5,0))&IF(TYPE(VLOOKUP($A61,FB_2,P$5,0))=16,\"\",VLOOKUP($A61,FB_2,P$5,0))&IF(TYPE(VLOOKUP($A61,FB_3,P$5,0))=16,\"\",VLOOKUP($A61,FB_3,P$5,0))&IF(TYPE(VLOOKUP($A61,FB_4,P$5,0))=16,\"\",VLOOKUP($A61,FB_4,P$5,0))&IF(TYPE(VLOOKUP($A61,FB_5,P$5,0))=16,\"\",VLOOKUP($A61,FB_5,P$5,0))&IF(TYPE(VLOOKUP($A61,FB_6,P$5,0))=16,\"\",VLOOKUP($A61,FB_6,P$5,0))&IF(TYPE(VLOOKUP($A61,FB_7,P$5,0))=16,\"\",VLOOKUP($A61,FB_7,P$5,0))&IF(TYPE(VLOOKUP($A61,FB_8,P$5,0))=16,\"\",VLOOKUP($A61,FB_8,P$5,0))&IF(TYPE(VLOOKUP($A61,FB_9,P$5,0))=16,\"\",VLOOKUP($A61,FB_9,P$5,0))&IF(TYPE(VLOOKUP($A61,FB_10,P$5,0))=16,\"\",VLOOKUP($A61,FB_10,P$5,0))&IF(TYPE(VLOOKUP($A61,FB_11,P$5,0))=16,\"\",VLOOKUP($A61,FB_11,P$5,0))&IF(TYPE(VLOOKUP($A61,FB_12,P$5,0))=16,\"\",VLOOKUP($A61,FB_12,P$5,0))&IF(TYPE(VLOOKUP($A61,FB_13,P$5,0))=16,\"\",VLOOKUP($A61,FB_13,P$5,0))&IF(TYPE(VLOOKUP($A61,FB_14,P$5,0))=16,\"\",VLOOKUP($A61,FB_14,P$5,0))&IF(TYPE(VLOOKUP($A61,FB_15,P$5,0))=16,\"\",VLOOKUP($A61,FB_15,P$5,0))&IF(TYPE(VLOOKUP($A61,FB_16,P$5,0))=16,\"\",VLOOKUP($A61,FB_16,P$5,0))&IF(TYPE(VLOOKUP($A61,FB_17,P$5,0))=16,\"\",VLOOKUP($A61,FB_17,P$5,0))&IF(TYPE(VLOOKUP($A61,FB_18,P$5,0))=16,\"\",VLOOKUP($A61,FB_18,P$5,0))&IF(TYPE(VLOOKUP($A61,FB_19,P$5,0))=16,\"\",VLOOKUP($A61,FB_19,P$5,0))&IF(TYPE(VLOOKUP($A61,FB_20,P$5,0))=16,\"\",VLOOKUP($A61,FB_20,P$5,0))&IF(TYPE(VLOOKUP($A61,FB_21,P$5,0))=16,\"\",VLOOKUP($A61,FB_21,P$5,0))&IF(TYPE(VLOOKUP($A61,FB_22,P$5,0))=16,\"\",VLOOKUP($A61,FB_22,P$5,0))&IF(TYPE(VLOOKUP($A61,FB_23,P$5,0))=16,\"\",VLOOKUP($A61,FB_23,P$5,0))&IF(TYPE(VLOOKUP($A61,FB_24,P$5,0))=16,\"\",VLOOKUP($A61,FB_24,P$5,0))&IF(TYPE(VLOOKUP($A61,FB_25,P$5,0))=16,\"\",VLOOKUP($A61,FB_25,P$5,0))&IF(TYPE(VLOOKUP($A61,FB_26,P$5,0))=16,\"\",VLOOKUP($A61,FB_26,P$5,0))&IF(TYPE(VLOOKUP($A61,FB_27,P$5,0))=16,\"\",VLOOKUP($A61,FB_27,P$5,0))&IF(TYPE(VLOOKUP($A61,FB_28,P$5,0))=16,\"\",VLOOKUP($A61,FB_28,P$5,0))&IF(TYPE(VLOOKUP($A61,FB_29,P$5,0))=16,\"\",VLOOKUP($A61,FB_29,P$5,0))&IF(TYPE(VLOOKUP($A61,FB_30,P$5,0))=16,\"\",VLOOKUP($A61,FB_30,P$5,0))))","v":""},"",{"$f":"IF($B61=\"\",\"\",_xlfn.NUMBERVALUE(IF(TYPE(VLOOKUP($A61,FB_1,R$5,0))=16,\"\",VLOOKUP($A61,FB_1,R$5,0))&IF(TYPE(VLOOKUP($A61,FB_2,R$5,0))=16,\"\",VLOOKUP($A61,FB_2,R$5,0))&IF(TYPE(VLOOKUP($A61,FB_3,R$5,0))=16,\"\",VLOOKUP($A61,FB_3,R$5,0))&IF(TYPE(VLOOKUP($A61,FB_4,R$5,0))=16,\"\",VLOOKUP($A61,FB_4,R$5,0))&IF(TYPE(VLOOKUP($A61,FB_5,R$5,0))=16,\"\",VLOOKUP($A61,FB_5,R$5,0))&IF(TYPE(VLOOKUP($A61,FB_6,R$5,0))=16,\"\",VLOOKUP($A61,FB_6,R$5,0))&IF(TYPE(VLOOKUP($A61,FB_7,R$5,0))=16,\"\",VLOOKUP($A61,FB_7,R$5,0))&IF(TYPE(VLOOKUP($A61,FB_8,R$5,0))=16,\"\",VLOOKUP($A61,FB_8,R$5,0))&IF(TYPE(VLOOKUP($A61,FB_9,R$5,0))=16,\"\",VLOOKUP($A61,FB_9,R$5,0))&IF(TYPE(VLOOKUP($A61,FB_10,R$5,0))=16,\"\",VLOOKUP($A61,FB_10,R$5,0))&IF(TYPE(VLOOKUP($A61,FB_11,R$5,0))=16,\"\",VLOOKUP($A61,FB_11,R$5,0))&IF(TYPE(VLOOKUP($A61,FB_12,R$5,0))=16,\"\",VLOOKUP($A61,FB_12,R$5,0))&IF(TYPE(VLOOKUP($A61,FB_13,R$5,0))=16,\"\",VLOOKUP($A61,FB_13,R$5,0))&IF(TYPE(VLOOKUP($A61,FB_14,R$5,0))=16,\"\",VLOOKUP($A61,FB_14,R$5,0))&IF(TYPE(VLOOKUP($A61,FB_15,R$5,0))=16,\"\",VLOOKUP($A61,FB_15,R$5,0))&IF(TYPE(VLOOKUP($A61,FB_16,R$5,0))=16,\"\",VLOOKUP($A61,FB_16,R$5,0))&IF(TYPE(VLOOKUP($A61,FB_17,R$5,0))=16,\"\",VLOOKUP($A61,FB_17,R$5,0))&IF(TYPE(VLOOKUP($A61,FB_18,R$5,0))=16,\"\",VLOOKUP($A61,FB_18,R$5,0))&IF(TYPE(VLOOKUP($A61,FB_19,R$5,0))=16,\"\",VLOOKUP($A61,FB_19,R$5,0))&IF(TYPE(VLOOKUP($A61,FB_20,R$5,0))=16,\"\",VLOOKUP($A61,FB_20,R$5,0))&IF(TYPE(VLOOKUP($A61,FB_21,R$5,0))=16,\"\",VLOOKUP($A61,FB_21,R$5,0))&IF(TYPE(VLOOKUP($A61,FB_22,R$5,0))=16,\"\",VLOOKUP($A61,FB_22,R$5,0))&IF(TYPE(VLOOKUP($A61,FB_23,R$5,0))=16,\"\",VLOOKUP($A61,FB_23,R$5,0))&IF(TYPE(VLOOKUP($A61,FB_24,R$5,0))=16,\"\",VLOOKUP($A61,FB_24,R$5,0))&IF(TYPE(VLOOKUP($A61,FB_25,R$5,0))=16,\"\",VLOOKUP($A61,FB_25,R$5,0))&IF(TYPE(VLOOKUP($A61,FB_26,R$5,0))=16,\"\",VLOOKUP($A61,FB_26,R$5,0))&IF(TYPE(VLOOKUP($A61,FB_27,R$5,0))=16,\"\",VLOOKUP($A61,FB_27,R$5,0))&IF(TYPE(VLOOKUP($A61,FB_28,R$5,0))=16,\"\",VLOOKUP($A61,FB_28,R$5,0))&IF(TYPE(VLOOKUP($A61,FB_29,R$5,0))=16,\"\",VLOOKUP($A61,FB_29,R$5,0))&IF(TYPE(VLOOKUP($A61,FB_30,R$5,0))=16,\"\",VLOOKUP($A61,FB_30,R$5,0))))","v":""},{"$f":"IF($B61=\"\",\"\",IF(TYPE(VLOOKUP($A61,FB_1,S$5,0))=16,\"\",VLOOKUP($A61,FB_1,S$5,0))&IF(TYPE(VLOOKUP($A61,FB_2,S$5,0))=16,\"\",VLOOKUP($A61,FB_2,S$5,0))&IF(TYPE(VLOOKUP($A61,FB_3,S$5,0))=16,\"\",VLOOKUP($A61,FB_3,S$5,0))&IF(TYPE(VLOOKUP($A61,FB_4,S$5,0))=16,\"\",VLOOKUP($A61,FB_4,S$5,0))&IF(TYPE(VLOOKUP($A61,FB_5,S$5,0))=16,\"\",VLOOKUP($A61,FB_5,S$5,0))&IF(TYPE(VLOOKUP($A61,FB_6,S$5,0))=16,\"\",VLOOKUP($A61,FB_6,S$5,0))&IF(TYPE(VLOOKUP($A61,FB_7,S$5,0))=16,\"\",VLOOKUP($A61,FB_7,S$5,0))&IF(TYPE(VLOOKUP($A61,FB_8,S$5,0))=16,\"\",VLOOKUP($A61,FB_8,S$5,0))&IF(TYPE(VLOOKUP($A61,FB_9,S$5,0))=16,\"\",VLOOKUP($A61,FB_9,S$5,0))&IF(TYPE(VLOOKUP($A61,FB_10,S$5,0))=16,\"\",VLOOKUP($A61,FB_10,S$5,0))&IF(TYPE(VLOOKUP($A61,FB_11,S$5,0))=16,\"\",VLOOKUP($A61,FB_11,S$5,0))&IF(TYPE(VLOOKUP($A61,FB_12,S$5,0))=16,\"\",VLOOKUP($A61,FB_12,S$5,0))&IF(TYPE(VLOOKUP($A61,FB_13,S$5,0))=16,\"\",VLOOKUP($A61,FB_13,S$5,0))&IF(TYPE(VLOOKUP($A61,FB_14,S$5,0))=16,\"\",VLOOKUP($A61,FB_14,S$5,0))&IF(TYPE(VLOOKUP($A61,FB_15,S$5,0))=16,\"\",VLOOKUP($A61,FB_15,S$5,0))&IF(TYPE(VLOOKUP($A61,FB_16,S$5,0))=16,\"\",VLOOKUP($A61,FB_16,S$5,0))&IF(TYPE(VLOOKUP($A61,FB_17,S$5,0))=16,\"\",VLOOKUP($A61,FB_17,S$5,0))&IF(TYPE(VLOOKUP($A61,FB_18,S$5,0))=16,\"\",VLOOKUP($A61,FB_18,S$5,0))&IF(TYPE(VLOOKUP($A61,FB_19,S$5,0))=16,\"\",VLOOKUP($A61,FB_19,S$5,0))&IF(TYPE(VLOOKUP($A61,FB_20,S$5,0))=16,\"\",VLOOKUP($A61,FB_20,S$5,0))&IF(TYPE(VLOOKUP($A61,FB_21,S$5,0))=16,\"\",VLOOKUP($A61,FB_21,S$5,0))&IF(TYPE(VLOOKUP($A61,FB_22,S$5,0))=16,\"\",VLOOKUP($A61,FB_22,S$5,0))&IF(TYPE(VLOOKUP($A61,FB_23,S$5,0))=16,\"\",VLOOKUP($A61,FB_23,S$5,0))&IF(TYPE(VLOOKUP($A61,FB_24,S$5,0))=16,\"\",VLOOKUP($A61,FB_24,S$5,0))&IF(TYPE(VLOOKUP($A61,FB_25,S$5,0))=16,\"\",VLOOKUP($A61,FB_25,S$5,0))&IF(TYPE(VLOOKUP($A61,FB_26,S$5,0))=16,\"\",VLOOKUP($A61,FB_26,S$5,0))&IF(TYPE(VLOOKUP($A61,FB_27,S$5,0))=16,\"\",VLOOKUP($A61,FB_27,S$5,0))&IF(TYPE(VLOOKUP($A61,FB_28,S$5,0))=16,\"\",VLOOKUP($A61,FB_28,S$5,0))&IF(TYPE(VLOOKUP($A61,FB_29,S$5,0))=16,\"\",VLOOKUP($A61,FB_29,S$5,0))&IF(TYPE(VLOOKUP($A61,FB_30,S$5,0))=16,\"\",VLOOKUP($A61,FB_30,S$5,0)))","v":""},null,null,null,null,null,null,null,null,null,null,null,null,null,null,null,null,"",":","","",""]
["33.",{"$f":"IF(TYPE(VLOOKUP($A62,FB_1,2,0))=16,\"\",VLOOKUP($A62,FB_1,2,0))&IF(TYPE(VLOOKUP($A62,FB_2,2,0))=16,\"\",VLOOKUP($A62,FB_2,2,0))&IF(TYPE(VLOOKUP($A62,FB_3,2,0))=16,\"\",VLOOKUP($A62,FB_3,2,0))&IF(TYPE(VLOOKUP($A62,FB_4,2,0))=16,\"\",VLOOKUP($A62,FB_4,2,0))&IF(TYPE(VLOOKUP($A62,FB_5,2,0))=16,\"\",VLOOKUP($A62,FB_5,2,0))&IF(TYPE(VLOOKUP($A62,FB_6,2,0))=16,\"\",VLOOKUP($A62,FB_6,2,0))&IF(TYPE(VLOOKUP($A62,FB_7,2,0))=16,\"\",VLOOKUP($A62,FB_7,2,0))&IF(TYPE(VLOOKUP($A62,FB_8,2,0))=16,\"\",VLOOKUP($A62,FB_8,2,0))&IF(TYPE(VLOOKUP($A62,FB_9,2,0))=16,\"\",VLOOKUP($A62,FB_9,2,0))&IF(TYPE(VLOOKUP($A62,FB_10,2,0))=16,\"\",VLOOKUP($A62,FB_10,2,0))&IF(TYPE(VLOOKUP($A62,FB_11,2,0))=16,\"\",VLOOKUP($A62,FB_11,2,0))&IF(TYPE(VLOOKUP($A62,FB_12,2,0))=16,\"\",VLOOKUP($A62,FB_12,2,0))&IF(TYPE(VLOOKUP($A62,FB_13,2,0))=16,\"\",VLOOKUP($A62,FB_13,2,0))&IF(TYPE(VLOOKUP($A62,FB_14,2,0))=16,\"\",VLOOKUP($A62,FB_14,2,0))&IF(TYPE(VLOOKUP($A62,FB_15,2,0))=16,\"\",VLOOKUP($A62,FB_15,2,0))&IF(TYPE(VLOOKUP($A62,FB_16,2,0))=16,\"\",VLOOKUP($A62,FB_16,2,0))&IF(TYPE(VLOOKUP($A62,FB_17,2,0))=16,\"\",VLOOKUP($A62,FB_17,2,0))&IF(TYPE(VLOOKUP($A62,FB_18,2,0))=16,\"\",VLOOKUP($A62,FB_18,2,0))&IF(TYPE(VLOOKUP($A62,FB_19,2,0))=16,\"\",VLOOKUP($A62,FB_19,2,0))&IF(TYPE(VLOOKUP($A62,FB_20,2,0))=16,\"\",VLOOKUP($A62,FB_20,2,0))&IF(TYPE(VLOOKUP($A62,FB_21,2,0))=16,\"\",VLOOKUP($A62,FB_21,2,0))&IF(TYPE(VLOOKUP($A62,FB_22,2,0))=16,\"\",VLOOKUP($A62,FB_22,2,0))&IF(TYPE(VLOOKUP($A62,FB_23,2,0))=16,\"\",VLOOKUP($A62,FB_23,2,0))&IF(TYPE(VLOOKUP($A62,FB_24,2,0))=16,\"\",VLOOKUP($A62,FB_24,2,0))&IF(TYPE(VLOOKUP($A62,FB_25,2,0))=16,\"\",VLOOKUP($A62,FB_25,2,0))&IF(TYPE(VLOOKUP($A62,FB_26,2,0))=16,\"\",VLOOKUP($A62,FB_26,2,0))&IF(TYPE(VLOOKUP($A62,FB_27,2,0))=16,\"\",VLOOKUP($A62,FB_27,2,0))&IF(TYPE(VLOOKUP($A62,FB_28,2,0))=16,\"\",VLOOKUP($A62,FB_28,2,0))&IF(TYPE(VLOOKUP($A62,FB_29,2,0))=16,\"\",VLOOKUP($A62,FB_29,2,0))&IF(TYPE(VLOOKUP($A62,FB_30,2,0))=16,\"\",VLOOKUP($A62,FB_30,2,0))","v":""},null,{"$f":"IF($B62=\"\",\"\",_xlfn.NUMBERVALUE(IF(TYPE(VLOOKUP($A62,FB_1,P$5,0))=16,\"\",VLOOKUP($A62,FB_1,P$5,0))&IF(TYPE(VLOOKUP($A62,FB_2,P$5,0))=16,\"\",VLOOKUP($A62,FB_2,P$5,0))&IF(TYPE(VLOOKUP($A62,FB_3,P$5,0))=16,\"\",VLOOKUP($A62,FB_3,P$5,0))&IF(TYPE(VLOOKUP($A62,FB_4,P$5,0))=16,\"\",VLOOKUP($A62,FB_4,P$5,0))&IF(TYPE(VLOOKUP($A62,FB_5,P$5,0))=16,\"\",VLOOKUP($A62,FB_5,P$5,0))&IF(TYPE(VLOOKUP($A62,FB_6,P$5,0))=16,\"\",VLOOKUP($A62,FB_6,P$5,0))&IF(TYPE(VLOOKUP($A62,FB_7,P$5,0))=16,\"\",VLOOKUP($A62,FB_7,P$5,0))&IF(TYPE(VLOOKUP($A62,FB_8,P$5,0))=16,\"\",VLOOKUP($A62,FB_8,P$5,0))&IF(TYPE(VLOOKUP($A62,FB_9,P$5,0))=16,\"\",VLOOKUP($A62,FB_9,P$5,0))&IF(TYPE(VLOOKUP($A62,FB_10,P$5,0))=16,\"\",VLOOKUP($A62,FB_10,P$5,0))&IF(TYPE(VLOOKUP($A62,FB_11,P$5,0))=16,\"\",VLOOKUP($A62,FB_11,P$5,0))&IF(TYPE(VLOOKUP($A62,FB_12,P$5,0))=16,\"\",VLOOKUP($A62,FB_12,P$5,0))&IF(TYPE(VLOOKUP($A62,FB_13,P$5,0))=16,\"\",VLOOKUP($A62,FB_13,P$5,0))&IF(TYPE(VLOOKUP($A62,FB_14,P$5,0))=16,\"\",VLOOKUP($A62,FB_14,P$5,0))&IF(TYPE(VLOOKUP($A62,FB_15,P$5,0))=16,\"\",VLOOKUP($A62,FB_15,P$5,0))&IF(TYPE(VLOOKUP($A62,FB_16,P$5,0))=16,\"\",VLOOKUP($A62,FB_16,P$5,0))&IF(TYPE(VLOOKUP($A62,FB_17,P$5,0))=16,\"\",VLOOKUP($A62,FB_17,P$5,0))&IF(TYPE(VLOOKUP($A62,FB_18,P$5,0))=16,\"\",VLOOKUP($A62,FB_18,P$5,0))&IF(TYPE(VLOOKUP($A62,FB_19,P$5,0))=16,\"\",VLOOKUP($A62,FB_19,P$5,0))&IF(TYPE(VLOOKUP($A62,FB_20,P$5,0))=16,\"\",VLOOKUP($A62,FB_20,P$5,0))&IF(TYPE(VLOOKUP($A62,FB_21,P$5,0))=16,\"\",VLOOKUP($A62,FB_21,P$5,0))&IF(TYPE(VLOOKUP($A62,FB_22,P$5,0))=16,\"\",VLOOKUP($A62,FB_22,P$5,0))&IF(TYPE(VLOOKUP($A62,FB_23,P$5,0))=16,\"\",VLOOKUP($A62,FB_23,P$5,0))&IF(TYPE(VLOOKUP($A62,FB_24,P$5,0))=16,\"\",VLOOKUP($A62,FB_24,P$5,0))&IF(TYPE(VLOOKUP($A62,FB_25,P$5,0))=16,\"\",VLOOKUP($A62,FB_25,P$5,0))&IF(TYPE(VLOOKUP($A62,FB_26,P$5,0))=16,\"\",VLOOKUP($A62,FB_26,P$5,0))&IF(TYPE(VLOOKUP($A62,FB_27,P$5,0))=16,\"\",VLOOKUP($A62,FB_27,P$5,0))&IF(TYPE(VLOOKUP($A62,FB_28,P$5,0))=16,\"\",VLOOKUP($A62,FB_28,P$5,0))&IF(TYPE(VLOOKUP($A62,FB_29,P$5,0))=16,\"\",VLOOKUP($A62,FB_29,P$5,0))&IF(TYPE(VLOOKUP($A62,FB_30,P$5,0))=16,\"\",VLOOKUP($A62,FB_30,P$5,0))))","v":""},"",{"$f":"IF($B62=\"\",\"\",_xlfn.NUMBERVALUE(IF(TYPE(VLOOKUP($A62,FB_1,R$5,0))=16,\"\",VLOOKUP($A62,FB_1,R$5,0))&IF(TYPE(VLOOKUP($A62,FB_2,R$5,0))=16,\"\",VLOOKUP($A62,FB_2,R$5,0))&IF(TYPE(VLOOKUP($A62,FB_3,R$5,0))=16,\"\",VLOOKUP($A62,FB_3,R$5,0))&IF(TYPE(VLOOKUP($A62,FB_4,R$5,0))=16,\"\",VLOOKUP($A62,FB_4,R$5,0))&IF(TYPE(VLOOKUP($A62,FB_5,R$5,0))=16,\"\",VLOOKUP($A62,FB_5,R$5,0))&IF(TYPE(VLOOKUP($A62,FB_6,R$5,0))=16,\"\",VLOOKUP($A62,FB_6,R$5,0))&IF(TYPE(VLOOKUP($A62,FB_7,R$5,0))=16,\"\",VLOOKUP($A62,FB_7,R$5,0))&IF(TYPE(VLOOKUP($A62,FB_8,R$5,0))=16,\"\",VLOOKUP($A62,FB_8,R$5,0))&IF(TYPE(VLOOKUP($A62,FB_9,R$5,0))=16,\"\",VLOOKUP($A62,FB_9,R$5,0))&IF(TYPE(VLOOKUP($A62,FB_10,R$5,0))=16,\"\",VLOOKUP($A62,FB_10,R$5,0))&IF(TYPE(VLOOKUP($A62,FB_11,R$5,0))=16,\"\",VLOOKUP($A62,FB_11,R$5,0))&IF(TYPE(VLOOKUP($A62,FB_12,R$5,0))=16,\"\",VLOOKUP($A62,FB_12,R$5,0))&IF(TYPE(VLOOKUP($A62,FB_13,R$5,0))=16,\"\",VLOOKUP($A62,FB_13,R$5,0))&IF(TYPE(VLOOKUP($A62,FB_14,R$5,0))=16,\"\",VLOOKUP($A62,FB_14,R$5,0))&IF(TYPE(VLOOKUP($A62,FB_15,R$5,0))=16,\"\",VLOOKUP($A62,FB_15,R$5,0))&IF(TYPE(VLOOKUP($A62,FB_16,R$5,0))=16,\"\",VLOOKUP($A62,FB_16,R$5,0))&IF(TYPE(VLOOKUP($A62,FB_17,R$5,0))=16,\"\",VLOOKUP($A62,FB_17,R$5,0))&IF(TYPE(VLOOKUP($A62,FB_18,R$5,0))=16,\"\",VLOOKUP($A62,FB_18,R$5,0))&IF(TYPE(VLOOKUP($A62,FB_19,R$5,0))=16,\"\",VLOOKUP($A62,FB_19,R$5,0))&IF(TYPE(VLOOKUP($A62,FB_20,R$5,0))=16,\"\",VLOOKUP($A62,FB_20,R$5,0))&IF(TYPE(VLOOKUP($A62,FB_21,R$5,0))=16,\"\",VLOOKUP($A62,FB_21,R$5,0))&IF(TYPE(VLOOKUP($A62,FB_22,R$5,0))=16,\"\",VLOOKUP($A62,FB_22,R$5,0))&IF(TYPE(VLOOKUP($A62,FB_23,R$5,0))=16,\"\",VLOOKUP($A62,FB_23,R$5,0))&IF(TYPE(VLOOKUP($A62,FB_24,R$5,0))=16,\"\",VLOOKUP($A62,FB_24,R$5,0))&IF(TYPE(VLOOKUP($A62,FB_25,R$5,0))=16,\"\",VLOOKUP($A62,FB_25,R$5,0))&IF(TYPE(VLOOKUP($A62,FB_26,R$5,0))=16,\"\",VLOOKUP($A62,FB_26,R$5,0))&IF(TYPE(VLOOKUP($A62,FB_27,R$5,0))=16,\"\",VLOOKUP($A62,FB_27,R$5,0))&IF(TYPE(VLOOKUP($A62,FB_28,R$5,0))=16,\"\",VLOOKUP($A62,FB_28,R$5,0))&IF(TYPE(VLOOKUP($A62,FB_29,R$5,0))=16,\"\",VLOOKUP($A62,FB_29,R$5,0))&IF(TYPE(VLOOKUP($A62,FB_30,R$5,0))=16,\"\",VLOOKUP($A62,FB_30,R$5,0))))","v":""},{"$f":"IF($B62=\"\",\"\",IF(TYPE(VLOOKUP($A62,FB_1,S$5,0))=16,\"\",VLOOKUP($A62,FB_1,S$5,0))&IF(TYPE(VLOOKUP($A62,FB_2,S$5,0))=16,\"\",VLOOKUP($A62,FB_2,S$5,0))&IF(TYPE(VLOOKUP($A62,FB_3,S$5,0))=16,\"\",VLOOKUP($A62,FB_3,S$5,0))&IF(TYPE(VLOOKUP($A62,FB_4,S$5,0))=16,\"\",VLOOKUP($A62,FB_4,S$5,0))&IF(TYPE(VLOOKUP($A62,FB_5,S$5,0))=16,\"\",VLOOKUP($A62,FB_5,S$5,0))&IF(TYPE(VLOOKUP($A62,FB_6,S$5,0))=16,\"\",VLOOKUP($A62,FB_6,S$5,0))&IF(TYPE(VLOOKUP($A62,FB_7,S$5,0))=16,\"\",VLOOKUP($A62,FB_7,S$5,0))&IF(TYPE(VLOOKUP($A62,FB_8,S$5,0))=16,\"\",VLOOKUP($A62,FB_8,S$5,0))&IF(TYPE(VLOOKUP($A62,FB_9,S$5,0))=16,\"\",VLOOKUP($A62,FB_9,S$5,0))&IF(TYPE(VLOOKUP($A62,FB_10,S$5,0))=16,\"\",VLOOKUP($A62,FB_10,S$5,0))&IF(TYPE(VLOOKUP($A62,FB_11,S$5,0))=16,\"\",VLOOKUP($A62,FB_11,S$5,0))&IF(TYPE(VLOOKUP($A62,FB_12,S$5,0))=16,\"\",VLOOKUP($A62,FB_12,S$5,0))&IF(TYPE(VLOOKUP($A62,FB_13,S$5,0))=16,\"\",VLOOKUP($A62,FB_13,S$5,0))&IF(TYPE(VLOOKUP($A62,FB_14,S$5,0))=16,\"\",VLOOKUP($A62,FB_14,S$5,0))&IF(TYPE(VLOOKUP($A62,FB_15,S$5,0))=16,\"\",VLOOKUP($A62,FB_15,S$5,0))&IF(TYPE(VLOOKUP($A62,FB_16,S$5,0))=16,\"\",VLOOKUP($A62,FB_16,S$5,0))&IF(TYPE(VLOOKUP($A62,FB_17,S$5,0))=16,\"\",VLOOKUP($A62,FB_17,S$5,0))&IF(TYPE(VLOOKUP($A62,FB_18,S$5,0))=16,\"\",VLOOKUP($A62,FB_18,S$5,0))&IF(TYPE(VLOOKUP($A62,FB_19,S$5,0))=16,\"\",VLOOKUP($A62,FB_19,S$5,0))&IF(TYPE(VLOOKUP($A62,FB_20,S$5,0))=16,\"\",VLOOKUP($A62,FB_20,S$5,0))&IF(TYPE(VLOOKUP($A62,FB_21,S$5,0))=16,\"\",VLOOKUP($A62,FB_21,S$5,0))&IF(TYPE(VLOOKUP($A62,FB_22,S$5,0))=16,\"\",VLOOKUP($A62,FB_22,S$5,0))&IF(TYPE(VLOOKUP($A62,FB_23,S$5,0))=16,\"\",VLOOKUP($A62,FB_23,S$5,0))&IF(TYPE(VLOOKUP($A62,FB_24,S$5,0))=16,\"\",VLOOKUP($A62,FB_24,S$5,0))&IF(TYPE(VLOOKUP($A62,FB_25,S$5,0))=16,\"\",VLOOKUP($A62,FB_25,S$5,0))&IF(TYPE(VLOOKUP($A62,FB_26,S$5,0))=16,\"\",VLOOKUP($A62,FB_26,S$5,0))&IF(TYPE(VLOOKUP($A62,FB_27,S$5,0))=16,\"\",VLOOKUP($A62,FB_27,S$5,0))&IF(TYPE(VLOOKUP($A62,FB_28,S$5,0))=16,\"\",VLOOKUP($A62,FB_28,S$5,0))&IF(TYPE(VLOOKUP($A62,FB_29,S$5,0))=16,\"\",VLOOKUP($A62,FB_29,S$5,0))&IF(TYPE(VLOOKUP($A62,FB_30,S$5,0))=16,\"\",VLOOKUP($A62,FB_30,S$5,0)))","v":""},null,null,null,null,null,null,null,null,null,null,null,null,null,null,null,null,"",":","","",""]
["34.",{"$f":"IF(TYPE(VLOOKUP($A63,FB_1,2,0))=16,\"\",VLOOKUP($A63,FB_1,2,0))&IF(TYPE(VLOOKUP($A63,FB_2,2,0))=16,\"\",VLOOKUP($A63,FB_2,2,0))&IF(TYPE(VLOOKUP($A63,FB_3,2,0))=16,\"\",VLOOKUP($A63,FB_3,2,0))&IF(TYPE(VLOOKUP($A63,FB_4,2,0))=16,\"\",VLOOKUP($A63,FB_4,2,0))&IF(TYPE(VLOOKUP($A63,FB_5,2,0))=16,\"\",VLOOKUP($A63,FB_5,2,0))&IF(TYPE(VLOOKUP($A63,FB_6,2,0))=16,\"\",VLOOKUP($A63,FB_6,2,0))&IF(TYPE(VLOOKUP($A63,FB_7,2,0))=16,\"\",VLOOKUP($A63,FB_7,2,0))&IF(TYPE(VLOOKUP($A63,FB_8,2,0))=16,\"\",VLOOKUP($A63,FB_8,2,0))&IF(TYPE(VLOOKUP($A63,FB_9,2,0))=16,\"\",VLOOKUP($A63,FB_9,2,0))&IF(TYPE(VLOOKUP($A63,FB_10,2,0))=16,\"\",VLOOKUP($A63,FB_10,2,0))&IF(TYPE(VLOOKUP($A63,FB_11,2,0))=16,\"\",VLOOKUP($A63,FB_11,2,0))&IF(TYPE(VLOOKUP($A63,FB_12,2,0))=16,\"\",VLOOKUP($A63,FB_12,2,0))&IF(TYPE(VLOOKUP($A63,FB_13,2,0))=16,\"\",VLOOKUP($A63,FB_13,2,0))&IF(TYPE(VLOOKUP($A63,FB_14,2,0))=16,\"\",VLOOKUP($A63,FB_14,2,0))&IF(TYPE(VLOOKUP($A63,FB_15,2,0))=16,\"\",VLOOKUP($A63,FB_15,2,0))&IF(TYPE(VLOOKUP($A63,FB_16,2,0))=16,\"\",VLOOKUP($A63,FB_16,2,0))&IF(TYPE(VLOOKUP($A63,FB_17,2,0))=16,\"\",VLOOKUP($A63,FB_17,2,0))&IF(TYPE(VLOOKUP($A63,FB_18,2,0))=16,\"\",VLOOKUP($A63,FB_18,2,0))&IF(TYPE(VLOOKUP($A63,FB_19,2,0))=16,\"\",VLOOKUP($A63,FB_19,2,0))&IF(TYPE(VLOOKUP($A63,FB_20,2,0))=16,\"\",VLOOKUP($A63,FB_20,2,0))&IF(TYPE(VLOOKUP($A63,FB_21,2,0))=16,\"\",VLOOKUP($A63,FB_21,2,0))&IF(TYPE(VLOOKUP($A63,FB_22,2,0))=16,\"\",VLOOKUP($A63,FB_22,2,0))&IF(TYPE(VLOOKUP($A63,FB_23,2,0))=16,\"\",VLOOKUP($A63,FB_23,2,0))&IF(TYPE(VLOOKUP($A63,FB_24,2,0))=16,\"\",VLOOKUP($A63,FB_24,2,0))&IF(TYPE(VLOOKUP($A63,FB_25,2,0))=16,\"\",VLOOKUP($A63,FB_25,2,0))&IF(TYPE(VLOOKUP($A63,FB_26,2,0))=16,\"\",VLOOKUP($A63,FB_26,2,0))&IF(TYPE(VLOOKUP($A63,FB_27,2,0))=16,\"\",VLOOKUP($A63,FB_27,2,0))&IF(TYPE(VLOOKUP($A63,FB_28,2,0))=16,\"\",VLOOKUP($A63,FB_28,2,0))&IF(TYPE(VLOOKUP($A63,FB_29,2,0))=16,\"\",VLOOKUP($A63,FB_29,2,0))&IF(TYPE(VLOOKUP($A63,FB_30,2,0))=16,\"\",VLOOKUP($A63,FB_30,2,0))","v":""},null,{"$f":"IF($B63=\"\",\"\",_xlfn.NUMBERVALUE(IF(TYPE(VLOOKUP($A63,FB_1,P$5,0))=16,\"\",VLOOKUP($A63,FB_1,P$5,0))&IF(TYPE(VLOOKUP($A63,FB_2,P$5,0))=16,\"\",VLOOKUP($A63,FB_2,P$5,0))&IF(TYPE(VLOOKUP($A63,FB_3,P$5,0))=16,\"\",VLOOKUP($A63,FB_3,P$5,0))&IF(TYPE(VLOOKUP($A63,FB_4,P$5,0))=16,\"\",VLOOKUP($A63,FB_4,P$5,0))&IF(TYPE(VLOOKUP($A63,FB_5,P$5,0))=16,\"\",VLOOKUP($A63,FB_5,P$5,0))&IF(TYPE(VLOOKUP($A63,FB_6,P$5,0))=16,\"\",VLOOKUP($A63,FB_6,P$5,0))&IF(TYPE(VLOOKUP($A63,FB_7,P$5,0))=16,\"\",VLOOKUP($A63,FB_7,P$5,0))&IF(TYPE(VLOOKUP($A63,FB_8,P$5,0))=16,\"\",VLOOKUP($A63,FB_8,P$5,0))&IF(TYPE(VLOOKUP($A63,FB_9,P$5,0))=16,\"\",VLOOKUP($A63,FB_9,P$5,0))&IF(TYPE(VLOOKUP($A63,FB_10,P$5,0))=16,\"\",VLOOKUP($A63,FB_10,P$5,0))&IF(TYPE(VLOOKUP($A63,FB_11,P$5,0))=16,\"\",VLOOKUP($A63,FB_11,P$5,0))&IF(TYPE(VLOOKUP($A63,FB_12,P$5,0))=16,\"\",VLOOKUP($A63,FB_12,P$5,0))&IF(TYPE(VLOOKUP($A63,FB_13,P$5,0))=16,\"\",VLOOKUP($A63,FB_13,P$5,0))&IF(TYPE(VLOOKUP($A63,FB_14,P$5,0))=16,\"\",VLOOKUP($A63,FB_14,P$5,0))&IF(TYPE(VLOOKUP($A63,FB_15,P$5,0))=16,\"\",VLOOKUP($A63,FB_15,P$5,0))&IF(TYPE(VLOOKUP($A63,FB_16,P$5,0))=16,\"\",VLOOKUP($A63,FB_16,P$5,0))&IF(TYPE(VLOOKUP($A63,FB_17,P$5,0))=16,\"\",VLOOKUP($A63,FB_17,P$5,0))&IF(TYPE(VLOOKUP($A63,FB_18,P$5,0))=16,\"\",VLOOKUP($A63,FB_18,P$5,0))&IF(TYPE(VLOOKUP($A63,FB_19,P$5,0))=16,\"\",VLOOKUP($A63,FB_19,P$5,0))&IF(TYPE(VLOOKUP($A63,FB_20,P$5,0))=16,\"\",VLOOKUP($A63,FB_20,P$5,0))&IF(TYPE(VLOOKUP($A63,FB_21,P$5,0))=16,\"\",VLOOKUP($A63,FB_21,P$5,0))&IF(TYPE(VLOOKUP($A63,FB_22,P$5,0))=16,\"\",VLOOKUP($A63,FB_22,P$5,0))&IF(TYPE(VLOOKUP($A63,FB_23,P$5,0))=16,\"\",VLOOKUP($A63,FB_23,P$5,0))&IF(TYPE(VLOOKUP($A63,FB_24,P$5,0))=16,\"\",VLOOKUP($A63,FB_24,P$5,0))&IF(TYPE(VLOOKUP($A63,FB_25,P$5,0))=16,\"\",VLOOKUP($A63,FB_25,P$5,0))&IF(TYPE(VLOOKUP($A63,FB_26,P$5,0))=16,\"\",VLOOKUP($A63,FB_26,P$5,0))&IF(TYPE(VLOOKUP($A63,FB_27,P$5,0))=16,\"\",VLOOKUP($A63,FB_27,P$5,0))&IF(TYPE(VLOOKUP($A63,FB_28,P$5,0))=16,\"\",VLOOKUP($A63,FB_28,P$5,0))&IF(TYPE(VLOOKUP($A63,FB_29,P$5,0))=16,\"\",VLOOKUP($A63,FB_29,P$5,0))&IF(TYPE(VLOOKUP($A63,FB_30,P$5,0))=16,\"\",VLOOKUP($A63,FB_30,P$5,0))))","v":""},"",{"$f":"IF($B63=\"\",\"\",_xlfn.NUMBERVALUE(IF(TYPE(VLOOKUP($A63,FB_1,R$5,0))=16,\"\",VLOOKUP($A63,FB_1,R$5,0))&IF(TYPE(VLOOKUP($A63,FB_2,R$5,0))=16,\"\",VLOOKUP($A63,FB_2,R$5,0))&IF(TYPE(VLOOKUP($A63,FB_3,R$5,0))=16,\"\",VLOOKUP($A63,FB_3,R$5,0))&IF(TYPE(VLOOKUP($A63,FB_4,R$5,0))=16,\"\",VLOOKUP($A63,FB_4,R$5,0))&IF(TYPE(VLOOKUP($A63,FB_5,R$5,0))=16,\"\",VLOOKUP($A63,FB_5,R$5,0))&IF(TYPE(VLOOKUP($A63,FB_6,R$5,0))=16,\"\",VLOOKUP($A63,FB_6,R$5,0))&IF(TYPE(VLOOKUP($A63,FB_7,R$5,0))=16,\"\",VLOOKUP($A63,FB_7,R$5,0))&IF(TYPE(VLOOKUP($A63,FB_8,R$5,0))=16,\"\",VLOOKUP($A63,FB_8,R$5,0))&IF(TYPE(VLOOKUP($A63,FB_9,R$5,0))=16,\"\",VLOOKUP($A63,FB_9,R$5,0))&IF(TYPE(VLOOKUP($A63,FB_10,R$5,0))=16,\"\",VLOOKUP($A63,FB_10,R$5,0))&IF(TYPE(VLOOKUP($A63,FB_11,R$5,0))=16,\"\",VLOOKUP($A63,FB_11,R$5,0))&IF(TYPE(VLOOKUP($A63,FB_12,R$5,0))=16,\"\",VLOOKUP($A63,FB_12,R$5,0))&IF(TYPE(VLOOKUP($A63,FB_13,R$5,0))=16,\"\",VLOOKUP($A63,FB_13,R$5,0))&IF(TYPE(VLOOKUP($A63,FB_14,R$5,0))=16,\"\",VLOOKUP($A63,FB_14,R$5,0))&IF(TYPE(VLOOKUP($A63,FB_15,R$5,0))=16,\"\",VLOOKUP($A63,FB_15,R$5,0))&IF(TYPE(VLOOKUP($A63,FB_16,R$5,0))=16,\"\",VLOOKUP($A63,FB_16,R$5,0))&IF(TYPE(VLOOKUP($A63,FB_17,R$5,0))=16,\"\",VLOOKUP($A63,FB_17,R$5,0))&IF(TYPE(VLOOKUP($A63,FB_18,R$5,0))=16,\"\",VLOOKUP($A63,FB_18,R$5,0))&IF(TYPE(VLOOKUP($A63,FB_19,R$5,0))=16,\"\",VLOOKUP($A63,FB_19,R$5,0))&IF(TYPE(VLOOKUP($A63,FB_20,R$5,0))=16,\"\",VLOOKUP($A63,FB_20,R$5,0))&IF(TYPE(VLOOKUP($A63,FB_21,R$5,0))=16,\"\",VLOOKUP($A63,FB_21,R$5,0))&IF(TYPE(VLOOKUP($A63,FB_22,R$5,0))=16,\"\",VLOOKUP($A63,FB_22,R$5,0))&IF(TYPE(VLOOKUP($A63,FB_23,R$5,0))=16,\"\",VLOOKUP($A63,FB_23,R$5,0))&IF(TYPE(VLOOKUP($A63,FB_24,R$5,0))=16,\"\",VLOOKUP($A63,FB_24,R$5,0))&IF(TYPE(VLOOKUP($A63,FB_25,R$5,0))=16,\"\",VLOOKUP($A63,FB_25,R$5,0))&IF(TYPE(VLOOKUP($A63,FB_26,R$5,0))=16,\"\",VLOOKUP($A63,FB_26,R$5,0))&IF(TYPE(VLOOKUP($A63,FB_27,R$5,0))=16,\"\",VLOOKUP($A63,FB_27,R$5,0))&IF(TYPE(VLOOKUP($A63,FB_28,R$5,0))=16,\"\",VLOOKUP($A63,FB_28,R$5,0))&IF(TYPE(VLOOKUP($A63,FB_29,R$5,0))=16,\"\",VLOOKUP($A63,FB_29,R$5,0))&IF(TYPE(VLOOKUP($A63,FB_30,R$5,0))=16,\"\",VLOOKUP($A63,FB_30,R$5,0))))","v":""},{"$f":"IF($B63=\"\",\"\",IF(TYPE(VLOOKUP($A63,FB_1,S$5,0))=16,\"\",VLOOKUP($A63,FB_1,S$5,0))&IF(TYPE(VLOOKUP($A63,FB_2,S$5,0))=16,\"\",VLOOKUP($A63,FB_2,S$5,0))&IF(TYPE(VLOOKUP($A63,FB_3,S$5,0))=16,\"\",VLOOKUP($A63,FB_3,S$5,0))&IF(TYPE(VLOOKUP($A63,FB_4,S$5,0))=16,\"\",VLOOKUP($A63,FB_4,S$5,0))&IF(TYPE(VLOOKUP($A63,FB_5,S$5,0))=16,\"\",VLOOKUP($A63,FB_5,S$5,0))&IF(TYPE(VLOOKUP($A63,FB_6,S$5,0))=16,\"\",VLOOKUP($A63,FB_6,S$5,0))&IF(TYPE(VLOOKUP($A63,FB_7,S$5,0))=16,\"\",VLOOKUP($A63,FB_7,S$5,0))&IF(TYPE(VLOOKUP($A63,FB_8,S$5,0))=16,\"\",VLOOKUP($A63,FB_8,S$5,0))&IF(TYPE(VLOOKUP($A63,FB_9,S$5,0))=16,\"\",VLOOKUP($A63,FB_9,S$5,0))&IF(TYPE(VLOOKUP($A63,FB_10,S$5,0))=16,\"\",VLOOKUP($A63,FB_10,S$5,0))&IF(TYPE(VLOOKUP($A63,FB_11,S$5,0))=16,\"\",VLOOKUP($A63,FB_11,S$5,0))&IF(TYPE(VLOOKUP($A63,FB_12,S$5,0))=16,\"\",VLOOKUP($A63,FB_12,S$5,0))&IF(TYPE(VLOOKUP($A63,FB_13,S$5,0))=16,\"\",VLOOKUP($A63,FB_13,S$5,0))&IF(TYPE(VLOOKUP($A63,FB_14,S$5,0))=16,\"\",VLOOKUP($A63,FB_14,S$5,0))&IF(TYPE(VLOOKUP($A63,FB_15,S$5,0))=16,\"\",VLOOKUP($A63,FB_15,S$5,0))&IF(TYPE(VLOOKUP($A63,FB_16,S$5,0))=16,\"\",VLOOKUP($A63,FB_16,S$5,0))&IF(TYPE(VLOOKUP($A63,FB_17,S$5,0))=16,\"\",VLOOKUP($A63,FB_17,S$5,0))&IF(TYPE(VLOOKUP($A63,FB_18,S$5,0))=16,\"\",VLOOKUP($A63,FB_18,S$5,0))&IF(TYPE(VLOOKUP($A63,FB_19,S$5,0))=16,\"\",VLOOKUP($A63,FB_19,S$5,0))&IF(TYPE(VLOOKUP($A63,FB_20,S$5,0))=16,\"\",VLOOKUP($A63,FB_20,S$5,0))&IF(TYPE(VLOOKUP($A63,FB_21,S$5,0))=16,\"\",VLOOKUP($A63,FB_21,S$5,0))&IF(TYPE(VLOOKUP($A63,FB_22,S$5,0))=16,\"\",VLOOKUP($A63,FB_22,S$5,0))&IF(TYPE(VLOOKUP($A63,FB_23,S$5,0))=16,\"\",VLOOKUP($A63,FB_23,S$5,0))&IF(TYPE(VLOOKUP($A63,FB_24,S$5,0))=16,\"\",VLOOKUP($A63,FB_24,S$5,0))&IF(TYPE(VLOOKUP($A63,FB_25,S$5,0))=16,\"\",VLOOKUP($A63,FB_25,S$5,0))&IF(TYPE(VLOOKUP($A63,FB_26,S$5,0))=16,\"\",VLOOKUP($A63,FB_26,S$5,0))&IF(TYPE(VLOOKUP($A63,FB_27,S$5,0))=16,\"\",VLOOKUP($A63,FB_27,S$5,0))&IF(TYPE(VLOOKUP($A63,FB_28,S$5,0))=16,\"\",VLOOKUP($A63,FB_28,S$5,0))&IF(TYPE(VLOOKUP($A63,FB_29,S$5,0))=16,\"\",VLOOKUP($A63,FB_29,S$5,0))&IF(TYPE(VLOOKUP($A63,FB_30,S$5,0))=16,\"\",VLOOKUP($A63,FB_30,S$5,0)))","v":""},null,null,null,null,null,null,null,null,null,null,null,null,null,null,null,null,"",":","","",""]
["35.",{"$f":"IF(TYPE(VLOOKUP($A64,FB_1,2,0))=16,\"\",VLOOKUP($A64,FB_1,2,0))&IF(TYPE(VLOOKUP($A64,FB_2,2,0))=16,\"\",VLOOKUP($A64,FB_2,2,0))&IF(TYPE(VLOOKUP($A64,FB_3,2,0))=16,\"\",VLOOKUP($A64,FB_3,2,0))&IF(TYPE(VLOOKUP($A64,FB_4,2,0))=16,\"\",VLOOKUP($A64,FB_4,2,0))&IF(TYPE(VLOOKUP($A64,FB_5,2,0))=16,\"\",VLOOKUP($A64,FB_5,2,0))&IF(TYPE(VLOOKUP($A64,FB_6,2,0))=16,\"\",VLOOKUP($A64,FB_6,2,0))&IF(TYPE(VLOOKUP($A64,FB_7,2,0))=16,\"\",VLOOKUP($A64,FB_7,2,0))&IF(TYPE(VLOOKUP($A64,FB_8,2,0))=16,\"\",VLOOKUP($A64,FB_8,2,0))&IF(TYPE(VLOOKUP($A64,FB_9,2,0))=16,\"\",VLOOKUP($A64,FB_9,2,0))&IF(TYPE(VLOOKUP($A64,FB_10,2,0))=16,\"\",VLOOKUP($A64,FB_10,2,0))&IF(TYPE(VLOOKUP($A64,FB_11,2,0))=16,\"\",VLOOKUP($A64,FB_11,2,0))&IF(TYPE(VLOOKUP($A64,FB_12,2,0))=16,\"\",VLOOKUP($A64,FB_12,2,0))&IF(TYPE(VLOOKUP($A64,FB_13,2,0))=16,\"\",VLOOKUP($A64,FB_13,2,0))&IF(TYPE(VLOOKUP($A64,FB_14,2,0))=16,\"\",VLOOKUP($A64,FB_14,2,0))&IF(TYPE(VLOOKUP($A64,FB_15,2,0))=16,\"\",VLOOKUP($A64,FB_15,2,0))&IF(TYPE(VLOOKUP($A64,FB_16,2,0))=16,\"\",VLOOKUP($A64,FB_16,2,0))&IF(TYPE(VLOOKUP($A64,FB_17,2,0))=16,\"\",VLOOKUP($A64,FB_17,2,0))&IF(TYPE(VLOOKUP($A64,FB_18,2,0))=16,\"\",VLOOKUP($A64,FB_18,2,0))&IF(TYPE(VLOOKUP($A64,FB_19,2,0))=16,\"\",VLOOKUP($A64,FB_19,2,0))&IF(TYPE(VLOOKUP($A64,FB_20,2,0))=16,\"\",VLOOKUP($A64,FB_20,2,0))&IF(TYPE(VLOOKUP($A64,FB_21,2,0))=16,\"\",VLOOKUP($A64,FB_21,2,0))&IF(TYPE(VLOOKUP($A64,FB_22,2,0))=16,\"\",VLOOKUP($A64,FB_22,2,0))&IF(TYPE(VLOOKUP($A64,FB_23,2,0))=16,\"\",VLOOKUP($A64,FB_23,2,0))&IF(TYPE(VLOOKUP($A64,FB_24,2,0))=16,\"\",VLOOKUP($A64,FB_24,2,0))&IF(TYPE(VLOOKUP($A64,FB_25,2,0))=16,\"\",VLOOKUP($A64,FB_25,2,0))&IF(TYPE(VLOOKUP($A64,FB_26,2,0))=16,\"\",VLOOKUP($A64,FB_26,2,0))&IF(TYPE(VLOOKUP($A64,FB_27,2,0))=16,\"\",VLOOKUP($A64,FB_27,2,0))&IF(TYPE(VLOOKUP($A64,FB_28,2,0))=16,\"\",VLOOKUP($A64,FB_28,2,0))&IF(TYPE(VLOOKUP($A64,FB_29,2,0))=16,\"\",VLOOKUP($A64,FB_29,2,0))&IF(TYPE(VLOOKUP($A64,FB_30,2,0))=16,\"\",VLOOKUP($A64,FB_30,2,0))","v":""},null,{"$f":"IF($B64=\"\",\"\",_xlfn.NUMBERVALUE(IF(TYPE(VLOOKUP($A64,FB_1,P$5,0))=16,\"\",VLOOKUP($A64,FB_1,P$5,0))&IF(TYPE(VLOOKUP($A64,FB_2,P$5,0))=16,\"\",VLOOKUP($A64,FB_2,P$5,0))&IF(TYPE(VLOOKUP($A64,FB_3,P$5,0))=16,\"\",VLOOKUP($A64,FB_3,P$5,0))&IF(TYPE(VLOOKUP($A64,FB_4,P$5,0))=16,\"\",VLOOKUP($A64,FB_4,P$5,0))&IF(TYPE(VLOOKUP($A64,FB_5,P$5,0))=16,\"\",VLOOKUP($A64,FB_5,P$5,0))&IF(TYPE(VLOOKUP($A64,FB_6,P$5,0))=16,\"\",VLOOKUP($A64,FB_6,P$5,0))&IF(TYPE(VLOOKUP($A64,FB_7,P$5,0))=16,\"\",VLOOKUP($A64,FB_7,P$5,0))&IF(TYPE(VLOOKUP($A64,FB_8,P$5,0))=16,\"\",VLOOKUP($A64,FB_8,P$5,0))&IF(TYPE(VLOOKUP($A64,FB_9,P$5,0))=16,\"\",VLOOKUP($A64,FB_9,P$5,0))&IF(TYPE(VLOOKUP($A64,FB_10,P$5,0))=16,\"\",VLOOKUP($A64,FB_10,P$5,0))&IF(TYPE(VLOOKUP($A64,FB_11,P$5,0))=16,\"\",VLOOKUP($A64,FB_11,P$5,0))&IF(TYPE(VLOOKUP($A64,FB_12,P$5,0))=16,\"\",VLOOKUP($A64,FB_12,P$5,0))&IF(TYPE(VLOOKUP($A64,FB_13,P$5,0))=16,\"\",VLOOKUP($A64,FB_13,P$5,0))&IF(TYPE(VLOOKUP($A64,FB_14,P$5,0))=16,\"\",VLOOKUP($A64,FB_14,P$5,0))&IF(TYPE(VLOOKUP($A64,FB_15,P$5,0))=16,\"\",VLOOKUP($A64,FB_15,P$5,0))&IF(TYPE(VLOOKUP($A64,FB_16,P$5,0))=16,\"\",VLOOKUP($A64,FB_16,P$5,0))&IF(TYPE(VLOOKUP($A64,FB_17,P$5,0))=16,\"\",VLOOKUP($A64,FB_17,P$5,0))&IF(TYPE(VLOOKUP($A64,FB_18,P$5,0))=16,\"\",VLOOKUP($A64,FB_18,P$5,0))&IF(TYPE(VLOOKUP($A64,FB_19,P$5,0))=16,\"\",VLOOKUP($A64,FB_19,P$5,0))&IF(TYPE(VLOOKUP($A64,FB_20,P$5,0))=16,\"\",VLOOKUP($A64,FB_20,P$5,0))&IF(TYPE(VLOOKUP($A64,FB_21,P$5,0))=16,\"\",VLOOKUP($A64,FB_21,P$5,0))&IF(TYPE(VLOOKUP($A64,FB_22,P$5,0))=16,\"\",VLOOKUP($A64,FB_22,P$5,0))&IF(TYPE(VLOOKUP($A64,FB_23,P$5,0))=16,\"\",VLOOKUP($A64,FB_23,P$5,0))&IF(TYPE(VLOOKUP($A64,FB_24,P$5,0))=16,\"\",VLOOKUP($A64,FB_24,P$5,0))&IF(TYPE(VLOOKUP($A64,FB_25,P$5,0))=16,\"\",VLOOKUP($A64,FB_25,P$5,0))&IF(TYPE(VLOOKUP($A64,FB_26,P$5,0))=16,\"\",VLOOKUP($A64,FB_26,P$5,0))&IF(TYPE(VLOOKUP($A64,FB_27,P$5,0))=16,\"\",VLOOKUP($A64,FB_27,P$5,0))&IF(TYPE(VLOOKUP($A64,FB_28,P$5,0))=16,\"\",VLOOKUP($A64,FB_28,P$5,0))&IF(TYPE(VLOOKUP($A64,FB_29,P$5,0))=16,\"\",VLOOKUP($A64,FB_29,P$5,0))&IF(TYPE(VLOOKUP($A64,FB_30,P$5,0))=16,\"\",VLOOKUP($A64,FB_30,P$5,0))))","v":""},"",{"$f":"IF($B64=\"\",\"\",_xlfn.NUMBERVALUE(IF(TYPE(VLOOKUP($A64,FB_1,R$5,0))=16,\"\",VLOOKUP($A64,FB_1,R$5,0))&IF(TYPE(VLOOKUP($A64,FB_2,R$5,0))=16,\"\",VLOOKUP($A64,FB_2,R$5,0))&IF(TYPE(VLOOKUP($A64,FB_3,R$5,0))=16,\"\",VLOOKUP($A64,FB_3,R$5,0))&IF(TYPE(VLOOKUP($A64,FB_4,R$5,0))=16,\"\",VLOOKUP($A64,FB_4,R$5,0))&IF(TYPE(VLOOKUP($A64,FB_5,R$5,0))=16,\"\",VLOOKUP($A64,FB_5,R$5,0))&IF(TYPE(VLOOKUP($A64,FB_6,R$5,0))=16,\"\",VLOOKUP($A64,FB_6,R$5,0))&IF(TYPE(VLOOKUP($A64,FB_7,R$5,0))=16,\"\",VLOOKUP($A64,FB_7,R$5,0))&IF(TYPE(VLOOKUP($A64,FB_8,R$5,0))=16,\"\",VLOOKUP($A64,FB_8,R$5,0))&IF(TYPE(VLOOKUP($A64,FB_9,R$5,0))=16,\"\",VLOOKUP($A64,FB_9,R$5,0))&IF(TYPE(VLOOKUP($A64,FB_10,R$5,0))=16,\"\",VLOOKUP($A64,FB_10,R$5,0))&IF(TYPE(VLOOKUP($A64,FB_11,R$5,0))=16,\"\",VLOOKUP($A64,FB_11,R$5,0))&IF(TYPE(VLOOKUP($A64,FB_12,R$5,0))=16,\"\",VLOOKUP($A64,FB_12,R$5,0))&IF(TYPE(VLOOKUP($A64,FB_13,R$5,0))=16,\"\",VLOOKUP($A64,FB_13,R$5,0))&IF(TYPE(VLOOKUP($A64,FB_14,R$5,0))=16,\"\",VLOOKUP($A64,FB_14,R$5,0))&IF(TYPE(VLOOKUP($A64,FB_15,R$5,0))=16,\"\",VLOOKUP($A64,FB_15,R$5,0))&IF(TYPE(VLOOKUP($A64,FB_16,R$5,0))=16,\"\",VLOOKUP($A64,FB_16,R$5,0))&IF(TYPE(VLOOKUP($A64,FB_17,R$5,0))=16,\"\",VLOOKUP($A64,FB_17,R$5,0))&IF(TYPE(VLOOKUP($A64,FB_18,R$5,0))=16,\"\",VLOOKUP($A64,FB_18,R$5,0))&IF(TYPE(VLOOKUP($A64,FB_19,R$5,0))=16,\"\",VLOOKUP($A64,FB_19,R$5,0))&IF(TYPE(VLOOKUP($A64,FB_20,R$5,0))=16,\"\",VLOOKUP($A64,FB_20,R$5,0))&IF(TYPE(VLOOKUP($A64,FB_21,R$5,0))=16,\"\",VLOOKUP($A64,FB_21,R$5,0))&IF(TYPE(VLOOKUP($A64,FB_22,R$5,0))=16,\"\",VLOOKUP($A64,FB_22,R$5,0))&IF(TYPE(VLOOKUP($A64,FB_23,R$5,0))=16,\"\",VLOOKUP($A64,FB_23,R$5,0))&IF(TYPE(VLOOKUP($A64,FB_24,R$5,0))=16,\"\",VLOOKUP($A64,FB_24,R$5,0))&IF(TYPE(VLOOKUP($A64,FB_25,R$5,0))=16,\"\",VLOOKUP($A64,FB_25,R$5,0))&IF(TYPE(VLOOKUP($A64,FB_26,R$5,0))=16,\"\",VLOOKUP($A64,FB_26,R$5,0))&IF(TYPE(VLOOKUP($A64,FB_27,R$5,0))=16,\"\",VLOOKUP($A64,FB_27,R$5,0))&IF(TYPE(VLOOKUP($A64,FB_28,R$5,0))=16,\"\",VLOOKUP($A64,FB_28,R$5,0))&IF(TYPE(VLOOKUP($A64,FB_29,R$5,0))=16,\"\",VLOOKUP($A64,FB_29,R$5,0))&IF(TYPE(VLOOKUP($A64,FB_30,R$5,0))=16,\"\",VLOOKUP($A64,FB_30,R$5,0))))","v":""},{"$f":"IF($B64=\"\",\"\",IF(TYPE(VLOOKUP($A64,FB_1,S$5,0))=16,\"\",VLOOKUP($A64,FB_1,S$5,0))&IF(TYPE(VLOOKUP($A64,FB_2,S$5,0))=16,\"\",VLOOKUP($A64,FB_2,S$5,0))&IF(TYPE(VLOOKUP($A64,FB_3,S$5,0))=16,\"\",VLOOKUP($A64,FB_3,S$5,0))&IF(TYPE(VLOOKUP($A64,FB_4,S$5,0))=16,\"\",VLOOKUP($A64,FB_4,S$5,0))&IF(TYPE(VLOOKUP($A64,FB_5,S$5,0))=16,\"\",VLOOKUP($A64,FB_5,S$5,0))&IF(TYPE(VLOOKUP($A64,FB_6,S$5,0))=16,\"\",VLOOKUP($A64,FB_6,S$5,0))&IF(TYPE(VLOOKUP($A64,FB_7,S$5,0))=16,\"\",VLOOKUP($A64,FB_7,S$5,0))&IF(TYPE(VLOOKUP($A64,FB_8,S$5,0))=16,\"\",VLOOKUP($A64,FB_8,S$5,0))&IF(TYPE(VLOOKUP($A64,FB_9,S$5,0))=16,\"\",VLOOKUP($A64,FB_9,S$5,0))&IF(TYPE(VLOOKUP($A64,FB_10,S$5,0))=16,\"\",VLOOKUP($A64,FB_10,S$5,0))&IF(TYPE(VLOOKUP($A64,FB_11,S$5,0))=16,\"\",VLOOKUP($A64,FB_11,S$5,0))&IF(TYPE(VLOOKUP($A64,FB_12,S$5,0))=16,\"\",VLOOKUP($A64,FB_12,S$5,0))&IF(TYPE(VLOOKUP($A64,FB_13,S$5,0))=16,\"\",VLOOKUP($A64,FB_13,S$5,0))&IF(TYPE(VLOOKUP($A64,FB_14,S$5,0))=16,\"\",VLOOKUP($A64,FB_14,S$5,0))&IF(TYPE(VLOOKUP($A64,FB_15,S$5,0))=16,\"\",VLOOKUP($A64,FB_15,S$5,0))&IF(TYPE(VLOOKUP($A64,FB_16,S$5,0))=16,\"\",VLOOKUP($A64,FB_16,S$5,0))&IF(TYPE(VLOOKUP($A64,FB_17,S$5,0))=16,\"\",VLOOKUP($A64,FB_17,S$5,0))&IF(TYPE(VLOOKUP($A64,FB_18,S$5,0))=16,\"\",VLOOKUP($A64,FB_18,S$5,0))&IF(TYPE(VLOOKUP($A64,FB_19,S$5,0))=16,\"\",VLOOKUP($A64,FB_19,S$5,0))&IF(TYPE(VLOOKUP($A64,FB_20,S$5,0))=16,\"\",VLOOKUP($A64,FB_20,S$5,0))&IF(TYPE(VLOOKUP($A64,FB_21,S$5,0))=16,\"\",VLOOKUP($A64,FB_21,S$5,0))&IF(TYPE(VLOOKUP($A64,FB_22,S$5,0))=16,\"\",VLOOKUP($A64,FB_22,S$5,0))&IF(TYPE(VLOOKUP($A64,FB_23,S$5,0))=16,\"\",VLOOKUP($A64,FB_23,S$5,0))&IF(TYPE(VLOOKUP($A64,FB_24,S$5,0))=16,\"\",VLOOKUP($A64,FB_24,S$5,0))&IF(TYPE(VLOOKUP($A64,FB_25,S$5,0))=16,\"\",VLOOKUP($A64,FB_25,S$5,0))&IF(TYPE(VLOOKUP($A64,FB_26,S$5,0))=16,\"\",VLOOKUP($A64,FB_26,S$5,0))&IF(TYPE(VLOOKUP($A64,FB_27,S$5,0))=16,\"\",VLOOKUP($A64,FB_27,S$5,0))&IF(TYPE(VLOOKUP($A64,FB_28,S$5,0))=16,\"\",VLOOKUP($A64,FB_28,S$5,0))&IF(TYPE(VLOOKUP($A64,FB_29,S$5,0))=16,\"\",VLOOKUP($A64,FB_29,S$5,0))&IF(TYPE(VLOOKUP($A64,FB_30,S$5,0))=16,\"\",VLOOKUP($A64,FB_30,S$5,0)))","v":""},null,null,null,null,null,null,null,null,null,null,null,null,null,null,null,null,"",":","","",""]
["36.",{"$f":"IF(TYPE(VLOOKUP($A65,FB_1,2,0))=16,\"\",VLOOKUP($A65,FB_1,2,0))&IF(TYPE(VLOOKUP($A65,FB_2,2,0))=16,\"\",VLOOKUP($A65,FB_2,2,0))&IF(TYPE(VLOOKUP($A65,FB_3,2,0))=16,\"\",VLOOKUP($A65,FB_3,2,0))&IF(TYPE(VLOOKUP($A65,FB_4,2,0))=16,\"\",VLOOKUP($A65,FB_4,2,0))&IF(TYPE(VLOOKUP($A65,FB_5,2,0))=16,\"\",VLOOKUP($A65,FB_5,2,0))&IF(TYPE(VLOOKUP($A65,FB_6,2,0))=16,\"\",VLOOKUP($A65,FB_6,2,0))&IF(TYPE(VLOOKUP($A65,FB_7,2,0))=16,\"\",VLOOKUP($A65,FB_7,2,0))&IF(TYPE(VLOOKUP($A65,FB_8,2,0))=16,\"\",VLOOKUP($A65,FB_8,2,0))&IF(TYPE(VLOOKUP($A65,FB_9,2,0))=16,\"\",VLOOKUP($A65,FB_9,2,0))&IF(TYPE(VLOOKUP($A65,FB_10,2,0))=16,\"\",VLOOKUP($A65,FB_10,2,0))&IF(TYPE(VLOOKUP($A65,FB_11,2,0))=16,\"\",VLOOKUP($A65,FB_11,2,0))&IF(TYPE(VLOOKUP($A65,FB_12,2,0))=16,\"\",VLOOKUP($A65,FB_12,2,0))&IF(TYPE(VLOOKUP($A65,FB_13,2,0))=16,\"\",VLOOKUP($A65,FB_13,2,0))&IF(TYPE(VLOOKUP($A65,FB_14,2,0))=16,\"\",VLOOKUP($A65,FB_14,2,0))&IF(TYPE(VLOOKUP($A65,FB_15,2,0))=16,\"\",VLOOKUP($A65,FB_15,2,0))&IF(TYPE(VLOOKUP($A65,FB_16,2,0))=16,\"\",VLOOKUP($A65,FB_16,2,0))&IF(TYPE(VLOOKUP($A65,FB_17,2,0))=16,\"\",VLOOKUP($A65,FB_17,2,0))&IF(TYPE(VLOOKUP($A65,FB_18,2,0))=16,\"\",VLOOKUP($A65,FB_18,2,0))&IF(TYPE(VLOOKUP($A65,FB_19,2,0))=16,\"\",VLOOKUP($A65,FB_19,2,0))&IF(TYPE(VLOOKUP($A65,FB_20,2,0))=16,\"\",VLOOKUP($A65,FB_20,2,0))&IF(TYPE(VLOOKUP($A65,FB_21,2,0))=16,\"\",VLOOKUP($A65,FB_21,2,0))&IF(TYPE(VLOOKUP($A65,FB_22,2,0))=16,\"\",VLOOKUP($A65,FB_22,2,0))&IF(TYPE(VLOOKUP($A65,FB_23,2,0))=16,\"\",VLOOKUP($A65,FB_23,2,0))&IF(TYPE(VLOOKUP($A65,FB_24,2,0))=16,\"\",VLOOKUP($A65,FB_24,2,0))&IF(TYPE(VLOOKUP($A65,FB_25,2,0))=16,\"\",VLOOKUP($A65,FB_25,2,0))&IF(TYPE(VLOOKUP($A65,FB_26,2,0))=16,\"\",VLOOKUP($A65,FB_26,2,0))&IF(TYPE(VLOOKUP($A65,FB_27,2,0))=16,\"\",VLOOKUP($A65,FB_27,2,0))&IF(TYPE(VLOOKUP($A65,FB_28,2,0))=16,\"\",VLOOKUP($A65,FB_28,2,0))&IF(TYPE(VLOOKUP($A65,FB_29,2,0))=16,\"\",VLOOKUP($A65,FB_29,2,0))&IF(TYPE(VLOOKUP($A65,FB_30,2,0))=16,\"\",VLOOKUP($A65,FB_30,2,0))","v":""},null,{"$f":"IF($B65=\"\",\"\",_xlfn.NUMBERVALUE(IF(TYPE(VLOOKUP($A65,FB_1,P$5,0))=16,\"\",VLOOKUP($A65,FB_1,P$5,0))&IF(TYPE(VLOOKUP($A65,FB_2,P$5,0))=16,\"\",VLOOKUP($A65,FB_2,P$5,0))&IF(TYPE(VLOOKUP($A65,FB_3,P$5,0))=16,\"\",VLOOKUP($A65,FB_3,P$5,0))&IF(TYPE(VLOOKUP($A65,FB_4,P$5,0))=16,\"\",VLOOKUP($A65,FB_4,P$5,0))&IF(TYPE(VLOOKUP($A65,FB_5,P$5,0))=16,\"\",VLOOKUP($A65,FB_5,P$5,0))&IF(TYPE(VLOOKUP($A65,FB_6,P$5,0))=16,\"\",VLOOKUP($A65,FB_6,P$5,0))&IF(TYPE(VLOOKUP($A65,FB_7,P$5,0))=16,\"\",VLOOKUP($A65,FB_7,P$5,0))&IF(TYPE(VLOOKUP($A65,FB_8,P$5,0))=16,\"\",VLOOKUP($A65,FB_8,P$5,0))&IF(TYPE(VLOOKUP($A65,FB_9,P$5,0))=16,\"\",VLOOKUP($A65,FB_9,P$5,0))&IF(TYPE(VLOOKUP($A65,FB_10,P$5,0))=16,\"\",VLOOKUP($A65,FB_10,P$5,0))&IF(TYPE(VLOOKUP($A65,FB_11,P$5,0))=16,\"\",VLOOKUP($A65,FB_11,P$5,0))&IF(TYPE(VLOOKUP($A65,FB_12,P$5,0))=16,\"\",VLOOKUP($A65,FB_12,P$5,0))&IF(TYPE(VLOOKUP($A65,FB_13,P$5,0))=16,\"\",VLOOKUP($A65,FB_13,P$5,0))&IF(TYPE(VLOOKUP($A65,FB_14,P$5,0))=16,\"\",VLOOKUP($A65,FB_14,P$5,0))&IF(TYPE(VLOOKUP($A65,FB_15,P$5,0))=16,\"\",VLOOKUP($A65,FB_15,P$5,0))&IF(TYPE(VLOOKUP($A65,FB_16,P$5,0))=16,\"\",VLOOKUP($A65,FB_16,P$5,0))&IF(TYPE(VLOOKUP($A65,FB_17,P$5,0))=16,\"\",VLOOKUP($A65,FB_17,P$5,0))&IF(TYPE(VLOOKUP($A65,FB_18,P$5,0))=16,\"\",VLOOKUP($A65,FB_18,P$5,0))&IF(TYPE(VLOOKUP($A65,FB_19,P$5,0))=16,\"\",VLOOKUP($A65,FB_19,P$5,0))&IF(TYPE(VLOOKUP($A65,FB_20,P$5,0))=16,\"\",VLOOKUP($A65,FB_20,P$5,0))&IF(TYPE(VLOOKUP($A65,FB_21,P$5,0))=16,\"\",VLOOKUP($A65,FB_21,P$5,0))&IF(TYPE(VLOOKUP($A65,FB_22,P$5,0))=16,\"\",VLOOKUP($A65,FB_22,P$5,0))&IF(TYPE(VLOOKUP($A65,FB_23,P$5,0))=16,\"\",VLOOKUP($A65,FB_23,P$5,0))&IF(TYPE(VLOOKUP($A65,FB_24,P$5,0))=16,\"\",VLOOKUP($A65,FB_24,P$5,0))&IF(TYPE(VLOOKUP($A65,FB_25,P$5,0))=16,\"\",VLOOKUP($A65,FB_25,P$5,0))&IF(TYPE(VLOOKUP($A65,FB_26,P$5,0))=16,\"\",VLOOKUP($A65,FB_26,P$5,0))&IF(TYPE(VLOOKUP($A65,FB_27,P$5,0))=16,\"\",VLOOKUP($A65,FB_27,P$5,0))&IF(TYPE(VLOOKUP($A65,FB_28,P$5,0))=16,\"\",VLOOKUP($A65,FB_28,P$5,0))&IF(TYPE(VLOOKUP($A65,FB_29,P$5,0))=16,\"\",VLOOKUP($A65,FB_29,P$5,0))&IF(TYPE(VLOOKUP($A65,FB_30,P$5,0))=16,\"\",VLOOKUP($A65,FB_30,P$5,0))))","v":""},"",{"$f":"IF($B65=\"\",\"\",_xlfn.NUMBERVALUE(IF(TYPE(VLOOKUP($A65,FB_1,R$5,0))=16,\"\",VLOOKUP($A65,FB_1,R$5,0))&IF(TYPE(VLOOKUP($A65,FB_2,R$5,0))=16,\"\",VLOOKUP($A65,FB_2,R$5,0))&IF(TYPE(VLOOKUP($A65,FB_3,R$5,0))=16,\"\",VLOOKUP($A65,FB_3,R$5,0))&IF(TYPE(VLOOKUP($A65,FB_4,R$5,0))=16,\"\",VLOOKUP($A65,FB_4,R$5,0))&IF(TYPE(VLOOKUP($A65,FB_5,R$5,0))=16,\"\",VLOOKUP($A65,FB_5,R$5,0))&IF(TYPE(VLOOKUP($A65,FB_6,R$5,0))=16,\"\",VLOOKUP($A65,FB_6,R$5,0))&IF(TYPE(VLOOKUP($A65,FB_7,R$5,0))=16,\"\",VLOOKUP($A65,FB_7,R$5,0))&IF(TYPE(VLOOKUP($A65,FB_8,R$5,0))=16,\"\",VLOOKUP($A65,FB_8,R$5,0))&IF(TYPE(VLOOKUP($A65,FB_9,R$5,0))=16,\"\",VLOOKUP($A65,FB_9,R$5,0))&IF(TYPE(VLOOKUP($A65,FB_10,R$5,0))=16,\"\",VLOOKUP($A65,FB_10,R$5,0))&IF(TYPE(VLOOKUP($A65,FB_11,R$5,0))=16,\"\",VLOOKUP($A65,FB_11,R$5,0))&IF(TYPE(VLOOKUP($A65,FB_12,R$5,0))=16,\"\",VLOOKUP($A65,FB_12,R$5,0))&IF(TYPE(VLOOKUP($A65,FB_13,R$5,0))=16,\"\",VLOOKUP($A65,FB_13,R$5,0))&IF(TYPE(VLOOKUP($A65,FB_14,R$5,0))=16,\"\",VLOOKUP($A65,FB_14,R$5,0))&IF(TYPE(VLOOKUP($A65,FB_15,R$5,0))=16,\"\",VLOOKUP($A65,FB_15,R$5,0))&IF(TYPE(VLOOKUP($A65,FB_16,R$5,0))=16,\"\",VLOOKUP($A65,FB_16,R$5,0))&IF(TYPE(VLOOKUP($A65,FB_17,R$5,0))=16,\"\",VLOOKUP($A65,FB_17,R$5,0))&IF(TYPE(VLOOKUP($A65,FB_18,R$5,0))=16,\"\",VLOOKUP($A65,FB_18,R$5,0))&IF(TYPE(VLOOKUP($A65,FB_19,R$5,0))=16,\"\",VLOOKUP($A65,FB_19,R$5,0))&IF(TYPE(VLOOKUP($A65,FB_20,R$5,0))=16,\"\",VLOOKUP($A65,FB_20,R$5,0))&IF(TYPE(VLOOKUP($A65,FB_21,R$5,0))=16,\"\",VLOOKUP($A65,FB_21,R$5,0))&IF(TYPE(VLOOKUP($A65,FB_22,R$5,0))=16,\"\",VLOOKUP($A65,FB_22,R$5,0))&IF(TYPE(VLOOKUP($A65,FB_23,R$5,0))=16,\"\",VLOOKUP($A65,FB_23,R$5,0))&IF(TYPE(VLOOKUP($A65,FB_24,R$5,0))=16,\"\",VLOOKUP($A65,FB_24,R$5,0))&IF(TYPE(VLOOKUP($A65,FB_25,R$5,0))=16,\"\",VLOOKUP($A65,FB_25,R$5,0))&IF(TYPE(VLOOKUP($A65,FB_26,R$5,0))=16,\"\",VLOOKUP($A65,FB_26,R$5,0))&IF(TYPE(VLOOKUP($A65,FB_27,R$5,0))=16,\"\",VLOOKUP($A65,FB_27,R$5,0))&IF(TYPE(VLOOKUP($A65,FB_28,R$5,0))=16,\"\",VLOOKUP($A65,FB_28,R$5,0))&IF(TYPE(VLOOKUP($A65,FB_29,R$5,0))=16,\"\",VLOOKUP($A65,FB_29,R$5,0))&IF(TYPE(VLOOKUP($A65,FB_30,R$5,0))=16,\"\",VLOOKUP($A65,FB_30,R$5,0))))","v":""},{"$f":"IF($B65=\"\",\"\",IF(TYPE(VLOOKUP($A65,FB_1,S$5,0))=16,\"\",VLOOKUP($A65,FB_1,S$5,0))&IF(TYPE(VLOOKUP($A65,FB_2,S$5,0))=16,\"\",VLOOKUP($A65,FB_2,S$5,0))&IF(TYPE(VLOOKUP($A65,FB_3,S$5,0))=16,\"\",VLOOKUP($A65,FB_3,S$5,0))&IF(TYPE(VLOOKUP($A65,FB_4,S$5,0))=16,\"\",VLOOKUP($A65,FB_4,S$5,0))&IF(TYPE(VLOOKUP($A65,FB_5,S$5,0))=16,\"\",VLOOKUP($A65,FB_5,S$5,0))&IF(TYPE(VLOOKUP($A65,FB_6,S$5,0))=16,\"\",VLOOKUP($A65,FB_6,S$5,0))&IF(TYPE(VLOOKUP($A65,FB_7,S$5,0))=16,\"\",VLOOKUP($A65,FB_7,S$5,0))&IF(TYPE(VLOOKUP($A65,FB_8,S$5,0))=16,\"\",VLOOKUP($A65,FB_8,S$5,0))&IF(TYPE(VLOOKUP($A65,FB_9,S$5,0))=16,\"\",VLOOKUP($A65,FB_9,S$5,0))&IF(TYPE(VLOOKUP($A65,FB_10,S$5,0))=16,\"\",VLOOKUP($A65,FB_10,S$5,0))&IF(TYPE(VLOOKUP($A65,FB_11,S$5,0))=16,\"\",VLOOKUP($A65,FB_11,S$5,0))&IF(TYPE(VLOOKUP($A65,FB_12,S$5,0))=16,\"\",VLOOKUP($A65,FB_12,S$5,0))&IF(TYPE(VLOOKUP($A65,FB_13,S$5,0))=16,\"\",VLOOKUP($A65,FB_13,S$5,0))&IF(TYPE(VLOOKUP($A65,FB_14,S$5,0))=16,\"\",VLOOKUP($A65,FB_14,S$5,0))&IF(TYPE(VLOOKUP($A65,FB_15,S$5,0))=16,\"\",VLOOKUP($A65,FB_15,S$5,0))&IF(TYPE(VLOOKUP($A65,FB_16,S$5,0))=16,\"\",VLOOKUP($A65,FB_16,S$5,0))&IF(TYPE(VLOOKUP($A65,FB_17,S$5,0))=16,\"\",VLOOKUP($A65,FB_17,S$5,0))&IF(TYPE(VLOOKUP($A65,FB_18,S$5,0))=16,\"\",VLOOKUP($A65,FB_18,S$5,0))&IF(TYPE(VLOOKUP($A65,FB_19,S$5,0))=16,\"\",VLOOKUP($A65,FB_19,S$5,0))&IF(TYPE(VLOOKUP($A65,FB_20,S$5,0))=16,\"\",VLOOKUP($A65,FB_20,S$5,0))&IF(TYPE(VLOOKUP($A65,FB_21,S$5,0))=16,\"\",VLOOKUP($A65,FB_21,S$5,0))&IF(TYPE(VLOOKUP($A65,FB_22,S$5,0))=16,\"\",VLOOKUP($A65,FB_22,S$5,0))&IF(TYPE(VLOOKUP($A65,FB_23,S$5,0))=16,\"\",VLOOKUP($A65,FB_23,S$5,0))&IF(TYPE(VLOOKUP($A65,FB_24,S$5,0))=16,\"\",VLOOKUP($A65,FB_24,S$5,0))&IF(TYPE(VLOOKUP($A65,FB_25,S$5,0))=16,\"\",VLOOKUP($A65,FB_25,S$5,0))&IF(TYPE(VLOOKUP($A65,FB_26,S$5,0))=16,\"\",VLOOKUP($A65,FB_26,S$5,0))&IF(TYPE(VLOOKUP($A65,FB_27,S$5,0))=16,\"\",VLOOKUP($A65,FB_27,S$5,0))&IF(TYPE(VLOOKUP($A65,FB_28,S$5,0))=16,\"\",VLOOKUP($A65,FB_28,S$5,0))&IF(TYPE(VLOOKUP($A65,FB_29,S$5,0))=16,\"\",VLOOKUP($A65,FB_29,S$5,0))&IF(TYPE(VLOOKUP($A65,FB_30,S$5,0))=16,\"\",VLOOKUP($A65,FB_30,S$5,0)))","v":""},null,null,null,null,null,null,null,null,null,null,null,null,null,null,null,null,"",":","","",""]
["37.",{"$f":"IF(TYPE(VLOOKUP($A66,FB_1,2,0))=16,\"\",VLOOKUP($A66,FB_1,2,0))&IF(TYPE(VLOOKUP($A66,FB_2,2,0))=16,\"\",VLOOKUP($A66,FB_2,2,0))&IF(TYPE(VLOOKUP($A66,FB_3,2,0))=16,\"\",VLOOKUP($A66,FB_3,2,0))&IF(TYPE(VLOOKUP($A66,FB_4,2,0))=16,\"\",VLOOKUP($A66,FB_4,2,0))&IF(TYPE(VLOOKUP($A66,FB_5,2,0))=16,\"\",VLOOKUP($A66,FB_5,2,0))&IF(TYPE(VLOOKUP($A66,FB_6,2,0))=16,\"\",VLOOKUP($A66,FB_6,2,0))&IF(TYPE(VLOOKUP($A66,FB_7,2,0))=16,\"\",VLOOKUP($A66,FB_7,2,0))&IF(TYPE(VLOOKUP($A66,FB_8,2,0))=16,\"\",VLOOKUP($A66,FB_8,2,0))&IF(TYPE(VLOOKUP($A66,FB_9,2,0))=16,\"\",VLOOKUP($A66,FB_9,2,0))&IF(TYPE(VLOOKUP($A66,FB_10,2,0))=16,\"\",VLOOKUP($A66,FB_10,2,0))&IF(TYPE(VLOOKUP($A66,FB_11,2,0))=16,\"\",VLOOKUP($A66,FB_11,2,0))&IF(TYPE(VLOOKUP($A66,FB_12,2,0))=16,\"\",VLOOKUP($A66,FB_12,2,0))&IF(TYPE(VLOOKUP($A66,FB_13,2,0))=16,\"\",VLOOKUP($A66,FB_13,2,0))&IF(TYPE(VLOOKUP($A66,FB_14,2,0))=16,\"\",VLOOKUP($A66,FB_14,2,0))&IF(TYPE(VLOOKUP($A66,FB_15,2,0))=16,\"\",VLOOKUP($A66,FB_15,2,0))&IF(TYPE(VLOOKUP($A66,FB_16,2,0))=16,\"\",VLOOKUP($A66,FB_16,2,0))&IF(TYPE(VLOOKUP($A66,FB_17,2,0))=16,\"\",VLOOKUP($A66,FB_17,2,0))&IF(TYPE(VLOOKUP($A66,FB_18,2,0))=16,\"\",VLOOKUP($A66,FB_18,2,0))&IF(TYPE(VLOOKUP($A66,FB_19,2,0))=16,\"\",VLOOKUP($A66,FB_19,2,0))&IF(TYPE(VLOOKUP($A66,FB_20,2,0))=16,\"\",VLOOKUP($A66,FB_20,2,0))&IF(TYPE(VLOOKUP($A66,FB_21,2,0))=16,\"\",VLOOKUP($A66,FB_21,2,0))&IF(TYPE(VLOOKUP($A66,FB_22,2,0))=16,\"\",VLOOKUP($A66,FB_22,2,0))&IF(TYPE(VLOOKUP($A66,FB_23,2,0))=16,\"\",VLOOKUP($A66,FB_23,2,0))&IF(TYPE(VLOOKUP($A66,FB_24,2,0))=16,\"\",VLOOKUP($A66,FB_24,2,0))&IF(TYPE(VLOOKUP($A66,FB_25,2,0))=16,\"\",VLOOKUP($A66,FB_25,2,0))&IF(TYPE(VLOOKUP($A66,FB_26,2,0))=16,\"\",VLOOKUP($A66,FB_26,2,0))&IF(TYPE(VLOOKUP($A66,FB_27,2,0))=16,\"\",VLOOKUP($A66,FB_27,2,0))&IF(TYPE(VLOOKUP($A66,FB_28,2,0))=16,\"\",VLOOKUP($A66,FB_28,2,0))&IF(TYPE(VLOOKUP($A66,FB_29,2,0))=16,\"\",VLOOKUP($A66,FB_29,2,0))&IF(TYPE(VLOOKUP($A66,FB_30,2,0))=16,\"\",VLOOKUP($A66,FB_30,2,0))","v":""},null,{"$f":"IF($B66=\"\",\"\",_xlfn.NUMBERVALUE(IF(TYPE(VLOOKUP($A66,FB_1,P$5,0))=16,\"\",VLOOKUP($A66,FB_1,P$5,0))&IF(TYPE(VLOOKUP($A66,FB_2,P$5,0))=16,\"\",VLOOKUP($A66,FB_2,P$5,0))&IF(TYPE(VLOOKUP($A66,FB_3,P$5,0))=16,\"\",VLOOKUP($A66,FB_3,P$5,0))&IF(TYPE(VLOOKUP($A66,FB_4,P$5,0))=16,\"\",VLOOKUP($A66,FB_4,P$5,0))&IF(TYPE(VLOOKUP($A66,FB_5,P$5,0))=16,\"\",VLOOKUP($A66,FB_5,P$5,0))&IF(TYPE(VLOOKUP($A66,FB_6,P$5,0))=16,\"\",VLOOKUP($A66,FB_6,P$5,0))&IF(TYPE(VLOOKUP($A66,FB_7,P$5,0))=16,\"\",VLOOKUP($A66,FB_7,P$5,0))&IF(TYPE(VLOOKUP($A66,FB_8,P$5,0))=16,\"\",VLOOKUP($A66,FB_8,P$5,0))&IF(TYPE(VLOOKUP($A66,FB_9,P$5,0))=16,\"\",VLOOKUP($A66,FB_9,P$5,0))&IF(TYPE(VLOOKUP($A66,FB_10,P$5,0))=16,\"\",VLOOKUP($A66,FB_10,P$5,0))&IF(TYPE(VLOOKUP($A66,FB_11,P$5,0))=16,\"\",VLOOKUP($A66,FB_11,P$5,0))&IF(TYPE(VLOOKUP($A66,FB_12,P$5,0))=16,\"\",VLOOKUP($A66,FB_12,P$5,0))&IF(TYPE(VLOOKUP($A66,FB_13,P$5,0))=16,\"\",VLOOKUP($A66,FB_13,P$5,0))&IF(TYPE(VLOOKUP($A66,FB_14,P$5,0))=16,\"\",VLOOKUP($A66,FB_14,P$5,0))&IF(TYPE(VLOOKUP($A66,FB_15,P$5,0))=16,\"\",VLOOKUP($A66,FB_15,P$5,0))&IF(TYPE(VLOOKUP($A66,FB_16,P$5,0))=16,\"\",VLOOKUP($A66,FB_16,P$5,0))&IF(TYPE(VLOOKUP($A66,FB_17,P$5,0))=16,\"\",VLOOKUP($A66,FB_17,P$5,0))&IF(TYPE(VLOOKUP($A66,FB_18,P$5,0))=16,\"\",VLOOKUP($A66,FB_18,P$5,0))&IF(TYPE(VLOOKUP($A66,FB_19,P$5,0))=16,\"\",VLOOKUP($A66,FB_19,P$5,0))&IF(TYPE(VLOOKUP($A66,FB_20,P$5,0))=16,\"\",VLOOKUP($A66,FB_20,P$5,0))&IF(TYPE(VLOOKUP($A66,FB_21,P$5,0))=16,\"\",VLOOKUP($A66,FB_21,P$5,0))&IF(TYPE(VLOOKUP($A66,FB_22,P$5,0))=16,\"\",VLOOKUP($A66,FB_22,P$5,0))&IF(TYPE(VLOOKUP($A66,FB_23,P$5,0))=16,\"\",VLOOKUP($A66,FB_23,P$5,0))&IF(TYPE(VLOOKUP($A66,FB_24,P$5,0))=16,\"\",VLOOKUP($A66,FB_24,P$5,0))&IF(TYPE(VLOOKUP($A66,FB_25,P$5,0))=16,\"\",VLOOKUP($A66,FB_25,P$5,0))&IF(TYPE(VLOOKUP($A66,FB_26,P$5,0))=16,\"\",VLOOKUP($A66,FB_26,P$5,0))&IF(TYPE(VLOOKUP($A66,FB_27,P$5,0))=16,\"\",VLOOKUP($A66,FB_27,P$5,0))&IF(TYPE(VLOOKUP($A66,FB_28,P$5,0))=16,\"\",VLOOKUP($A66,FB_28,P$5,0))&IF(TYPE(VLOOKUP($A66,FB_29,P$5,0))=16,\"\",VLOOKUP($A66,FB_29,P$5,0))&IF(TYPE(VLOOKUP($A66,FB_30,P$5,0))=16,\"\",VLOOKUP($A66,FB_30,P$5,0))))","v":""},"",{"$f":"IF($B66=\"\",\"\",_xlfn.NUMBERVALUE(IF(TYPE(VLOOKUP($A66,FB_1,R$5,0))=16,\"\",VLOOKUP($A66,FB_1,R$5,0))&IF(TYPE(VLOOKUP($A66,FB_2,R$5,0))=16,\"\",VLOOKUP($A66,FB_2,R$5,0))&IF(TYPE(VLOOKUP($A66,FB_3,R$5,0))=16,\"\",VLOOKUP($A66,FB_3,R$5,0))&IF(TYPE(VLOOKUP($A66,FB_4,R$5,0))=16,\"\",VLOOKUP($A66,FB_4,R$5,0))&IF(TYPE(VLOOKUP($A66,FB_5,R$5,0))=16,\"\",VLOOKUP($A66,FB_5,R$5,0))&IF(TYPE(VLOOKUP($A66,FB_6,R$5,0))=16,\"\",VLOOKUP($A66,FB_6,R$5,0))&IF(TYPE(VLOOKUP($A66,FB_7,R$5,0))=16,\"\",VLOOKUP($A66,FB_7,R$5,0))&IF(TYPE(VLOOKUP($A66,FB_8,R$5,0))=16,\"\",VLOOKUP($A66,FB_8,R$5,0))&IF(TYPE(VLOOKUP($A66,FB_9,R$5,0))=16,\"\",VLOOKUP($A66,FB_9,R$5,0))&IF(TYPE(VLOOKUP($A66,FB_10,R$5,0))=16,\"\",VLOOKUP($A66,FB_10,R$5,0))&IF(TYPE(VLOOKUP($A66,FB_11,R$5,0))=16,\"\",VLOOKUP($A66,FB_11,R$5,0))&IF(TYPE(VLOOKUP($A66,FB_12,R$5,0))=16,\"\",VLOOKUP($A66,FB_12,R$5,0))&IF(TYPE(VLOOKUP($A66,FB_13,R$5,0))=16,\"\",VLOOKUP($A66,FB_13,R$5,0))&IF(TYPE(VLOOKUP($A66,FB_14,R$5,0))=16,\"\",VLOOKUP($A66,FB_14,R$5,0))&IF(TYPE(VLOOKUP($A66,FB_15,R$5,0))=16,\"\",VLOOKUP($A66,FB_15,R$5,0))&IF(TYPE(VLOOKUP($A66,FB_16,R$5,0))=16,\"\",VLOOKUP($A66,FB_16,R$5,0))&IF(TYPE(VLOOKUP($A66,FB_17,R$5,0))=16,\"\",VLOOKUP($A66,FB_17,R$5,0))&IF(TYPE(VLOOKUP($A66,FB_18,R$5,0))=16,\"\",VLOOKUP($A66,FB_18,R$5,0))&IF(TYPE(VLOOKUP($A66,FB_19,R$5,0))=16,\"\",VLOOKUP($A66,FB_19,R$5,0))&IF(TYPE(VLOOKUP($A66,FB_20,R$5,0))=16,\"\",VLOOKUP($A66,FB_20,R$5,0))&IF(TYPE(VLOOKUP($A66,FB_21,R$5,0))=16,\"\",VLOOKUP($A66,FB_21,R$5,0))&IF(TYPE(VLOOKUP($A66,FB_22,R$5,0))=16,\"\",VLOOKUP($A66,FB_22,R$5,0))&IF(TYPE(VLOOKUP($A66,FB_23,R$5,0))=16,\"\",VLOOKUP($A66,FB_23,R$5,0))&IF(TYPE(VLOOKUP($A66,FB_24,R$5,0))=16,\"\",VLOOKUP($A66,FB_24,R$5,0))&IF(TYPE(VLOOKUP($A66,FB_25,R$5,0))=16,\"\",VLOOKUP($A66,FB_25,R$5,0))&IF(TYPE(VLOOKUP($A66,FB_26,R$5,0))=16,\"\",VLOOKUP($A66,FB_26,R$5,0))&IF(TYPE(VLOOKUP($A66,FB_27,R$5,0))=16,\"\",VLOOKUP($A66,FB_27,R$5,0))&IF(TYPE(VLOOKUP($A66,FB_28,R$5,0))=16,\"\",VLOOKUP($A66,FB_28,R$5,0))&IF(TYPE(VLOOKUP($A66,FB_29,R$5,0))=16,\"\",VLOOKUP($A66,FB_29,R$5,0))&IF(TYPE(VLOOKUP($A66,FB_30,R$5,0))=16,\"\",VLOOKUP($A66,FB_30,R$5,0))))","v":""},{"$f":"IF($B66=\"\",\"\",IF(TYPE(VLOOKUP($A66,FB_1,S$5,0))=16,\"\",VLOOKUP($A66,FB_1,S$5,0))&IF(TYPE(VLOOKUP($A66,FB_2,S$5,0))=16,\"\",VLOOKUP($A66,FB_2,S$5,0))&IF(TYPE(VLOOKUP($A66,FB_3,S$5,0))=16,\"\",VLOOKUP($A66,FB_3,S$5,0))&IF(TYPE(VLOOKUP($A66,FB_4,S$5,0))=16,\"\",VLOOKUP($A66,FB_4,S$5,0))&IF(TYPE(VLOOKUP($A66,FB_5,S$5,0))=16,\"\",VLOOKUP($A66,FB_5,S$5,0))&IF(TYPE(VLOOKUP($A66,FB_6,S$5,0))=16,\"\",VLOOKUP($A66,FB_6,S$5,0))&IF(TYPE(VLOOKUP($A66,FB_7,S$5,0))=16,\"\",VLOOKUP($A66,FB_7,S$5,0))&IF(TYPE(VLOOKUP($A66,FB_8,S$5,0))=16,\"\",VLOOKUP($A66,FB_8,S$5,0))&IF(TYPE(VLOOKUP($A66,FB_9,S$5,0))=16,\"\",VLOOKUP($A66,FB_9,S$5,0))&IF(TYPE(VLOOKUP($A66,FB_10,S$5,0))=16,\"\",VLOOKUP($A66,FB_10,S$5,0))&IF(TYPE(VLOOKUP($A66,FB_11,S$5,0))=16,\"\",VLOOKUP($A66,FB_11,S$5,0))&IF(TYPE(VLOOKUP($A66,FB_12,S$5,0))=16,\"\",VLOOKUP($A66,FB_12,S$5,0))&IF(TYPE(VLOOKUP($A66,FB_13,S$5,0))=16,\"\",VLOOKUP($A66,FB_13,S$5,0))&IF(TYPE(VLOOKUP($A66,FB_14,S$5,0))=16,\"\",VLOOKUP($A66,FB_14,S$5,0))&IF(TYPE(VLOOKUP($A66,FB_15,S$5,0))=16,\"\",VLOOKUP($A66,FB_15,S$5,0))&IF(TYPE(VLOOKUP($A66,FB_16,S$5,0))=16,\"\",VLOOKUP($A66,FB_16,S$5,0))&IF(TYPE(VLOOKUP($A66,FB_17,S$5,0))=16,\"\",VLOOKUP($A66,FB_17,S$5,0))&IF(TYPE(VLOOKUP($A66,FB_18,S$5,0))=16,\"\",VLOOKUP($A66,FB_18,S$5,0))&IF(TYPE(VLOOKUP($A66,FB_19,S$5,0))=16,\"\",VLOOKUP($A66,FB_19,S$5,0))&IF(TYPE(VLOOKUP($A66,FB_20,S$5,0))=16,\"\",VLOOKUP($A66,FB_20,S$5,0))&IF(TYPE(VLOOKUP($A66,FB_21,S$5,0))=16,\"\",VLOOKUP($A66,FB_21,S$5,0))&IF(TYPE(VLOOKUP($A66,FB_22,S$5,0))=16,\"\",VLOOKUP($A66,FB_22,S$5,0))&IF(TYPE(VLOOKUP($A66,FB_23,S$5,0))=16,\"\",VLOOKUP($A66,FB_23,S$5,0))&IF(TYPE(VLOOKUP($A66,FB_24,S$5,0))=16,\"\",VLOOKUP($A66,FB_24,S$5,0))&IF(TYPE(VLOOKUP($A66,FB_25,S$5,0))=16,\"\",VLOOKUP($A66,FB_25,S$5,0))&IF(TYPE(VLOOKUP($A66,FB_26,S$5,0))=16,\"\",VLOOKUP($A66,FB_26,S$5,0))&IF(TYPE(VLOOKUP($A66,FB_27,S$5,0))=16,\"\",VLOOKUP($A66,FB_27,S$5,0))&IF(TYPE(VLOOKUP($A66,FB_28,S$5,0))=16,\"\",VLOOKUP($A66,FB_28,S$5,0))&IF(TYPE(VLOOKUP($A66,FB_29,S$5,0))=16,\"\",VLOOKUP($A66,FB_29,S$5,0))&IF(TYPE(VLOOKUP($A66,FB_30,S$5,0))=16,\"\",VLOOKUP($A66,FB_30,S$5,0)))","v":""},null,null,null,null,null,null,null,null,null,null,null,null,null,null,null,null,"",":","","",""]
["38.",{"$f":"IF(TYPE(VLOOKUP($A67,FB_1,2,0))=16,\"\",VLOOKUP($A67,FB_1,2,0))&IF(TYPE(VLOOKUP($A67,FB_2,2,0))=16,\"\",VLOOKUP($A67,FB_2,2,0))&IF(TYPE(VLOOKUP($A67,FB_3,2,0))=16,\"\",VLOOKUP($A67,FB_3,2,0))&IF(TYPE(VLOOKUP($A67,FB_4,2,0))=16,\"\",VLOOKUP($A67,FB_4,2,0))&IF(TYPE(VLOOKUP($A67,FB_5,2,0))=16,\"\",VLOOKUP($A67,FB_5,2,0))&IF(TYPE(VLOOKUP($A67,FB_6,2,0))=16,\"\",VLOOKUP($A67,FB_6,2,0))&IF(TYPE(VLOOKUP($A67,FB_7,2,0))=16,\"\",VLOOKUP($A67,FB_7,2,0))&IF(TYPE(VLOOKUP($A67,FB_8,2,0))=16,\"\",VLOOKUP($A67,FB_8,2,0))&IF(TYPE(VLOOKUP($A67,FB_9,2,0))=16,\"\",VLOOKUP($A67,FB_9,2,0))&IF(TYPE(VLOOKUP($A67,FB_10,2,0))=16,\"\",VLOOKUP($A67,FB_10,2,0))&IF(TYPE(VLOOKUP($A67,FB_11,2,0))=16,\"\",VLOOKUP($A67,FB_11,2,0))&IF(TYPE(VLOOKUP($A67,FB_12,2,0))=16,\"\",VLOOKUP($A67,FB_12,2,0))&IF(TYPE(VLOOKUP($A67,FB_13,2,0))=16,\"\",VLOOKUP($A67,FB_13,2,0))&IF(TYPE(VLOOKUP($A67,FB_14,2,0))=16,\"\",VLOOKUP($A67,FB_14,2,0))&IF(TYPE(VLOOKUP($A67,FB_15,2,0))=16,\"\",VLOOKUP($A67,FB_15,2,0))&IF(TYPE(VLOOKUP($A67,FB_16,2,0))=16,\"\",VLOOKUP($A67,FB_16,2,0))&IF(TYPE(VLOOKUP($A67,FB_17,2,0))=16,\"\",VLOOKUP($A67,FB_17,2,0))&IF(TYPE(VLOOKUP($A67,FB_18,2,0))=16,\"\",VLOOKUP($A67,FB_18,2,0))&IF(TYPE(VLOOKUP($A67,FB_19,2,0))=16,\"\",VLOOKUP($A67,FB_19,2,0))&IF(TYPE(VLOOKUP($A67,FB_20,2,0))=16,\"\",VLOOKUP($A67,FB_20,2,0))&IF(TYPE(VLOOKUP($A67,FB_21,2,0))=16,\"\",VLOOKUP($A67,FB_21,2,0))&IF(TYPE(VLOOKUP($A67,FB_22,2,0))=16,\"\",VLOOKUP($A67,FB_22,2,0))&IF(TYPE(VLOOKUP($A67,FB_23,2,0))=16,\"\",VLOOKUP($A67,FB_23,2,0))&IF(TYPE(VLOOKUP($A67,FB_24,2,0))=16,\"\",VLOOKUP($A67,FB_24,2,0))&IF(TYPE(VLOOKUP($A67,FB_25,2,0))=16,\"\",VLOOKUP($A67,FB_25,2,0))&IF(TYPE(VLOOKUP($A67,FB_26,2,0))=16,\"\",VLOOKUP($A67,FB_26,2,0))&IF(TYPE(VLOOKUP($A67,FB_27,2,0))=16,\"\",VLOOKUP($A67,FB_27,2,0))&IF(TYPE(VLOOKUP($A67,FB_28,2,0))=16,\"\",VLOOKUP($A67,FB_28,2,0))&IF(TYPE(VLOOKUP($A67,FB_29,2,0))=16,\"\",VLOOKUP($A67,FB_29,2,0))&IF(TYPE(VLOOKUP($A67,FB_30,2,0))=16,\"\",VLOOKUP($A67,FB_30,2,0))","v":""},null,{"$f":"IF($B67=\"\",\"\",_xlfn.NUMBERVALUE(IF(TYPE(VLOOKUP($A67,FB_1,P$5,0))=16,\"\",VLOOKUP($A67,FB_1,P$5,0))&IF(TYPE(VLOOKUP($A67,FB_2,P$5,0))=16,\"\",VLOOKUP($A67,FB_2,P$5,0))&IF(TYPE(VLOOKUP($A67,FB_3,P$5,0))=16,\"\",VLOOKUP($A67,FB_3,P$5,0))&IF(TYPE(VLOOKUP($A67,FB_4,P$5,0))=16,\"\",VLOOKUP($A67,FB_4,P$5,0))&IF(TYPE(VLOOKUP($A67,FB_5,P$5,0))=16,\"\",VLOOKUP($A67,FB_5,P$5,0))&IF(TYPE(VLOOKUP($A67,FB_6,P$5,0))=16,\"\",VLOOKUP($A67,FB_6,P$5,0))&IF(TYPE(VLOOKUP($A67,FB_7,P$5,0))=16,\"\",VLOOKUP($A67,FB_7,P$5,0))&IF(TYPE(VLOOKUP($A67,FB_8,P$5,0))=16,\"\",VLOOKUP($A67,FB_8,P$5,0))&IF(TYPE(VLOOKUP($A67,FB_9,P$5,0))=16,\"\",VLOOKUP($A67,FB_9,P$5,0))&IF(TYPE(VLOOKUP($A67,FB_10,P$5,0))=16,\"\",VLOOKUP($A67,FB_10,P$5,0))&IF(TYPE(VLOOKUP($A67,FB_11,P$5,0))=16,\"\",VLOOKUP($A67,FB_11,P$5,0))&IF(TYPE(VLOOKUP($A67,FB_12,P$5,0))=16,\"\",VLOOKUP($A67,FB_12,P$5,0))&IF(TYPE(VLOOKUP($A67,FB_13,P$5,0))=16,\"\",VLOOKUP($A67,FB_13,P$5,0))&IF(TYPE(VLOOKUP($A67,FB_14,P$5,0))=16,\"\",VLOOKUP($A67,FB_14,P$5,0))&IF(TYPE(VLOOKUP($A67,FB_15,P$5,0))=16,\"\",VLOOKUP($A67,FB_15,P$5,0))&IF(TYPE(VLOOKUP($A67,FB_16,P$5,0))=16,\"\",VLOOKUP($A67,FB_16,P$5,0))&IF(TYPE(VLOOKUP($A67,FB_17,P$5,0))=16,\"\",VLOOKUP($A67,FB_17,P$5,0))&IF(TYPE(VLOOKUP($A67,FB_18,P$5,0))=16,\"\",VLOOKUP($A67,FB_18,P$5,0))&IF(TYPE(VLOOKUP($A67,FB_19,P$5,0))=16,\"\",VLOOKUP($A67,FB_19,P$5,0))&IF(TYPE(VLOOKUP($A67,FB_20,P$5,0))=16,\"\",VLOOKUP($A67,FB_20,P$5,0))&IF(TYPE(VLOOKUP($A67,FB_21,P$5,0))=16,\"\",VLOOKUP($A67,FB_21,P$5,0))&IF(TYPE(VLOOKUP($A67,FB_22,P$5,0))=16,\"\",VLOOKUP($A67,FB_22,P$5,0))&IF(TYPE(VLOOKUP($A67,FB_23,P$5,0))=16,\"\",VLOOKUP($A67,FB_23,P$5,0))&IF(TYPE(VLOOKUP($A67,FB_24,P$5,0))=16,\"\",VLOOKUP($A67,FB_24,P$5,0))&IF(TYPE(VLOOKUP($A67,FB_25,P$5,0))=16,\"\",VLOOKUP($A67,FB_25,P$5,0))&IF(TYPE(VLOOKUP($A67,FB_26,P$5,0))=16,\"\",VLOOKUP($A67,FB_26,P$5,0))&IF(TYPE(VLOOKUP($A67,FB_27,P$5,0))=16,\"\",VLOOKUP($A67,FB_27,P$5,0))&IF(TYPE(VLOOKUP($A67,FB_28,P$5,0))=16,\"\",VLOOKUP($A67,FB_28,P$5,0))&IF(TYPE(VLOOKUP($A67,FB_29,P$5,0))=16,\"\",VLOOKUP($A67,FB_29,P$5,0))&IF(TYPE(VLOOKUP($A67,FB_30,P$5,0))=16,\"\",VLOOKUP($A67,FB_30,P$5,0))))","v":""},"",{"$f":"IF($B67=\"\",\"\",_xlfn.NUMBERVALUE(IF(TYPE(VLOOKUP($A67,FB_1,R$5,0))=16,\"\",VLOOKUP($A67,FB_1,R$5,0))&IF(TYPE(VLOOKUP($A67,FB_2,R$5,0))=16,\"\",VLOOKUP($A67,FB_2,R$5,0))&IF(TYPE(VLOOKUP($A67,FB_3,R$5,0))=16,\"\",VLOOKUP($A67,FB_3,R$5,0))&IF(TYPE(VLOOKUP($A67,FB_4,R$5,0))=16,\"\",VLOOKUP($A67,FB_4,R$5,0))&IF(TYPE(VLOOKUP($A67,FB_5,R$5,0))=16,\"\",VLOOKUP($A67,FB_5,R$5,0))&IF(TYPE(VLOOKUP($A67,FB_6,R$5,0))=16,\"\",VLOOKUP($A67,FB_6,R$5,0))&IF(TYPE(VLOOKUP($A67,FB_7,R$5,0))=16,\"\",VLOOKUP($A67,FB_7,R$5,0))&IF(TYPE(VLOOKUP($A67,FB_8,R$5,0))=16,\"\",VLOOKUP($A67,FB_8,R$5,0))&IF(TYPE(VLOOKUP($A67,FB_9,R$5,0))=16,\"\",VLOOKUP($A67,FB_9,R$5,0))&IF(TYPE(VLOOKUP($A67,FB_10,R$5,0))=16,\"\",VLOOKUP($A67,FB_10,R$5,0))&IF(TYPE(VLOOKUP($A67,FB_11,R$5,0))=16,\"\",VLOOKUP($A67,FB_11,R$5,0))&IF(TYPE(VLOOKUP($A67,FB_12,R$5,0))=16,\"\",VLOOKUP($A67,FB_12,R$5,0))&IF(TYPE(VLOOKUP($A67,FB_13,R$5,0))=16,\"\",VLOOKUP($A67,FB_13,R$5,0))&IF(TYPE(VLOOKUP($A67,FB_14,R$5,0))=16,\"\",VLOOKUP($A67,FB_14,R$5,0))&IF(TYPE(VLOOKUP($A67,FB_15,R$5,0))=16,\"\",VLOOKUP($A67,FB_15,R$5,0))&IF(TYPE(VLOOKUP($A67,FB_16,R$5,0))=16,\"\",VLOOKUP($A67,FB_16,R$5,0))&IF(TYPE(VLOOKUP($A67,FB_17,R$5,0))=16,\"\",VLOOKUP($A67,FB_17,R$5,0))&IF(TYPE(VLOOKUP($A67,FB_18,R$5,0))=16,\"\",VLOOKUP($A67,FB_18,R$5,0))&IF(TYPE(VLOOKUP($A67,FB_19,R$5,0))=16,\"\",VLOOKUP($A67,FB_19,R$5,0))&IF(TYPE(VLOOKUP($A67,FB_20,R$5,0))=16,\"\",VLOOKUP($A67,FB_20,R$5,0))&IF(TYPE(VLOOKUP($A67,FB_21,R$5,0))=16,\"\",VLOOKUP($A67,FB_21,R$5,0))&IF(TYPE(VLOOKUP($A67,FB_22,R$5,0))=16,\"\",VLOOKUP($A67,FB_22,R$5,0))&IF(TYPE(VLOOKUP($A67,FB_23,R$5,0))=16,\"\",VLOOKUP($A67,FB_23,R$5,0))&IF(TYPE(VLOOKUP($A67,FB_24,R$5,0))=16,\"\",VLOOKUP($A67,FB_24,R$5,0))&IF(TYPE(VLOOKUP($A67,FB_25,R$5,0))=16,\"\",VLOOKUP($A67,FB_25,R$5,0))&IF(TYPE(VLOOKUP($A67,FB_26,R$5,0))=16,\"\",VLOOKUP($A67,FB_26,R$5,0))&IF(TYPE(VLOOKUP($A67,FB_27,R$5,0))=16,\"\",VLOOKUP($A67,FB_27,R$5,0))&IF(TYPE(VLOOKUP($A67,FB_28,R$5,0))=16,\"\",VLOOKUP($A67,FB_28,R$5,0))&IF(TYPE(VLOOKUP($A67,FB_29,R$5,0))=16,\"\",VLOOKUP($A67,FB_29,R$5,0))&IF(TYPE(VLOOKUP($A67,FB_30,R$5,0))=16,\"\",VLOOKUP($A67,FB_30,R$5,0))))","v":""},{"$f":"IF($B67=\"\",\"\",IF(TYPE(VLOOKUP($A67,FB_1,S$5,0))=16,\"\",VLOOKUP($A67,FB_1,S$5,0))&IF(TYPE(VLOOKUP($A67,FB_2,S$5,0))=16,\"\",VLOOKUP($A67,FB_2,S$5,0))&IF(TYPE(VLOOKUP($A67,FB_3,S$5,0))=16,\"\",VLOOKUP($A67,FB_3,S$5,0))&IF(TYPE(VLOOKUP($A67,FB_4,S$5,0))=16,\"\",VLOOKUP($A67,FB_4,S$5,0))&IF(TYPE(VLOOKUP($A67,FB_5,S$5,0))=16,\"\",VLOOKUP($A67,FB_5,S$5,0))&IF(TYPE(VLOOKUP($A67,FB_6,S$5,0))=16,\"\",VLOOKUP($A67,FB_6,S$5,0))&IF(TYPE(VLOOKUP($A67,FB_7,S$5,0))=16,\"\",VLOOKUP($A67,FB_7,S$5,0))&IF(TYPE(VLOOKUP($A67,FB_8,S$5,0))=16,\"\",VLOOKUP($A67,FB_8,S$5,0))&IF(TYPE(VLOOKUP($A67,FB_9,S$5,0))=16,\"\",VLOOKUP($A67,FB_9,S$5,0))&IF(TYPE(VLOOKUP($A67,FB_10,S$5,0))=16,\"\",VLOOKUP($A67,FB_10,S$5,0))&IF(TYPE(VLOOKUP($A67,FB_11,S$5,0))=16,\"\",VLOOKUP($A67,FB_11,S$5,0))&IF(TYPE(VLOOKUP($A67,FB_12,S$5,0))=16,\"\",VLOOKUP($A67,FB_12,S$5,0))&IF(TYPE(VLOOKUP($A67,FB_13,S$5,0))=16,\"\",VLOOKUP($A67,FB_13,S$5,0))&IF(TYPE(VLOOKUP($A67,FB_14,S$5,0))=16,\"\",VLOOKUP($A67,FB_14,S$5,0))&IF(TYPE(VLOOKUP($A67,FB_15,S$5,0))=16,\"\",VLOOKUP($A67,FB_15,S$5,0))&IF(TYPE(VLOOKUP($A67,FB_16,S$5,0))=16,\"\",VLOOKUP($A67,FB_16,S$5,0))&IF(TYPE(VLOOKUP($A67,FB_17,S$5,0))=16,\"\",VLOOKUP($A67,FB_17,S$5,0))&IF(TYPE(VLOOKUP($A67,FB_18,S$5,0))=16,\"\",VLOOKUP($A67,FB_18,S$5,0))&IF(TYPE(VLOOKUP($A67,FB_19,S$5,0))=16,\"\",VLOOKUP($A67,FB_19,S$5,0))&IF(TYPE(VLOOKUP($A67,FB_20,S$5,0))=16,\"\",VLOOKUP($A67,FB_20,S$5,0))&IF(TYPE(VLOOKUP($A67,FB_21,S$5,0))=16,\"\",VLOOKUP($A67,FB_21,S$5,0))&IF(TYPE(VLOOKUP($A67,FB_22,S$5,0))=16,\"\",VLOOKUP($A67,FB_22,S$5,0))&IF(TYPE(VLOOKUP($A67,FB_23,S$5,0))=16,\"\",VLOOKUP($A67,FB_23,S$5,0))&IF(TYPE(VLOOKUP($A67,FB_24,S$5,0))=16,\"\",VLOOKUP($A67,FB_24,S$5,0))&IF(TYPE(VLOOKUP($A67,FB_25,S$5,0))=16,\"\",VLOOKUP($A67,FB_25,S$5,0))&IF(TYPE(VLOOKUP($A67,FB_26,S$5,0))=16,\"\",VLOOKUP($A67,FB_26,S$5,0))&IF(TYPE(VLOOKUP($A67,FB_27,S$5,0))=16,\"\",VLOOKUP($A67,FB_27,S$5,0))&IF(TYPE(VLOOKUP($A67,FB_28,S$5,0))=16,\"\",VLOOKUP($A67,FB_28,S$5,0))&IF(TYPE(VLOOKUP($A67,FB_29,S$5,0))=16,\"\",VLOOKUP($A67,FB_29,S$5,0))&IF(TYPE(VLOOKUP($A67,FB_30,S$5,0))=16,\"\",VLOOKUP($A67,FB_30,S$5,0)))","v":""},null,null,null,null,null,null,null,null,null,null,null,null,null,null,null,null,"",":","","",""]
["39.",{"$f":"IF(TYPE(VLOOKUP($A68,FB_1,2,0))=16,\"\",VLOOKUP($A68,FB_1,2,0))&IF(TYPE(VLOOKUP($A68,FB_2,2,0))=16,\"\",VLOOKUP($A68,FB_2,2,0))&IF(TYPE(VLOOKUP($A68,FB_3,2,0))=16,\"\",VLOOKUP($A68,FB_3,2,0))&IF(TYPE(VLOOKUP($A68,FB_4,2,0))=16,\"\",VLOOKUP($A68,FB_4,2,0))&IF(TYPE(VLOOKUP($A68,FB_5,2,0))=16,\"\",VLOOKUP($A68,FB_5,2,0))&IF(TYPE(VLOOKUP($A68,FB_6,2,0))=16,\"\",VLOOKUP($A68,FB_6,2,0))&IF(TYPE(VLOOKUP($A68,FB_7,2,0))=16,\"\",VLOOKUP($A68,FB_7,2,0))&IF(TYPE(VLOOKUP($A68,FB_8,2,0))=16,\"\",VLOOKUP($A68,FB_8,2,0))&IF(TYPE(VLOOKUP($A68,FB_9,2,0))=16,\"\",VLOOKUP($A68,FB_9,2,0))&IF(TYPE(VLOOKUP($A68,FB_10,2,0))=16,\"\",VLOOKUP($A68,FB_10,2,0))&IF(TYPE(VLOOKUP($A68,FB_11,2,0))=16,\"\",VLOOKUP($A68,FB_11,2,0))&IF(TYPE(VLOOKUP($A68,FB_12,2,0))=16,\"\",VLOOKUP($A68,FB_12,2,0))&IF(TYPE(VLOOKUP($A68,FB_13,2,0))=16,\"\",VLOOKUP($A68,FB_13,2,0))&IF(TYPE(VLOOKUP($A68,FB_14,2,0))=16,\"\",VLOOKUP($A68,FB_14,2,0))&IF(TYPE(VLOOKUP($A68,FB_15,2,0))=16,\"\",VLOOKUP($A68,FB_15,2,0))&IF(TYPE(VLOOKUP($A68,FB_16,2,0))=16,\"\",VLOOKUP($A68,FB_16,2,0))&IF(TYPE(VLOOKUP($A68,FB_17,2,0))=16,\"\",VLOOKUP($A68,FB_17,2,0))&IF(TYPE(VLOOKUP($A68,FB_18,2,0))=16,\"\",VLOOKUP($A68,FB_18,2,0))&IF(TYPE(VLOOKUP($A68,FB_19,2,0))=16,\"\",VLOOKUP($A68,FB_19,2,0))&IF(TYPE(VLOOKUP($A68,FB_20,2,0))=16,\"\",VLOOKUP($A68,FB_20,2,0))&IF(TYPE(VLOOKUP($A68,FB_21,2,0))=16,\"\",VLOOKUP($A68,FB_21,2,0))&IF(TYPE(VLOOKUP($A68,FB_22,2,0))=16,\"\",VLOOKUP($A68,FB_22,2,0))&IF(TYPE(VLOOKUP($A68,FB_23,2,0))=16,\"\",VLOOKUP($A68,FB_23,2,0))&IF(TYPE(VLOOKUP($A68,FB_24,2,0))=16,\"\",VLOOKUP($A68,FB_24,2,0))&IF(TYPE(VLOOKUP($A68,FB_25,2,0))=16,\"\",VLOOKUP($A68,FB_25,2,0))&IF(TYPE(VLOOKUP($A68,FB_26,2,0))=16,\"\",VLOOKUP($A68,FB_26,2,0))&IF(TYPE(VLOOKUP($A68,FB_27,2,0))=16,\"\",VLOOKUP($A68,FB_27,2,0))&IF(TYPE(VLOOKUP($A68,FB_28,2,0))=16,\"\",VLOOKUP($A68,FB_28,2,0))&IF(TYPE(VLOOKUP($A68,FB_29,2,0))=16,\"\",VLOOKUP($A68,FB_29,2,0))&IF(TYPE(VLOOKUP($A68,FB_30,2,0))=16,\"\",VLOOKUP($A68,FB_30,2,0))","v":""},null,{"$f":"IF($B68=\"\",\"\",_xlfn.NUMBERVALUE(IF(TYPE(VLOOKUP($A68,FB_1,P$5,0))=16,\"\",VLOOKUP($A68,FB_1,P$5,0))&IF(TYPE(VLOOKUP($A68,FB_2,P$5,0))=16,\"\",VLOOKUP($A68,FB_2,P$5,0))&IF(TYPE(VLOOKUP($A68,FB_3,P$5,0))=16,\"\",VLOOKUP($A68,FB_3,P$5,0))&IF(TYPE(VLOOKUP($A68,FB_4,P$5,0))=16,\"\",VLOOKUP($A68,FB_4,P$5,0))&IF(TYPE(VLOOKUP($A68,FB_5,P$5,0))=16,\"\",VLOOKUP($A68,FB_5,P$5,0))&IF(TYPE(VLOOKUP($A68,FB_6,P$5,0))=16,\"\",VLOOKUP($A68,FB_6,P$5,0))&IF(TYPE(VLOOKUP($A68,FB_7,P$5,0))=16,\"\",VLOOKUP($A68,FB_7,P$5,0))&IF(TYPE(VLOOKUP($A68,FB_8,P$5,0))=16,\"\",VLOOKUP($A68,FB_8,P$5,0))&IF(TYPE(VLOOKUP($A68,FB_9,P$5,0))=16,\"\",VLOOKUP($A68,FB_9,P$5,0))&IF(TYPE(VLOOKUP($A68,FB_10,P$5,0))=16,\"\",VLOOKUP($A68,FB_10,P$5,0))&IF(TYPE(VLOOKUP($A68,FB_11,P$5,0))=16,\"\",VLOOKUP($A68,FB_11,P$5,0))&IF(TYPE(VLOOKUP($A68,FB_12,P$5,0))=16,\"\",VLOOKUP($A68,FB_12,P$5,0))&IF(TYPE(VLOOKUP($A68,FB_13,P$5,0))=16,\"\",VLOOKUP($A68,FB_13,P$5,0))&IF(TYPE(VLOOKUP($A68,FB_14,P$5,0))=16,\"\",VLOOKUP($A68,FB_14,P$5,0))&IF(TYPE(VLOOKUP($A68,FB_15,P$5,0))=16,\"\",VLOOKUP($A68,FB_15,P$5,0))&IF(TYPE(VLOOKUP($A68,FB_16,P$5,0))=16,\"\",VLOOKUP($A68,FB_16,P$5,0))&IF(TYPE(VLOOKUP($A68,FB_17,P$5,0))=16,\"\",VLOOKUP($A68,FB_17,P$5,0))&IF(TYPE(VLOOKUP($A68,FB_18,P$5,0))=16,\"\",VLOOKUP($A68,FB_18,P$5,0))&IF(TYPE(VLOOKUP($A68,FB_19,P$5,0))=16,\"\",VLOOKUP($A68,FB_19,P$5,0))&IF(TYPE(VLOOKUP($A68,FB_20,P$5,0))=16,\"\",VLOOKUP($A68,FB_20,P$5,0))&IF(TYPE(VLOOKUP($A68,FB_21,P$5,0))=16,\"\",VLOOKUP($A68,FB_21,P$5,0))&IF(TYPE(VLOOKUP($A68,FB_22,P$5,0))=16,\"\",VLOOKUP($A68,FB_22,P$5,0))&IF(TYPE(VLOOKUP($A68,FB_23,P$5,0))=16,\"\",VLOOKUP($A68,FB_23,P$5,0))&IF(TYPE(VLOOKUP($A68,FB_24,P$5,0))=16,\"\",VLOOKUP($A68,FB_24,P$5,0))&IF(TYPE(VLOOKUP($A68,FB_25,P$5,0))=16,\"\",VLOOKUP($A68,FB_25,P$5,0))&IF(TYPE(VLOOKUP($A68,FB_26,P$5,0))=16,\"\",VLOOKUP($A68,FB_26,P$5,0))&IF(TYPE(VLOOKUP($A68,FB_27,P$5,0))=16,\"\",VLOOKUP($A68,FB_27,P$5,0))&IF(TYPE(VLOOKUP($A68,FB_28,P$5,0))=16,\"\",VLOOKUP($A68,FB_28,P$5,0))&IF(TYPE(VLOOKUP($A68,FB_29,P$5,0))=16,\"\",VLOOKUP($A68,FB_29,P$5,0))&IF(TYPE(VLOOKUP($A68,FB_30,P$5,0))=16,\"\",VLOOKUP($A68,FB_30,P$5,0))))","v":""},"",{"$f":"IF($B68=\"\",\"\",_xlfn.NUMBERVALUE(IF(TYPE(VLOOKUP($A68,FB_1,R$5,0))=16,\"\",VLOOKUP($A68,FB_1,R$5,0))&IF(TYPE(VLOOKUP($A68,FB_2,R$5,0))=16,\"\",VLOOKUP($A68,FB_2,R$5,0))&IF(TYPE(VLOOKUP($A68,FB_3,R$5,0))=16,\"\",VLOOKUP($A68,FB_3,R$5,0))&IF(TYPE(VLOOKUP($A68,FB_4,R$5,0))=16,\"\",VLOOKUP($A68,FB_4,R$5,0))&IF(TYPE(VLOOKUP($A68,FB_5,R$5,0))=16,\"\",VLOOKUP($A68,FB_5,R$5,0))&IF(TYPE(VLOOKUP($A68,FB_6,R$5,0))=16,\"\",VLOOKUP($A68,FB_6,R$5,0))&IF(TYPE(VLOOKUP($A68,FB_7,R$5,0))=16,\"\",VLOOKUP($A68,FB_7,R$5,0))&IF(TYPE(VLOOKUP($A68,FB_8,R$5,0))=16,\"\",VLOOKUP($A68,FB_8,R$5,0))&IF(TYPE(VLOOKUP($A68,FB_9,R$5,0))=16,\"\",VLOOKUP($A68,FB_9,R$5,0))&IF(TYPE(VLOOKUP($A68,FB_10,R$5,0))=16,\"\",VLOOKUP($A68,FB_10,R$5,0))&IF(TYPE(VLOOKUP($A68,FB_11,R$5,0))=16,\"\",VLOOKUP($A68,FB_11,R$5,0))&IF(TYPE(VLOOKUP($A68,FB_12,R$5,0))=16,\"\",VLOOKUP($A68,FB_12,R$5,0))&IF(TYPE(VLOOKUP($A68,FB_13,R$5,0))=16,\"\",VLOOKUP($A68,FB_13,R$5,0))&IF(TYPE(VLOOKUP($A68,FB_14,R$5,0))=16,\"\",VLOOKUP($A68,FB_14,R$5,0))&IF(TYPE(VLOOKUP($A68,FB_15,R$5,0))=16,\"\",VLOOKUP($A68,FB_15,R$5,0))&IF(TYPE(VLOOKUP($A68,FB_16,R$5,0))=16,\"\",VLOOKUP($A68,FB_16,R$5,0))&IF(TYPE(VLOOKUP($A68,FB_17,R$5,0))=16,\"\",VLOOKUP($A68,FB_17,R$5,0))&IF(TYPE(VLOOKUP($A68,FB_18,R$5,0))=16,\"\",VLOOKUP($A68,FB_18,R$5,0))&IF(TYPE(VLOOKUP($A68,FB_19,R$5,0))=16,\"\",VLOOKUP($A68,FB_19,R$5,0))&IF(TYPE(VLOOKUP($A68,FB_20,R$5,0))=16,\"\",VLOOKUP($A68,FB_20,R$5,0))&IF(TYPE(VLOOKUP($A68,FB_21,R$5,0))=16,\"\",VLOOKUP($A68,FB_21,R$5,0))&IF(TYPE(VLOOKUP($A68,FB_22,R$5,0))=16,\"\",VLOOKUP($A68,FB_22,R$5,0))&IF(TYPE(VLOOKUP($A68,FB_23,R$5,0))=16,\"\",VLOOKUP($A68,FB_23,R$5,0))&IF(TYPE(VLOOKUP($A68,FB_24,R$5,0))=16,\"\",VLOOKUP($A68,FB_24,R$5,0))&IF(TYPE(VLOOKUP($A68,FB_25,R$5,0))=16,\"\",VLOOKUP($A68,FB_25,R$5,0))&IF(TYPE(VLOOKUP($A68,FB_26,R$5,0))=16,\"\",VLOOKUP($A68,FB_26,R$5,0))&IF(TYPE(VLOOKUP($A68,FB_27,R$5,0))=16,\"\",VLOOKUP($A68,FB_27,R$5,0))&IF(TYPE(VLOOKUP($A68,FB_28,R$5,0))=16,\"\",VLOOKUP($A68,FB_28,R$5,0))&IF(TYPE(VLOOKUP($A68,FB_29,R$5,0))=16,\"\",VLOOKUP($A68,FB_29,R$5,0))&IF(TYPE(VLOOKUP($A68,FB_30,R$5,0))=16,\"\",VLOOKUP($A68,FB_30,R$5,0))))","v":""},{"$f":"IF($B68=\"\",\"\",IF(TYPE(VLOOKUP($A68,FB_1,S$5,0))=16,\"\",VLOOKUP($A68,FB_1,S$5,0))&IF(TYPE(VLOOKUP($A68,FB_2,S$5,0))=16,\"\",VLOOKUP($A68,FB_2,S$5,0))&IF(TYPE(VLOOKUP($A68,FB_3,S$5,0))=16,\"\",VLOOKUP($A68,FB_3,S$5,0))&IF(TYPE(VLOOKUP($A68,FB_4,S$5,0))=16,\"\",VLOOKUP($A68,FB_4,S$5,0))&IF(TYPE(VLOOKUP($A68,FB_5,S$5,0))=16,\"\",VLOOKUP($A68,FB_5,S$5,0))&IF(TYPE(VLOOKUP($A68,FB_6,S$5,0))=16,\"\",VLOOKUP($A68,FB_6,S$5,0))&IF(TYPE(VLOOKUP($A68,FB_7,S$5,0))=16,\"\",VLOOKUP($A68,FB_7,S$5,0))&IF(TYPE(VLOOKUP($A68,FB_8,S$5,0))=16,\"\",VLOOKUP($A68,FB_8,S$5,0))&IF(TYPE(VLOOKUP($A68,FB_9,S$5,0))=16,\"\",VLOOKUP($A68,FB_9,S$5,0))&IF(TYPE(VLOOKUP($A68,FB_10,S$5,0))=16,\"\",VLOOKUP($A68,FB_10,S$5,0))&IF(TYPE(VLOOKUP($A68,FB_11,S$5,0))=16,\"\",VLOOKUP($A68,FB_11,S$5,0))&IF(TYPE(VLOOKUP($A68,FB_12,S$5,0))=16,\"\",VLOOKUP($A68,FB_12,S$5,0))&IF(TYPE(VLOOKUP($A68,FB_13,S$5,0))=16,\"\",VLOOKUP($A68,FB_13,S$5,0))&IF(TYPE(VLOOKUP($A68,FB_14,S$5,0))=16,\"\",VLOOKUP($A68,FB_14,S$5,0))&IF(TYPE(VLOOKUP($A68,FB_15,S$5,0))=16,\"\",VLOOKUP($A68,FB_15,S$5,0))&IF(TYPE(VLOOKUP($A68,FB_16,S$5,0))=16,\"\",VLOOKUP($A68,FB_16,S$5,0))&IF(TYPE(VLOOKUP($A68,FB_17,S$5,0))=16,\"\",VLOOKUP($A68,FB_17,S$5,0))&IF(TYPE(VLOOKUP($A68,FB_18,S$5,0))=16,\"\",VLOOKUP($A68,FB_18,S$5,0))&IF(TYPE(VLOOKUP($A68,FB_19,S$5,0))=16,\"\",VLOOKUP($A68,FB_19,S$5,0))&IF(TYPE(VLOOKUP($A68,FB_20,S$5,0))=16,\"\",VLOOKUP($A68,FB_20,S$5,0))&IF(TYPE(VLOOKUP($A68,FB_21,S$5,0))=16,\"\",VLOOKUP($A68,FB_21,S$5,0))&IF(TYPE(VLOOKUP($A68,FB_22,S$5,0))=16,\"\",VLOOKUP($A68,FB_22,S$5,0))&IF(TYPE(VLOOKUP($A68,FB_23,S$5,0))=16,\"\",VLOOKUP($A68,FB_23,S$5,0))&IF(TYPE(VLOOKUP($A68,FB_24,S$5,0))=16,\"\",VLOOKUP($A68,FB_24,S$5,0))&IF(TYPE(VLOOKUP($A68,FB_25,S$5,0))=16,\"\",VLOOKUP($A68,FB_25,S$5,0))&IF(TYPE(VLOOKUP($A68,FB_26,S$5,0))=16,\"\",VLOOKUP($A68,FB_26,S$5,0))&IF(TYPE(VLOOKUP($A68,FB_27,S$5,0))=16,\"\",VLOOKUP($A68,FB_27,S$5,0))&IF(TYPE(VLOOKUP($A68,FB_28,S$5,0))=16,\"\",VLOOKUP($A68,FB_28,S$5,0))&IF(TYPE(VLOOKUP($A68,FB_29,S$5,0))=16,\"\",VLOOKUP($A68,FB_29,S$5,0))&IF(TYPE(VLOOKUP($A68,FB_30,S$5,0))=16,\"\",VLOOKUP($A68,FB_30,S$5,0)))","v":""},null,null,null,null,null,null,null,null,null,null,null,null,null,null,null,null,"",":","","",""]
["40.",{"$f":"IF(TYPE(VLOOKUP($A69,FB_1,2,0))=16,\"\",VLOOKUP($A69,FB_1,2,0))&IF(TYPE(VLOOKUP($A69,FB_2,2,0))=16,\"\",VLOOKUP($A69,FB_2,2,0))&IF(TYPE(VLOOKUP($A69,FB_3,2,0))=16,\"\",VLOOKUP($A69,FB_3,2,0))&IF(TYPE(VLOOKUP($A69,FB_4,2,0))=16,\"\",VLOOKUP($A69,FB_4,2,0))&IF(TYPE(VLOOKUP($A69,FB_5,2,0))=16,\"\",VLOOKUP($A69,FB_5,2,0))&IF(TYPE(VLOOKUP($A69,FB_6,2,0))=16,\"\",VLOOKUP($A69,FB_6,2,0))&IF(TYPE(VLOOKUP($A69,FB_7,2,0))=16,\"\",VLOOKUP($A69,FB_7,2,0))&IF(TYPE(VLOOKUP($A69,FB_8,2,0))=16,\"\",VLOOKUP($A69,FB_8,2,0))&IF(TYPE(VLOOKUP($A69,FB_9,2,0))=16,\"\",VLOOKUP($A69,FB_9,2,0))&IF(TYPE(VLOOKUP($A69,FB_10,2,0))=16,\"\",VLOOKUP($A69,FB_10,2,0))&IF(TYPE(VLOOKUP($A69,FB_11,2,0))=16,\"\",VLOOKUP($A69,FB_11,2,0))&IF(TYPE(VLOOKUP($A69,FB_12,2,0))=16,\"\",VLOOKUP($A69,FB_12,2,0))&IF(TYPE(VLOOKUP($A69,FB_13,2,0))=16,\"\",VLOOKUP($A69,FB_13,2,0))&IF(TYPE(VLOOKUP($A69,FB_14,2,0))=16,\"\",VLOOKUP($A69,FB_14,2,0))&IF(TYPE(VLOOKUP($A69,FB_15,2,0))=16,\"\",VLOOKUP($A69,FB_15,2,0))&IF(TYPE(VLOOKUP($A69,FB_16,2,0))=16,\"\",VLOOKUP($A69,FB_16,2,0))&IF(TYPE(VLOOKUP($A69,FB_17,2,0))=16,\"\",VLOOKUP($A69,FB_17,2,0))&IF(TYPE(VLOOKUP($A69,FB_18,2,0))=16,\"\",VLOOKUP($A69,FB_18,2,0))&IF(TYPE(VLOOKUP($A69,FB_19,2,0))=16,\"\",VLOOKUP($A69,FB_19,2,0))&IF(TYPE(VLOOKUP($A69,FB_20,2,0))=16,\"\",VLOOKUP($A69,FB_20,2,0))&IF(TYPE(VLOOKUP($A69,FB_21,2,0))=16,\"\",VLOOKUP($A69,FB_21,2,0))&IF(TYPE(VLOOKUP($A69,FB_22,2,0))=16,\"\",VLOOKUP($A69,FB_22,2,0))&IF(TYPE(VLOOKUP($A69,FB_23,2,0))=16,\"\",VLOOKUP($A69,FB_23,2,0))&IF(TYPE(VLOOKUP($A69,FB_24,2,0))=16,\"\",VLOOKUP($A69,FB_24,2,0))&IF(TYPE(VLOOKUP($A69,FB_25,2,0))=16,\"\",VLOOKUP($A69,FB_25,2,0))&IF(TYPE(VLOOKUP($A69,FB_26,2,0))=16,\"\",VLOOKUP($A69,FB_26,2,0))&IF(TYPE(VLOOKUP($A69,FB_27,2,0))=16,\"\",VLOOKUP($A69,FB_27,2,0))&IF(TYPE(VLOOKUP($A69,FB_28,2,0))=16,\"\",VLOOKUP($A69,FB_28,2,0))&IF(TYPE(VLOOKUP($A69,FB_29,2,0))=16,\"\",VLOOKUP($A69,FB_29,2,0))&IF(TYPE(VLOOKUP($A69,FB_30,2,0))=16,\"\",VLOOKUP($A69,FB_30,2,0))","v":""},null,{"$f":"IF($B69=\"\",\"\",_xlfn.NUMBERVALUE(IF(TYPE(VLOOKUP($A69,FB_1,P$5,0))=16,\"\",VLOOKUP($A69,FB_1,P$5,0))&IF(TYPE(VLOOKUP($A69,FB_2,P$5,0))=16,\"\",VLOOKUP($A69,FB_2,P$5,0))&IF(TYPE(VLOOKUP($A69,FB_3,P$5,0))=16,\"\",VLOOKUP($A69,FB_3,P$5,0))&IF(TYPE(VLOOKUP($A69,FB_4,P$5,0))=16,\"\",VLOOKUP($A69,FB_4,P$5,0))&IF(TYPE(VLOOKUP($A69,FB_5,P$5,0))=16,\"\",VLOOKUP($A69,FB_5,P$5,0))&IF(TYPE(VLOOKUP($A69,FB_6,P$5,0))=16,\"\",VLOOKUP($A69,FB_6,P$5,0))&IF(TYPE(VLOOKUP($A69,FB_7,P$5,0))=16,\"\",VLOOKUP($A69,FB_7,P$5,0))&IF(TYPE(VLOOKUP($A69,FB_8,P$5,0))=16,\"\",VLOOKUP($A69,FB_8,P$5,0))&IF(TYPE(VLOOKUP($A69,FB_9,P$5,0))=16,\"\",VLOOKUP($A69,FB_9,P$5,0))&IF(TYPE(VLOOKUP($A69,FB_10,P$5,0))=16,\"\",VLOOKUP($A69,FB_10,P$5,0))&IF(TYPE(VLOOKUP($A69,FB_11,P$5,0))=16,\"\",VLOOKUP($A69,FB_11,P$5,0))&IF(TYPE(VLOOKUP($A69,FB_12,P$5,0))=16,\"\",VLOOKUP($A69,FB_12,P$5,0))&IF(TYPE(VLOOKUP($A69,FB_13,P$5,0))=16,\"\",VLOOKUP($A69,FB_13,P$5,0))&IF(TYPE(VLOOKUP($A69,FB_14,P$5,0))=16,\"\",VLOOKUP($A69,FB_14,P$5,0))&IF(TYPE(VLOOKUP($A69,FB_15,P$5,0))=16,\"\",VLOOKUP($A69,FB_15,P$5,0))&IF(TYPE(VLOOKUP($A69,FB_16,P$5,0))=16,\"\",VLOOKUP($A69,FB_16,P$5,0))&IF(TYPE(VLOOKUP($A69,FB_17,P$5,0))=16,\"\",VLOOKUP($A69,FB_17,P$5,0))&IF(TYPE(VLOOKUP($A69,FB_18,P$5,0))=16,\"\",VLOOKUP($A69,FB_18,P$5,0))&IF(TYPE(VLOOKUP($A69,FB_19,P$5,0))=16,\"\",VLOOKUP($A69,FB_19,P$5,0))&IF(TYPE(VLOOKUP($A69,FB_20,P$5,0))=16,\"\",VLOOKUP($A69,FB_20,P$5,0))&IF(TYPE(VLOOKUP($A69,FB_21,P$5,0))=16,\"\",VLOOKUP($A69,FB_21,P$5,0))&IF(TYPE(VLOOKUP($A69,FB_22,P$5,0))=16,\"\",VLOOKUP($A69,FB_22,P$5,0))&IF(TYPE(VLOOKUP($A69,FB_23,P$5,0))=16,\"\",VLOOKUP($A69,FB_23,P$5,0))&IF(TYPE(VLOOKUP($A69,FB_24,P$5,0))=16,\"\",VLOOKUP($A69,FB_24,P$5,0))&IF(TYPE(VLOOKUP($A69,FB_25,P$5,0))=16,\"\",VLOOKUP($A69,FB_25,P$5,0))&IF(TYPE(VLOOKUP($A69,FB_26,P$5,0))=16,\"\",VLOOKUP($A69,FB_26,P$5,0))&IF(TYPE(VLOOKUP($A69,FB_27,P$5,0))=16,\"\",VLOOKUP($A69,FB_27,P$5,0))&IF(TYPE(VLOOKUP($A69,FB_28,P$5,0))=16,\"\",VLOOKUP($A69,FB_28,P$5,0))&IF(TYPE(VLOOKUP($A69,FB_29,P$5,0))=16,\"\",VLOOKUP($A69,FB_29,P$5,0))&IF(TYPE(VLOOKUP($A69,FB_30,P$5,0))=16,\"\",VLOOKUP($A69,FB_30,P$5,0))))","v":""},"",{"$f":"IF($B69=\"\",\"\",_xlfn.NUMBERVALUE(IF(TYPE(VLOOKUP($A69,FB_1,R$5,0))=16,\"\",VLOOKUP($A69,FB_1,R$5,0))&IF(TYPE(VLOOKUP($A69,FB_2,R$5,0))=16,\"\",VLOOKUP($A69,FB_2,R$5,0))&IF(TYPE(VLOOKUP($A69,FB_3,R$5,0))=16,\"\",VLOOKUP($A69,FB_3,R$5,0))&IF(TYPE(VLOOKUP($A69,FB_4,R$5,0))=16,\"\",VLOOKUP($A69,FB_4,R$5,0))&IF(TYPE(VLOOKUP($A69,FB_5,R$5,0))=16,\"\",VLOOKUP($A69,FB_5,R$5,0))&IF(TYPE(VLOOKUP($A69,FB_6,R$5,0))=16,\"\",VLOOKUP($A69,FB_6,R$5,0))&IF(TYPE(VLOOKUP($A69,FB_7,R$5,0))=16,\"\",VLOOKUP($A69,FB_7,R$5,0))&IF(TYPE(VLOOKUP($A69,FB_8,R$5,0))=16,\"\",VLOOKUP($A69,FB_8,R$5,0))&IF(TYPE(VLOOKUP($A69,FB_9,R$5,0))=16,\"\",VLOOKUP($A69,FB_9,R$5,0))&IF(TYPE(VLOOKUP($A69,FB_10,R$5,0))=16,\"\",VLOOKUP($A69,FB_10,R$5,0))&IF(TYPE(VLOOKUP($A69,FB_11,R$5,0))=16,\"\",VLOOKUP($A69,FB_11,R$5,0))&IF(TYPE(VLOOKUP($A69,FB_12,R$5,0))=16,\"\",VLOOKUP($A69,FB_12,R$5,0))&IF(TYPE(VLOOKUP($A69,FB_13,R$5,0))=16,\"\",VLOOKUP($A69,FB_13,R$5,0))&IF(TYPE(VLOOKUP($A69,FB_14,R$5,0))=16,\"\",VLOOKUP($A69,FB_14,R$5,0))&IF(TYPE(VLOOKUP($A69,FB_15,R$5,0))=16,\"\",VLOOKUP($A69,FB_15,R$5,0))&IF(TYPE(VLOOKUP($A69,FB_16,R$5,0))=16,\"\",VLOOKUP($A69,FB_16,R$5,0))&IF(TYPE(VLOOKUP($A69,FB_17,R$5,0))=16,\"\",VLOOKUP($A69,FB_17,R$5,0))&IF(TYPE(VLOOKUP($A69,FB_18,R$5,0))=16,\"\",VLOOKUP($A69,FB_18,R$5,0))&IF(TYPE(VLOOKUP($A69,FB_19,R$5,0))=16,\"\",VLOOKUP($A69,FB_19,R$5,0))&IF(TYPE(VLOOKUP($A69,FB_20,R$5,0))=16,\"\",VLOOKUP($A69,FB_20,R$5,0))&IF(TYPE(VLOOKUP($A69,FB_21,R$5,0))=16,\"\",VLOOKUP($A69,FB_21,R$5,0))&IF(TYPE(VLOOKUP($A69,FB_22,R$5,0))=16,\"\",VLOOKUP($A69,FB_22,R$5,0))&IF(TYPE(VLOOKUP($A69,FB_23,R$5,0))=16,\"\",VLOOKUP($A69,FB_23,R$5,0))&IF(TYPE(VLOOKUP($A69,FB_24,R$5,0))=16,\"\",VLOOKUP($A69,FB_24,R$5,0))&IF(TYPE(VLOOKUP($A69,FB_25,R$5,0))=16,\"\",VLOOKUP($A69,FB_25,R$5,0))&IF(TYPE(VLOOKUP($A69,FB_26,R$5,0))=16,\"\",VLOOKUP($A69,FB_26,R$5,0))&IF(TYPE(VLOOKUP($A69,FB_27,R$5,0))=16,\"\",VLOOKUP($A69,FB_27,R$5,0))&IF(TYPE(VLOOKUP($A69,FB_28,R$5,0))=16,\"\",VLOOKUP($A69,FB_28,R$5,0))&IF(TYPE(VLOOKUP($A69,FB_29,R$5,0))=16,\"\",VLOOKUP($A69,FB_29,R$5,0))&IF(TYPE(VLOOKUP($A69,FB_30,R$5,0))=16,\"\",VLOOKUP($A69,FB_30,R$5,0))))","v":""},{"$f":"IF($B69=\"\",\"\",IF(TYPE(VLOOKUP($A69,FB_1,S$5,0))=16,\"\",VLOOKUP($A69,FB_1,S$5,0))&IF(TYPE(VLOOKUP($A69,FB_2,S$5,0))=16,\"\",VLOOKUP($A69,FB_2,S$5,0))&IF(TYPE(VLOOKUP($A69,FB_3,S$5,0))=16,\"\",VLOOKUP($A69,FB_3,S$5,0))&IF(TYPE(VLOOKUP($A69,FB_4,S$5,0))=16,\"\",VLOOKUP($A69,FB_4,S$5,0))&IF(TYPE(VLOOKUP($A69,FB_5,S$5,0))=16,\"\",VLOOKUP($A69,FB_5,S$5,0))&IF(TYPE(VLOOKUP($A69,FB_6,S$5,0))=16,\"\",VLOOKUP($A69,FB_6,S$5,0))&IF(TYPE(VLOOKUP($A69,FB_7,S$5,0))=16,\"\",VLOOKUP($A69,FB_7,S$5,0))&IF(TYPE(VLOOKUP($A69,FB_8,S$5,0))=16,\"\",VLOOKUP($A69,FB_8,S$5,0))&IF(TYPE(VLOOKUP($A69,FB_9,S$5,0))=16,\"\",VLOOKUP($A69,FB_9,S$5,0))&IF(TYPE(VLOOKUP($A69,FB_10,S$5,0))=16,\"\",VLOOKUP($A69,FB_10,S$5,0))&IF(TYPE(VLOOKUP($A69,FB_11,S$5,0))=16,\"\",VLOOKUP($A69,FB_11,S$5,0))&IF(TYPE(VLOOKUP($A69,FB_12,S$5,0))=16,\"\",VLOOKUP($A69,FB_12,S$5,0))&IF(TYPE(VLOOKUP($A69,FB_13,S$5,0))=16,\"\",VLOOKUP($A69,FB_13,S$5,0))&IF(TYPE(VLOOKUP($A69,FB_14,S$5,0))=16,\"\",VLOOKUP($A69,FB_14,S$5,0))&IF(TYPE(VLOOKUP($A69,FB_15,S$5,0))=16,\"\",VLOOKUP($A69,FB_15,S$5,0))&IF(TYPE(VLOOKUP($A69,FB_16,S$5,0))=16,\"\",VLOOKUP($A69,FB_16,S$5,0))&IF(TYPE(VLOOKUP($A69,FB_17,S$5,0))=16,\"\",VLOOKUP($A69,FB_17,S$5,0))&IF(TYPE(VLOOKUP($A69,FB_18,S$5,0))=16,\"\",VLOOKUP($A69,FB_18,S$5,0))&IF(TYPE(VLOOKUP($A69,FB_19,S$5,0))=16,\"\",VLOOKUP($A69,FB_19,S$5,0))&IF(TYPE(VLOOKUP($A69,FB_20,S$5,0))=16,\"\",VLOOKUP($A69,FB_20,S$5,0))&IF(TYPE(VLOOKUP($A69,FB_21,S$5,0))=16,\"\",VLOOKUP($A69,FB_21,S$5,0))&IF(TYPE(VLOOKUP($A69,FB_22,S$5,0))=16,\"\",VLOOKUP($A69,FB_22,S$5,0))&IF(TYPE(VLOOKUP($A69,FB_23,S$5,0))=16,\"\",VLOOKUP($A69,FB_23,S$5,0))&IF(TYPE(VLOOKUP($A69,FB_24,S$5,0))=16,\"\",VLOOKUP($A69,FB_24,S$5,0))&IF(TYPE(VLOOKUP($A69,FB_25,S$5,0))=16,\"\",VLOOKUP($A69,FB_25,S$5,0))&IF(TYPE(VLOOKUP($A69,FB_26,S$5,0))=16,\"\",VLOOKUP($A69,FB_26,S$5,0))&IF(TYPE(VLOOKUP($A69,FB_27,S$5,0))=16,\"\",VLOOKUP($A69,FB_27,S$5,0))&IF(TYPE(VLOOKUP($A69,FB_28,S$5,0))=16,\"\",VLOOKUP($A69,FB_28,S$5,0))&IF(TYPE(VLOOKUP($A69,FB_29,S$5,0))=16,\"\",VLOOKUP($A69,FB_29,S$5,0))&IF(TYPE(VLOOKUP($A69,FB_30,S$5,0))=16,\"\",VLOOKUP($A69,FB_30,S$5,0)))","v":""},null,null,null,null,null,null,null,null,null,null,null,null,null,null,null,null,{"$f":"IF(G69=\"\",\"\",G69)","v":""},":","","",""]
["Summe Gesamtpunkte",null,null,{"$f":"SUM(D30:D69)","v":0},{"$f":"IF(A70=\"\",\"\",\"/\")","v":"/"},{"$f":"SUM(F30:F69)","v":22},null,null,null,null,null,null,null,null,null,null,null,null,null,null,null,null,null,"Summe",":",{"$f":"SUM(Z30:Z69)","v":0},"/",{"$f":"SUM(AB30:AB69)","v":22}]
[]
["ACHTUNG:"]
[{"$f":"\"Da die Bearbeitung dieser Fragenliste im Rahmen eines Arbeitsauftrages durchgeführt wurde, werde ich \"&TEXT(P4,\"0%\")&\" der von dir erreichten Punkte (also \"&ROUND(D70*P4,1)&E70&ROUND(F70*P4,1)&\") als Ergebnis in die Notenliste eintragen.\"","v":"Da die Bearbeitung dieser Fragenliste im Rahmen eines Arbeitsauftrages durchgeführt wurde, werde ich 10% der von dir erreichten Punkte (also 0/2,2) als Ergebnis in die Notenliste eintragen."}]
[]
[]
["Unterschrift der/des Erziehungsberechtigten"]