{"text_format":"1","workbook":"xlsx","n_sheets":4,"sheets":["Dateneingabe","Berechnung","Hilfe","Korrektur"],"not_rendered":{"charts":0,"images":4,"macros":1,"external_links":0,"defined_names":26,"comments":0,"pivot_tables":0},"unopened":[],"bounds":{"document_bytes":16777216,"sheet_cells":100000,"rows_first":2000,"rows_last":500,"rows_between":2000,"halvings":0,"cell_chars":16384,"cell_head_chars":4096},"cells_cut":0,"cells_raw":0,"read":"whole","date_system":"1900"}

{"sheet":"Dateneingabe","index":0,"n_rows":10,"n_cols":11,"rows_kept":10,"cut":false,"hidden":false,"merged":[]}
["Dateneingabe"]
[]
[]
[null,"1.",{"$f":"Berechnung!Z28","v":"Von Netto nach Brutto!!!"}]
[null,null,"→",{"$f":"Berechnung!AB30&\"betrag\"","v":"Nettobetrag"},2000,null,"exkl.",null,0.2,"Ust."]
[]
[null,"2.",{"$f":"Berechnung!Z69","v":"Von Brutto nach Netto!!!"}]
[null,null,"→",{"$f":"Berechnung!AB71&\"betrag\"","v":"Bruttobetrag"},220,null,"inkl.",null,0.1,"Ust."]
[]
["© Mag. Wolfgang Harasleben",null,null,null,null,null,null,null,null,null,"Version: 2024.01.19.002"]

{"sheet":"Berechnung","index":1,"n_rows":119,"n_cols":60,"rows_kept":119,"cut":false,"hidden":false,"merged":[[70,8,70,9],[74,8,74,9],[81,8,81,9],[8,16,8,17],[8,13,8,14],[38,16,38,17],[29,8,29,9],[33,8,33,9],[81,16,81,17],[72,8,72,9],[18,8,18,9],[50,16,50,17],[57,16,57,17],[59,8,59,9],[59,16,59,17],[20,11,23,11],[83,14,83,15],[83,16,83,17],[83,11,86,11],[61,11,64,11],[64,14,64,16],[86,14,86,16],[79,16,79,17],[61,14,61,15],[61,16,61,17],[79,13,79,14],[81,13,81,14],[20,14,20,15],[40,8,40,9],[57,13,57,14],[59,13,59,14],[38,13,38,14],[40,13,40,14],[42,14,42,15],[31,8,31,9],[50,13,50,14],[45,14,45,16],[23,14,23,16],[42,11,45,11],[69,3,77,3],[5,2,5,17],[15,3,27,3],[56,3,68,3],[28,3,36,3],[16,13,16,14],[16,16,16,17],[18,16,18,17],[18,13,18,14],[42,16,42,17],[40,16,40,17],[9,13,9,14],[7,16,7,17],[7,13,7,14],[9,16,9,17],[20,16,20,17]]}
[null,null,"ACHTUNG: Wähle die richtigen Antworten aus oder Kreuze sie an !!!",null,null,null,null,null,null,null,null,null,null,null,null,null,null,null,null,null,null,null,{"$f":"Dateneingabe!K10","v":"Version: 2024.01.19.002"},{"$f":"L_KNR","v":1}]
[null,null,"ÜMOD - Netto, Umsatzsteuer und brutto berechnen"]
[null,null,null,null,null,null,null,null,null,null,null,null,null,null,null,null,null,null,null,null,null,null,null,null,null,null,null,null,null,null,null,null,null,null,null,null,null,null,null,null,null,null,null,null,null,null,"Spaltenindices:"]
[null,null,"Grundkompetenzen (GK4)",null,null,null,null,null,null,null,null,null,null,null,null,null,null,null,"! ! ! ! !",null,"Pkte","/","Ges.",null,null,null,null,null,null,null,null,null,null,null,null,null,null,null,null,null,null,null,null,null,null,null,{"$f":"COLUMNS($C$5:AU5)","v":45},null,{"$f":"COLUMNS($C$5:AW5)","v":47},{"$f":"SPI_gPKTE+1","v":48}]
[]
[null,null,"Trage den angegebenen Betrag in die Brutto- bzw. Nettospalte ein. Berechne anschließend die fehlenden Beträge und trage diese ebenfalls in die Tabelle ein.\nTipp: Achte bei den Angaben auf die Formulierung „inklusive“ bzw. „exklusive“!",null,null,null,null,null,null,null,null,null,null,null,null,null,null,null,null,null,null,null,null,null,null,null,null,null,null,null,null,null,null,null,null,null,null,null,null,null,null,null,null,null,null,null,null,null,null,null,null,"Deine Antworten",null,null,null,null,"Richtige Antworten"]
[null,null,null,null,null,null,null,null,null,null,null,null,null,null,null,null,null,null,null,null,null,null,null,null,null,null,null,null,null,null,null,null,null,null,null,null,null,null,null,null,null,null,null,null,null,null,null,null,null,null,null,null,null,null,null,null,1,2,3,4]
[null,null,null,null,null,null,null,null,null,null,null,"Netto",null,"Umsatzsteuer",null,null,"Brutto",null,null,null,null,null,null,null,null,null,null,null,null,null,null,null,null,null,null,null,null,null,null,null,null,null,null,null,null,null,null,null,null,null,null,null,null,null,null,null,1,2,3,4]
[]
[null,null,"1.",{"$f":"Z28","v":"Von Netto nach Brutto!!!"},{"$f":"IF(Dateneingabe!E5=\"\",\"\",Dateneingabe!E5)","v":2000},null,{"$f":"IF(Dateneingabe!G5=\"\",\"\",Dateneingabe!G5)","v":"exkl."},null,{"$f":"IF(Dateneingabe!I5=\"\",\"\",Dateneingabe!I5)","v":0.2},"Ust.",null,null,null,null,null,null,null,null,null,null,{"$f":"IF(AND(L10=\"\",N10=\"\",Q10=\"\"),\"\",SUM(IF(COUNTIF(BE10:BE10,AZ10)>0,1/COUNTIF(AZ10:AZ10,AZ10),0),IF(COUNTIF(BF10:BF10,BA10)>0,1/COUNTIF(BA10:BA10,BA10),0),IF(COUNTIF(BG10:BG10,BB10)>0,1/COUNTIF(BB10:BB10,BB10),0),IF(COUNTIF(BH10:BH10,BC10)>0,1/COUNTIF(BC10:BC10,BC10),0)))","v":""},"/",{"$f":"COUNTA(BE10:BH10)","v":3},null,null,null,null,null,null,null,null,null,null,null,null,null,null,null,null,null,null,null,null,null,"F",{"$f":"COUNTA($AS$4:AS10)","v":1},{"$f":"SUM(U10:U48)","v":0},"/",{"$f":"SUM(W10:W48)","v":24},{"$f":"MID(GK,FIND(\"(\",GK,1)+1,(FIND(\")\",GK,1)-FIND(\"(\",GK,1)-1))","v":"GK4"},null,{"$f":"L10","v":0},{"$f":"N10","v":0},{"$f":"Q10","v":0},null,1,{"$f":"Hilfe!L10","v":2000},{"$f":"Hilfe!N10","v":400},{"$f":"Hilfe!Q10","v":2400}]
[]
[]
[null,null,null,null,{"$f":"TEXT(E10,\"# ##0,00\")&\" \"&G10&\" \"&TEXT(I10,\"0%\")&\" \"&J10","v":"2 000,00 exkl. 20% Ust."},null,null,null,null,"=",null,null,null,null,null,null,null,null,null,null,{"$f":"IF(L13=\"\",\"\",SUM(IF(COUNTIF(BE13:BE13,AZ13)>0,1/COUNTIF(AZ13:AZ13,AZ13),0),IF(COUNTIF(BF13:BF13,BA13)>0,1/COUNTIF(BA13:BA13,BA13),0),IF(COUNTIF(BG13:BG13,BB13)>0,1/COUNTIF(BB13:BB13,BB13),0),IF(COUNTIF(BH13:BH13,BC13)>0,1/COUNTIF(BC13:BC13,BC13),0)))","v":""},"/",{"$f":"COUNTA(BE13:BH13)","v":1},null,null,null,null,null,null,null,null,null,null,null,null,null,null,null,null,null,null,null,null,null,null,null,null,null,null,null,null,{"$f":"L13","v":0},null,null,null,4,{"$f":"Hilfe!L13","v":"Netto → 100%"}]
[]
[]
[null,null,null,"  Umsatzsteuer"]
[null,null,null,null,"●",null,null,null,{"$f":"IF(L13=\"\",\"-\",MID(L13,1,FIND(\" →\",L13,1)-1))","v":"-"},null,null,{"$f":"TEXT(E10,\"# ##0,00\")","v":"2 000,00"},null,"…................................",null,null,null,null,null,null,{"$f":"IF(AND(Q17=\"\"),\"\",SUM(IF(COUNTIF(BE17:BE17,AZ17)>0,1/COUNTIF(AZ17:AZ17,AZ17),0),IF(COUNTIF(BF17:BF17,BA17)>0,1/COUNTIF(BA17:BA17,BA17),0),IF(COUNTIF(BG17:BG17,BB17)>0,1/COUNTIF(BB17:BB17,BB17),0),IF(COUNTIF(BH17:BH17,BC17)>0,1/COUNTIF(BC17:BC17,BC17),0)))","v":""},"/",{"$f":"COUNTA(BE17:BH17)","v":1},null,null,null,null,null,null,null,null,null,null,null,null,null,null,null,null,null,null,null,null,null,null,null,null,null,null,null,null,{"$f":"Q17","v":0},null,null,null,13,{"$f":"Hilfe!Q17","v":"100%"}]
[]
[null,null,null,null,null,null,null,null,null,null,null,"y      ",null,"…................................",null,null,null,null,null,null,{"$f":"IF(AND(I19=\"\",Q19=\"\"),\"\",SUM(IF(COUNTIF(BE19:BE19,AZ19)>0,1/COUNTIF(AZ19:AZ19,AZ19),0),IF(COUNTIF(BF19:BF19,BA19)>0,1/COUNTIF(BA19:BA19,BA19),0),IF(COUNTIF(BG19:BG19,BB19)>0,1/COUNTIF(BB19:BB19,BB19),0),IF(COUNTIF(BH19:BH19,BC19)>0,1/COUNTIF(BC19:BC19,BC19),0)))","v":""},"/",{"$f":"COUNTA(BE19:BH19)","v":2},null,null,null,null,null,null,null,null,null,null,null,null,null,null,null,null,null,null,null,null,null,null,null,null,null,null,null,null,{"$f":"I19","v":0},{"$f":"Q19","v":0},null,null,15,{"$f":"Hilfe!I19","v":"USt"},{"$f":"Hilfe!Q19","v":0.2}]
[]
[null,null,null,null,null,null,null,null,null,null,null,"y = ",null,null,"x",null,null,null,null,null,{"$f":"IF(AND(N21=\"\",Q21=\"\"),\"\",SUM(IF(COUNTIF(BE21:BE21,AZ21)>0,1/COUNTIF(AZ21:AZ21,AZ21),0),IF(COUNTIF(BF21:BF21,BA21)>0,1/COUNTIF(BA21:BA21,BA21),0),IF(COUNTIF(BG21:BG21,BB21)>0,1/COUNTIF(BB21:BB21,BB21),0),IF(COUNTIF(BH21:BH21,BC21)>0,1/COUNTIF(BC21:BC21,BC21),0)))","v":""},"/",{"$f":"COUNTA(BE21:BH21)","v":2},null,null,null,null,null,null,null,null,null,null,null,null,null,null,null,null,null,null,null,null,null,null,null,null,null,null,null,null,{"$f":"N21","v":0},{"$f":"Q21","v":0},null,null,17,{"$f":"Hilfe!N21","v":2000},{"$f":"Hilfe!Q21","v":0.2}]
[]
[]
[null,null,null,null,null,null,null,null,null,null,null,null,null,null,null,null,null,null,null,null,{"$f":"IF(O24=\"\",\"\",SUM(IF(COUNTIF(BE24:BE24,AZ24)>0,1/COUNTIF(AZ24:AZ24,AZ24),0),IF(COUNTIF(BF24:BF24,BA24)>0,1/COUNTIF(BA24:BA24,BA24),0),IF(COUNTIF(BG24:BG24,BB24)>0,1/COUNTIF(BB24:BB24,BB24),0),IF(COUNTIF(BH24:BH24,BC24)>0,1/COUNTIF(BC24:BC24,BC24),0)))","v":""},"/",{"$f":"COUNTA(BE24:BH24)","v":1},null,null,null,null,null,null,null,null,null,null,null,null,null,null,null,null,null,null,null,null,null,null,null,null,null,null,null,null,{"$f":"O24","v":0},null,null,null,19,{"$f":"Hilfe!O24","v":"100%"}]
[]
[null,null,null,null,null,null,null,null,null,null,null,"y = ",null,null,null,null,null,null,null,null,{"$f":"IF(N26=\"\",\"\",SUM(IF(COUNTIF(BE26:BE26,AZ26)>0,1/COUNTIF(AZ26:AZ26,AZ26),0),IF(COUNTIF(BF26:BF26,BA26)>0,1/COUNTIF(BA26:BA26,BA26),0),IF(COUNTIF(BG26:BG26,BB26)>0,1/COUNTIF(BB26:BB26,BB26),0),IF(COUNTIF(BH26:BH26,BC26)>0,1/COUNTIF(BC26:BC26,BC26),0)))","v":""},"/",{"$f":"COUNTA(BE26:BH26)","v":1},null,null,null,null,null,null,null,null,null,null,null,null,null,null,null,null,null,null,null,null,null,null,null,null,null,null,null,null,{"$f":"N26","v":0},null,null,null,20,{"$f":"Hilfe!N26","v":400}]
[]
[null,null,null,null,null,null,null,null,null,null,null,null,null,null,null,null,null,null,null,null,null,null,null,null,null,{"$f":"\"Von \"&AB30&\" nach \"&AB34&\"!!!\"","v":"Von Netto nach Brutto!!!"}]
[null,null,null,{"$f":"IF(G10=$E$101,\"  \"&$Q$8,IF(G10=$E$100,\"  \"&$L$8,\"  -------------------->\"))","v":"  Brutto"}]
[null,null,null,null,"●",null,null,null,null,null,null,null,null,null,null,null,null,null,null,null,{"$f":"IF(AND(L30=\"\"),\"\",SUM(IF(COUNTIF(BE30:BE30,AZ30)>0,1/COUNTIF(AZ30:AZ30,AZ30),0),IF(COUNTIF(BF30:BF30,BA30)>0,1/COUNTIF(BA30:BA30,BA30),0),IF(COUNTIF(BG30:BG30,BB30)>0,1/COUNTIF(BB30:BB30,BB30),0),IF(COUNTIF(BH30:BH30,BC30)>0,1/COUNTIF(BC30:BC30,BC30),0)))","v":""},"/",{"$f":"COUNTA(BE30:BH30)","v":1},null,null,null,null,{"$f":"IF(OR(E10=\"\",G10=\"\",I10=\"\"),\"-\",IF(G10=\"exkl.\",\"Netto\",\"Brutto\"))","v":"Netto"},null,null,{"$f":"IF(OR(E10=\"\",G10=\"\",I10=\"\"),\"-\",E10)","v":2000},null,{"$f":"IF(OR(E10=\"\",G10=\"\",I10=\"\"),\"-\",IF(I39=\"Brutto\",TEXT(1+I10,\"0%\"),TEXT(1,\"0%\")))","v":"100%"},null,null,null,null,null,null,null,null,null,null,null,null,null,null,null,null,null,null,{"$f":"L30","v":0},null,null,null,21,{"$f":"Hilfe!L30","v":2000}]
[]
[null,null,null,null,null,null,null,null,null,null,null,null,null,null,null,null,null,null,null,null,{"$f":"IF(AND(G32=\"\",I32=\"\",L32=\"\"),\"\",SUM(IF(COUNTIF(BE32:BE32,AZ32)>0,1/COUNTIF(AZ32:AZ32,AZ32),0),IF(COUNTIF(BF32:BF32,BA32)>0,1/COUNTIF(BA32:BA32,BA32),0),IF(COUNTIF(BG32:BG32,BB32)>0,1/COUNTIF(BB32:BB32,BB32),0),IF(COUNTIF(BH32:BH32,BC32)>0,1/COUNTIF(BC32:BC32,BC32),0)))","v":""},"/",{"$f":"COUNTA(BE32:BH32)","v":3},null,null,{"$f":"IF(AB30=\"\",\"\",IF(AB30=\"Brutto\",\"-\",\"+\"))","v":"+"},null,{"$f":"IF(OR(E10=\"\",G10=\"\",I10=\"\"),\"-\",\"USt\")","v":"USt"},null,null,{"$f":"IF(OR(E10=\"\",G10=\"\",I10=\"\"),\"-\",N26)","v":0},null,{"$f":"IF(OR(E10=\"\",G10=\"\",I10=\"\"),\"-\",I10)","v":0.2},null,null,null,null,null,null,null,null,null,null,null,null,null,null,null,null,null,null,{"$f":"G32","v":0},{"$f":"I32","v":0},{"$f":"L32","v":0},null,23,{"$f":"Hilfe!G32","v":"+"},{"$f":"Hilfe!I32","v":"USt"},{"$f":"Hilfe!L32","v":400}]
[]
[null,null,null,null,null,null,"=",null,null,null,null,null,null,null,null,null,null,null,null,null,{"$f":"IF(AND(I34=\"\",L34=\"\"),\"\",SUM(IF(COUNTIF(BE34:BE34,AZ34)>0,1/COUNTIF(AZ34:AZ34,AZ34),0),IF(COUNTIF(BF34:BF34,BA34)>0,1/COUNTIF(BA34:BA34,BA34),0),IF(COUNTIF(BG34:BG34,BB34)>0,1/COUNTIF(BB34:BB34,BB34),0),IF(COUNTIF(BH34:BH34,BC34)>0,1/COUNTIF(BC34:BC34,BC34),0)))","v":""},"/",{"$f":"COUNTA(BE34:BH34)","v":2},null,null,"=",null,{"$f":"IF(OR(E10=\"\",G10=\"\",I10=\"\"),\"-\",IF(G10=\"inkl.\",\"Netto\",\"Brutto\"))","v":"Brutto"},null,null,{"$f":"IF(OR(E10=\"\",G10=\"\",I10=\"\"),\"-\",IF(Z32=\"-\",SUM(AE30,-AE32),SUM(AE30:AE32)))","v":2000},null,{"$f":"IF(OR(E10=\"\",G10=\"\",I10=\"\"),\"-\",IF(I39=\"Netto\",TEXT(1+I10,\"0%\"),TEXT(1,\"0%\")))","v":"100%"},null,null,null,null,null,null,null,null,null,null,null,null,null,null,null,null,null,null,{"$f":"I34","v":0},{"$f":"L34","v":0},null,null,25,{"$f":"Hilfe!I34","v":"Brutto"},{"$f":"Hilfe!L34","v":2400}]
[]
[]
[]
[]
[null,null,null,null,"●",null,null,null,{"$f":"IF(L13=\"\",\"-\",MID(L13,1,FIND(\" →\",L13,1)-1))","v":"-"},null,null,{"$f":"TEXT(E10,\"# ##0,00\")","v":"2 000,00"},null,"…................................",null,null,null,null,null,null,{"$f":"IF(AND(Q39=\"\"),\"\",SUM(IF(COUNTIF(BE39:BE39,AZ39)>0,1/COUNTIF(AZ39:AZ39,AZ39),0),IF(COUNTIF(BF39:BF39,BA39)>0,1/COUNTIF(BA39:BA39,BA39),0),IF(COUNTIF(BG39:BG39,BB39)>0,1/COUNTIF(BB39:BB39,BB39),0),IF(COUNTIF(BH39:BH39,BC39)>0,1/COUNTIF(BC39:BC39,BC39),0)))","v":""},"/",{"$f":"COUNTA(BE39:BH39)","v":1},null,null,null,null,null,null,null,null,null,null,null,null,null,null,null,null,null,null,null,null,null,null,null,null,null,null,null,null,{"$f":"Q39","v":0},null,null,null,5,{"$f":"Hilfe!Q39","v":"100%"}]
[]
[null,null,null,null,null,null,null,null,null,null,null,"x      ",null,"…................................",null,null,null,null,null,null,{"$f":"IF(AND(I41=\"\",Q41=\"\"),\"\",SUM(IF(COUNTIF(BE41:BE41,AZ41)>0,1/COUNTIF(AZ41:AZ41,AZ41),0),IF(COUNTIF(BF41:BF41,BA41)>0,1/COUNTIF(BA41:BA41,BA41),0),IF(COUNTIF(BG41:BG41,BB41)>0,1/COUNTIF(BB41:BB41,BB41),0),IF(COUNTIF(BH41:BH41,BC41)>0,1/COUNTIF(BC41:BC41,BC41),0)))","v":""},"/",{"$f":"COUNTA(BE41:BH41)","v":2},null,null,null,null,null,null,null,null,null,null,null,null,null,null,null,null,null,null,null,null,null,null,null,null,null,null,null,null,{"$f":"I41","v":0},{"$f":"Q41","v":0},null,null,7,{"$f":"Hilfe!I41","v":"Brutto"},{"$f":"Hilfe!Q41","v":"120%"}]
[]
[null,null,null,null,null,null,null,null,null,null,null,"x = ",null,null,"x",null,null,null,null,null,{"$f":"IF(AND(N43=\"\",Q43=\"\"),\"\",SUM(IF(COUNTIF(BE43:BE43,AZ43)>0,1/COUNTIF(AZ43:AZ43,AZ43),0),IF(COUNTIF(BF43:BF43,BA43)>0,1/COUNTIF(BA43:BA43,BA43),0),IF(COUNTIF(BG43:BG43,BB43)>0,1/COUNTIF(BB43:BB43,BB43),0),IF(COUNTIF(BH43:BH43,BC43)>0,1/COUNTIF(BC43:BC43,BC43),0)))","v":""},"/",{"$f":"COUNTA(BE43:BH43)","v":2},null,null,null,null,null,null,null,null,null,null,null,null,null,null,null,null,null,null,null,null,null,null,null,null,null,null,null,null,{"$f":"N43","v":0},{"$f":"Q43","v":0},null,null,9,{"$f":"Hilfe!N43","v":2000},{"$f":"Hilfe!Q43","v":"120%"}]
[]
[]
[null,null,null,null,null,null,null,null,null,null,null,null,null,null,null,null,null,null,null,null,{"$f":"IF(O46=\"\",\"\",SUM(IF(COUNTIF(BE46:BE46,AZ46)>0,1/COUNTIF(AZ46:AZ46,AZ46),0),IF(COUNTIF(BF46:BF46,BA46)>0,1/COUNTIF(BA46:BA46,BA46),0),IF(COUNTIF(BG46:BG46,BB46)>0,1/COUNTIF(BB46:BB46,BB46),0),IF(COUNTIF(BH46:BH46,BC46)>0,1/COUNTIF(BC46:BC46,BC46),0)))","v":""},"/",{"$f":"COUNTA(BE46:BH46)","v":1},null,null,null,null,null,null,null,null,null,null,null,null,null,null,null,null,null,null,null,null,null,null,null,null,null,null,null,null,{"$f":"O46","v":0},null,null,null,11,{"$f":"Hilfe!O46","v":"100%"}]
[]
[null,null,null,null,null,null,null,null,null,null,null,"x = ",null,null,null,null,null,null,null,null,{"$f":"IF(N48=\"\",\"\",SUM(IF(COUNTIF(BE48:BE48,AZ48)>0,1/COUNTIF(AZ48:AZ48,AZ48),0),IF(COUNTIF(BF48:BF48,BA48)>0,1/COUNTIF(BA48:BA48,BA48),0),IF(COUNTIF(BG48:BG48,BB48)>0,1/COUNTIF(BB48:BB48,BB48),0),IF(COUNTIF(BH48:BH48,BC48)>0,1/COUNTIF(BC48:BC48,BC48),0)))","v":""},"/",{"$f":"COUNTA(BE48:BH48)","v":1},null,null,null,null,null,null,null,null,null,null,null,null,null,null,null,null,null,null,null,null,null,null,null,null,null,null,null,null,{"$f":"N48","v":0},null,null,null,12,{"$f":"Hilfe!N48","v":2400}]
[null,null,null,{"$error":"#VALUE!"}]
[]
[null,null,"2.",{"$f":"Z69","v":"Von Brutto nach Netto!!!"},{"$f":"IF(Dateneingabe!E8=\"\",\"\",Dateneingabe!E8)","v":220},null,{"$f":"IF(Dateneingabe!G8=\"\",\"\",Dateneingabe!G8)","v":"inkl."},null,{"$f":"IF(Dateneingabe!I8=\"\",\"\",Dateneingabe!I8)","v":0.1},"Ust.",null,null,null,null,null,null,null,null,null,null,{"$f":"IF(AND(L51=\"\",N51=\"\",Q51=\"\"),\"\",SUM(IF(COUNTIF(BE51:BE51,AZ51)>0,1/COUNTIF(AZ51:AZ51,AZ51),0),IF(COUNTIF(BF51:BF51,BA51)>0,1/COUNTIF(BA51:BA51,BA51),0),IF(COUNTIF(BG51:BG51,BB51)>0,1/COUNTIF(BB51:BB51,BB51),0),IF(COUNTIF(BH51:BH51,BC51)>0,1/COUNTIF(BC51:BC51,BC51),0)))","v":""},"/",{"$f":"COUNTA(BE51:BH51)","v":3},null,null,null,null,null,null,null,null,null,null,null,null,null,null,null,null,null,null,null,null,null,"F",{"$f":"COUNTA($AS$4:AS51)","v":2},{"$f":"SUM(U51:U90)","v":0},"/",{"$f":"SUM(W51:W90)","v":24},{"$f":"MID(GK,FIND(\"(\",GK,1)+1,(FIND(\")\",GK,1)-FIND(\"(\",GK,1)-1))","v":"GK4"},null,{"$f":"L51","v":0},{"$f":"N51","v":0},{"$f":"Q51","v":0},null,1,{"$f":"Hilfe!L51","v":199.99999999999997},{"$f":"Hilfe!N51","v":20},{"$f":"Hilfe!Q51","v":219.99999999999997}]
[]
[]
[null,null,null,null,{"$f":"TEXT(E51,\"# ##0,00\")&\" \"&G51&\" \"&TEXT(I51,\"0%\")&\" \"&J51","v":"220,00 inkl. 10% Ust."},null,null,null,null,"=",null,null,null,null,null,null,null,null,null,null,{"$f":"IF(L54=\"\",\"\",SUM(IF(COUNTIF(BE54:BE54,AZ54)>0,1/COUNTIF(AZ54:AZ54,AZ54),0),IF(COUNTIF(BF54:BF54,BA54)>0,1/COUNTIF(BA54:BA54,BA54),0),IF(COUNTIF(BG54:BG54,BB54)>0,1/COUNTIF(BB54:BB54,BB54),0),IF(COUNTIF(BH54:BH54,BC54)>0,1/COUNTIF(BC54:BC54,BC54),0)))","v":""},"/",{"$f":"COUNTA(BE54:BH54)","v":1},null,null,null,null,null,null,null,null,null,null,null,null,null,null,null,null,null,null,null,null,null,null,null,null,null,null,null,null,{"$f":"L54","v":0},null,null,null,4,{"$f":"Hilfe!L54","v":"Brutto → 110%"}]
[]
[]
[null,null,null,"  Umsatzsteuer"]
[null,null,null,null,"●",null,null,null,{"$f":"IF(L54=\"\",\"-\",MID(L54,1,FIND(\" →\",L54,1)-1))","v":"-"},null,null,{"$f":"TEXT(E51,\"# ##0,00\")","v":"220,00"},null,"…................................",null,null,null,null,null,null,{"$f":"IF(AND(Q58=\"\"),\"\",SUM(IF(COUNTIF(BE58:BE58,AZ58)>0,1/COUNTIF(AZ58:AZ58,AZ58),0),IF(COUNTIF(BF58:BF58,BA58)>0,1/COUNTIF(BA58:BA58,BA58),0),IF(COUNTIF(BG58:BG58,BB58)>0,1/COUNTIF(BB58:BB58,BB58),0),IF(COUNTIF(BH58:BH58,BC58)>0,1/COUNTIF(BC58:BC58,BC58),0)))","v":""},"/",{"$f":"COUNTA(BE58:BH58)","v":1},null,null,null,null,null,null,null,null,null,null,null,null,null,null,null,null,null,null,null,null,null,null,null,null,null,null,null,null,{"$f":"Q58","v":0},null,null,null,13,{"$f":"Hilfe!Q58","v":"110%"}]
[]
[null,null,null,null,null,null,null,null,null,null,null,"y   ",null,"…................................",null,null,null,null,null,null,{"$f":"IF(AND(I60=\"\",Q60=\"\"),\"\",SUM(IF(COUNTIF(BE60:BE60,AZ60)>0,1/COUNTIF(AZ60:AZ60,AZ60),0),IF(COUNTIF(BF60:BF60,BA60)>0,1/COUNTIF(BA60:BA60,BA60),0),IF(COUNTIF(BG60:BG60,BB60)>0,1/COUNTIF(BB60:BB60,BB60),0),IF(COUNTIF(BH60:BH60,BC60)>0,1/COUNTIF(BC60:BC60,BC60),0)))","v":""},"/",{"$f":"COUNTA(BE60:BH60)","v":2},null,null,null,null,null,null,null,null,null,null,null,null,null,null,null,null,null,null,null,null,null,null,null,null,null,null,null,null,{"$f":"I60","v":0},{"$f":"Q60","v":0},null,null,15,{"$f":"Hilfe!I60","v":"USt"},{"$f":"Hilfe!Q60","v":0.1}]
[]
[null,null,null,null,null,null,null,null,null,null,null,"y = ",null,null,"x",null,null,null,null,null,{"$f":"IF(AND(N62=\"\",Q62=\"\"),\"\",SUM(IF(COUNTIF(BE62:BE62,AZ62)>0,1/COUNTIF(AZ62:AZ62,AZ62),0),IF(COUNTIF(BF62:BF62,BA62)>0,1/COUNTIF(BA62:BA62,BA62),0),IF(COUNTIF(BG62:BG62,BB62)>0,1/COUNTIF(BB62:BB62,BB62),0),IF(COUNTIF(BH62:BH62,BC62)>0,1/COUNTIF(BC62:BC62,BC62),0)))","v":""},"/",{"$f":"COUNTA(BE62:BH62)","v":2},null,null,null,null,null,null,null,null,null,null,null,null,null,null,null,null,null,null,null,null,null,null,null,null,null,null,null,null,{"$f":"N62","v":0},{"$f":"Q62","v":0},null,null,17,{"$f":"Hilfe!N62","v":220},{"$f":"Hilfe!Q62","v":0.1}]
[]
[]
[null,null,null,null,null,null,null,null,null,null,null,null,null,null,null,null,null,null,null,null,{"$f":"IF(O65=\"\",\"\",SUM(IF(COUNTIF(BE65:BE65,AZ65)>0,1/COUNTIF(AZ65:AZ65,AZ65),0),IF(COUNTIF(BF65:BF65,BA65)>0,1/COUNTIF(BA65:BA65,BA65),0),IF(COUNTIF(BG65:BG65,BB65)>0,1/COUNTIF(BB65:BB65,BB65),0),IF(COUNTIF(BH65:BH65,BC65)>0,1/COUNTIF(BC65:BC65,BC65),0)))","v":""},"/",{"$f":"COUNTA(BE65:BH65)","v":1},null,null,null,null,null,null,null,null,null,null,null,null,null,null,null,null,null,null,null,null,null,null,null,null,null,null,null,null,{"$f":"O65","v":0},null,null,null,19,{"$f":"Hilfe!O65","v":"110%"}]
[]
[null,null,null,null,null,null,null,null,null,null,null,"y = ",null,null,null,null,null,null,null,null,{"$f":"IF(N67=\"\",\"\",SUM(IF(COUNTIF(BE67:BE67,AZ67)>0,1/COUNTIF(AZ67:AZ67,AZ67),0),IF(COUNTIF(BF67:BF67,BA67)>0,1/COUNTIF(BA67:BA67,BA67),0),IF(COUNTIF(BG67:BG67,BB67)>0,1/COUNTIF(BB67:BB67,BB67),0),IF(COUNTIF(BH67:BH67,BC67)>0,1/COUNTIF(BC67:BC67,BC67),0)))","v":""},"/",{"$f":"COUNTA(BE67:BH67)","v":1},null,null,null,null,null,null,null,null,null,null,null,null,null,null,null,null,null,null,null,null,null,null,null,null,null,null,null,null,{"$f":"N67","v":0},null,null,null,20,{"$f":"Hilfe!N67","v":20}]
[]
[null,null,null,null,null,null,null,null,null,null,null,null,null,null,null,null,null,null,null,null,null,null,null,null,null,{"$f":"\"Von \"&AB71&\" nach \"&AB75&\"!!!\"","v":"Von Brutto nach Netto!!!"}]
[null,null,null,{"$f":"IF(G51=$E$101,\"  \"&$Q$8,IF(G51=$E$100,\"  \"&$L$8,\"  -------------------->\"))","v":"  Netto"}]
[null,null,null,null,"●",null,null,null,null,null,null,null,null,null,null,null,null,null,null,null,{"$f":"IF(AND(L71=\"\"),\"\",SUM(IF(COUNTIF(BE71:BE71,AZ71)>0,1/COUNTIF(AZ71:AZ71,AZ71),0),IF(COUNTIF(BF71:BF71,BA71)>0,1/COUNTIF(BA71:BA71,BA71),0),IF(COUNTIF(BG71:BG71,BB71)>0,1/COUNTIF(BB71:BB71,BB71),0),IF(COUNTIF(BH71:BH71,BC71)>0,1/COUNTIF(BC71:BC71,BC71),0)))","v":""},"/",{"$f":"COUNTA(BE71:BH71)","v":1},null,null,null,null,{"$f":"IF(OR(E51=\"\",G51=\"\",I51=\"\"),\"-\",IF(G51=\"exkl.\",\"Netto\",\"Brutto\"))","v":"Brutto"},null,null,{"$f":"IF(OR(E51=\"\",G51=\"\",I51=\"\"),\"-\",E51)","v":220},null,{"$f":"IF(OR(E51=\"\",G51=\"\",I51=\"\"),\"-\",IF(I80=\"Brutto\",TEXT(1+I51,\"0%\"),TEXT(1,\"0%\")))","v":"100%"},null,null,null,null,null,null,null,null,null,null,null,null,null,null,null,null,null,null,{"$f":"L71","v":0},null,null,null,21,{"$f":"Hilfe!L71","v":220}]
[]
[null,null,null,null,null,null,null,null,null,null,null,null,null,null,null,null,null,null,null,null,{"$f":"IF(AND(G73=\"\",I73=\"\",L73=\"\"),\"\",SUM(IF(COUNTIF(BE73:BE73,AZ73)>0,1/COUNTIF(AZ73:AZ73,AZ73),0),IF(COUNTIF(BF73:BF73,BA73)>0,1/COUNTIF(BA73:BA73,BA73),0),IF(COUNTIF(BG73:BG73,BB73)>0,1/COUNTIF(BB73:BB73,BB73),0),IF(COUNTIF(BH73:BH73,BC73)>0,1/COUNTIF(BC73:BC73,BC73),0)))","v":""},"/",{"$f":"COUNTA(BE73:BH73)","v":3},null,null,{"$f":"IF(AB71=\"\",\"\",IF(AB71=\"Brutto\",\"-\",\"+\"))","v":"-"},null,{"$f":"IF(OR(E51=\"\",G51=\"\",I51=\"\"),\"-\",\"USt\")","v":"USt"},null,null,{"$f":"IF(OR(E51=\"\",G51=\"\",I51=\"\"),\"-\",N67)","v":0},null,{"$f":"IF(OR(E51=\"\",G51=\"\",I51=\"\"),\"-\",I51)","v":0.1},null,null,null,null,null,null,null,null,null,null,null,null,null,null,null,null,null,null,{"$f":"G73","v":0},{"$f":"I73","v":0},{"$f":"L73","v":0},null,23,{"$f":"Hilfe!G73","v":"-"},{"$f":"Hilfe!I73","v":"USt"},{"$f":"Hilfe!L73","v":20}]
[]
[null,null,null,null,null,null,"=",null,null,null,null,null,null,null,null,null,null,null,null,null,{"$f":"IF(AND(I75=\"\",L75=\"\"),\"\",SUM(IF(COUNTIF(BE75:BE75,AZ75)>0,1/COUNTIF(AZ75:AZ75,AZ75),0),IF(COUNTIF(BF75:BF75,BA75)>0,1/COUNTIF(BA75:BA75,BA75),0),IF(COUNTIF(BG75:BG75,BB75)>0,1/COUNTIF(BB75:BB75,BB75),0),IF(COUNTIF(BH75:BH75,BC75)>0,1/COUNTIF(BC75:BC75,BC75),0)))","v":""},"/",{"$f":"COUNTA(BE75:BH75)","v":2},null,null,"=",null,{"$f":"IF(OR(E51=\"\",G51=\"\",I51=\"\"),\"-\",IF(G51=\"inkl.\",\"Netto\",\"Brutto\"))","v":"Netto"},null,null,{"$f":"IF(OR(E51=\"\",G51=\"\",I51=\"\"),\"-\",IF(Z73=\"-\",SUM(AE71,-AE73),SUM(AE71:AE73)))","v":220},null,{"$f":"IF(OR(E51=\"\",G51=\"\",I51=\"\"),\"-\",IF(I80=\"Netto\",TEXT(1+I51,\"0%\"),TEXT(1,\"0%\")))","v":"100%"},null,null,null,null,null,null,null,null,null,null,null,null,null,null,null,null,null,null,{"$f":"I75","v":0},{"$f":"L75","v":0},null,null,25,{"$f":"Hilfe!I75","v":"Netto"},{"$f":"Hilfe!L75","v":200}]
[]
[]
[]
[]
[null,null,null,null,"●",null,null,null,{"$f":"IF(L54=\"\",\"-\",MID(L54,1,FIND(\" →\",L54,1)-1))","v":"-"},null,null,{"$f":"TEXT(E51,\"# ##0,00\")","v":"220,00"},null,"…................................",null,null,null,null,null,null,{"$f":"IF(AND(Q80=\"\"),\"\",SUM(IF(COUNTIF(BE80:BE80,AZ80)>0,1/COUNTIF(AZ80:AZ80,AZ80),0),IF(COUNTIF(BF80:BF80,BA80)>0,1/COUNTIF(BA80:BA80,BA80),0),IF(COUNTIF(BG80:BG80,BB80)>0,1/COUNTIF(BB80:BB80,BB80),0),IF(COUNTIF(BH80:BH80,BC80)>0,1/COUNTIF(BC80:BC80,BC80),0)))","v":""},"/",{"$f":"COUNTA(BE80:BH80)","v":1},null,null,null,null,null,null,null,null,null,null,null,null,null,null,null,null,null,null,null,null,null,null,null,null,null,null,null,null,{"$f":"Q80","v":0},null,null,null,5,{"$f":"Hilfe!Q80","v":"110%"}]
[]
[null,null,null,null,null,null,null,null,null,null,null,"x      ",null,"…................................",null,null,null,null,null,null,{"$f":"IF(AND(I82=\"\",Q82=\"\"),\"\",SUM(IF(COUNTIF(BE82:BE82,AZ82)>0,1/COUNTIF(AZ82:AZ82,AZ82),0),IF(COUNTIF(BF82:BF82,BA82)>0,1/COUNTIF(BA82:BA82,BA82),0),IF(COUNTIF(BG82:BG82,BB82)>0,1/COUNTIF(BB82:BB82,BB82),0),IF(COUNTIF(BH82:BH82,BC82)>0,1/COUNTIF(BC82:BC82,BC82),0)))","v":""},"/",{"$f":"COUNTA(BE82:BH82)","v":2},null,null,null,null,null,null,null,null,null,null,null,null,null,null,null,null,null,null,null,null,null,null,null,null,null,null,null,null,{"$f":"I82","v":0},{"$f":"Q82","v":0},null,null,7,{"$f":"Hilfe!I82","v":"Netto"},{"$f":"Hilfe!Q82","v":"100%"}]
[]
[null,null,null,null,null,null,null,null,null,null,null,"x = ",null,null,"x",null,null,null,null,null,{"$f":"IF(AND(N84=\"\",Q84=\"\"),\"\",SUM(IF(COUNTIF(BE84:BE84,AZ84)>0,1/COUNTIF(AZ84:AZ84,AZ84),0),IF(COUNTIF(BF84:BF84,BA84)>0,1/COUNTIF(BA84:BA84,BA84),0),IF(COUNTIF(BG84:BG84,BB84)>0,1/COUNTIF(BB84:BB84,BB84),0),IF(COUNTIF(BH84:BH84,BC84)>0,1/COUNTIF(BC84:BC84,BC84),0)))","v":""},"/",{"$f":"COUNTA(BE84:BH84)","v":2},null,null,null,null,null,null,null,null,null,null,null,null,null,null,null,null,null,null,null,null,null,null,null,null,null,null,null,null,{"$f":"N84","v":0},{"$f":"Q84","v":0},null,null,9,{"$f":"Hilfe!N84","v":220},{"$f":"Hilfe!Q84","v":"100%"}]
[]
[]
[null,null,null,null,null,null,null,null,null,null,null,null,null,null,null,null,null,null,null,null,{"$f":"IF(O87=\"\",\"\",SUM(IF(COUNTIF(BE87:BE87,AZ87)>0,1/COUNTIF(AZ87:AZ87,AZ87),0),IF(COUNTIF(BF87:BF87,BA87)>0,1/COUNTIF(BA87:BA87,BA87),0),IF(COUNTIF(BG87:BG87,BB87)>0,1/COUNTIF(BB87:BB87,BB87),0),IF(COUNTIF(BH87:BH87,BC87)>0,1/COUNTIF(BC87:BC87,BC87),0)))","v":""},"/",{"$f":"COUNTA(BE87:BH87)","v":1},null,null,null,null,null,null,null,null,null,null,null,null,null,null,null,null,null,null,null,null,null,null,null,null,null,null,null,null,{"$f":"O87","v":0},null,null,null,11,{"$f":"Hilfe!O87","v":"110%"}]
[]
[null,null,null,null,null,null,null,null,null,null,null,"x = ",null,null,null,null,null,null,null,null,{"$f":"IF(N89=\"\",\"\",SUM(IF(COUNTIF(BE89:BE89,AZ89)>0,1/COUNTIF(AZ89:AZ89,AZ89),0),IF(COUNTIF(BF89:BF89,BA89)>0,1/COUNTIF(BA89:BA89,BA89),0),IF(COUNTIF(BG89:BG89,BB89)>0,1/COUNTIF(BB89:BB89,BB89),0),IF(COUNTIF(BH89:BH89,BC89)>0,1/COUNTIF(BC89:BC89,BC89),0)))","v":""},"/",{"$f":"COUNTA(BE89:BH89)","v":1},null,null,null,null,null,null,null,null,null,null,null,null,null,null,null,null,null,null,null,null,null,null,null,null,null,null,null,null,{"$f":"N89","v":0},null,null,null,12,{"$f":"Hilfe!N89","v":199.99999999999997}]
[null,null,null,{"$error":"#VALUE!"}]
[]
[null,null,null,null,null,null,null,null,null,null,null,null,null,null,null,null,null,null,null,"Gesamtpunkte: ",{"$f":"SUM(U5:U91)","v":0},"/",{"$f":"SUM(W5:W91)","v":48}]
[]
[null,null,{"$f":"S_NAME","v":"NACHNAME Vorname"},null,null,null,null,null,null,null,null,null,null,null,null,null,null,null,null,{"$f":"MID(GK,FIND(\"(\",GK,1)+1,(FIND(\")\",GK,1)-FIND(\"(\",GK,1)-1))&\":\"","v":"GK4:"},{"$f":"SUM(U92)","v":0},"/",{"$f":"SUM(W92)","v":48}]
[null,null,{"$f":"\"KNr.: \"&TEXT(KNR,\"00\")","v":"KNr.: 01"}]
[]
[]
[]
[null,null,null,null,"inkl_exkl",null,null,null,"USt_Proz",null,null,"Netto_Brutto",null,"Ne_Bru_Ust",null,null,"Operatoren"]
[null,null,null,null,"inkl.",null,null,null,0.2,null,null,"Brutto → 120%",null,"Brutto",null,null,"+"]
[null,null,null,null,"exkl.",null,null,null,0.1,null,null,"Brutto → 113%",null,"Netto",null,null,"-"]
[null,null,null,null,null,null,null,null,0.13,null,null,"Brutto → 110%",null,"USt",null,null,"x"]
[null,null,null,null,null,null,null,null,null,null,null,"Netto → 100%",null,null,null,null,":"]
[]
[]
[]
[]
[]
[]
[]
[]
[]
[]
[]
[]
[]
[null,null,null,null,"NACHNAME Vorname"]
[null,null,null,null,1]
[null,null,null,null,"BSP2 - Netto Umsatzsteuer brutto berechnen "]

{"sheet":"Hilfe","index":2,"n_rows":90,"n_cols":28,"rows_kept":90,"cut":false,"hidden":false,"merged":[[31,8,31,9],[50,13,50,14],[50,16,50,17],[16,16,16,17],[18,8,18,9],[18,16,18,17],[20,11,23,11],[20,14,20,15],[9,13,9,14],[9,16,9,17],[59,13,59,14],[7,13,7,14],[7,16,7,17],[8,13,8,14],[8,16,8,17],[45,14,45,16],[79,16,79,17],[79,13,79,14],[81,13,81,14],[81,16,81,17],[83,11,86,11],[83,14,83,15],[83,16,83,17],[86,14,86,16],[72,8,72,9],[57,16,57,17],[59,8,59,9],[59,16,59,17],[61,11,64,11],[61,14,61,15],[61,16,61,17],[64,14,64,16],[57,13,57,14],[69,3,77,3],[5,2,5,17],[15,3,27,3],[56,3,68,3],[28,3,36,3],[20,16,20,17],[23,14,23,16],[42,11,45,11],[42,14,42,15],[16,13,16,14],[18,13,18,14],[38,16,38,17],[40,16,40,17],[38,13,38,14],[40,13,40,14],[42,16,42,17]]}
[null,null,"ACHTUNG: Wähle die richtigen Antworten aus oder Kreuze sie an !!!",null,null,null,null,null,null,null,null,null,null,null,null,null,null,null,{"$f":"Berechnung!W1","v":"Version: 2024.01.19.002"}]
[null,null,{"$f":"Berechnung!C2","v":"ÜMOD - Netto, Umsatzsteuer und brutto berechnen"}]
[]
[null,null,"Grundkompetenzen (GK4)",null,null,null,null,null,null,null,null,null,null,null,null,null,null,null,"! ! ! ! !"]
[]
[null,null,"Trage den angegebenen Betrag in die Brutto- bzw. Nettospalte ein. Berechne anschließend die fehlenden Beträge und trage diese ebenfalls in die Tabelle ein.\nTipp: Achte bei den Angaben auf die Formulierung „inklusive“ bzw. „exklusive“!"]
[]
[null,null,null,null,null,null,null,null,null,null,null,"Netto",null,"Umsatzsteuer",null,null,"Brutto"]
[]
[null,null,"1.",null,{"$f":"IF(Berechnung!E10=\"\",\"\",Berechnung!E10)","v":2000},null,{"$f":"IF(Berechnung!G10=\"\",\"\",Berechnung!G10)","v":"exkl."},null,{"$f":"IF(Berechnung!I10=\"\",\"\",Berechnung!I10)","v":0.2},"Ust.",null,{"$f":"IF(G10=Berechnung!$E$100,E10/(1+I10),E10)","v":2000},null,{"$f":"L10*I10","v":400},null,null,{"$f":"SUM(L10:N10)","v":2400}]
[]
[]
[null,null,null,null,{"$f":"IF(OR(E10=\"\",G10=\"\",I10=\"\"),\"-\",TEXT(E10,\"# ##0,00\")&\" \"&G10&\" \"&TEXT(I10,\"0%\")&\" \"&J10)","v":"2 000,00 exkl. 20% Ust."},null,null,null,null,"=",null,{"$f":"IF(OR(E10=\"\",G10=\"\",I10=\"\"),\"-\",IF(G10=\"exkl.\",\"Netto → 100%\",\"Brutto → \"&TEXT(1+I10,\"0%\")))","v":"Netto → 100%"}]
[]
[]
[null,null,null,"  Umsatzsteuer"]
[null,null,null,null,"●",null,null,null,{"$f":"IF(OR(E10=\"\",G10=\"\",I10=\"\"),\"-\",MID(L13,1,FIND(\" →\",L13,1)-1))","v":"Netto"},null,null,{"$f":"IF(OR(E10=\"\",G10=\"\",I10=\"\"),\"-\",TEXT(E10,\"# ##0,00\"))","v":"2 000,00"},null,"…................................",null,null,{"$f":"IF(OR(E10=\"\",G10=\"\",I10=\"\"),\"-\",IF(I39=\"Brutto\",TEXT(1+I10,\"0%\"),TEXT(1,\"0%\")))","v":"100%"}]
[]
[null,null,null,null,null,null,null,null,{"$f":"IF(OR(E10=\"\",G10=\"\",I10=\"\"),\"-\",\"USt\")","v":"USt"},null,null,"y      ",null,"…................................",null,null,{"$f":"IF(OR(E10=\"\",G10=\"\",I10=\"\"),\"-\",I10)","v":0.2}]
[]
[null,null,null,null,null,null,null,null,null,null,null,"y = ",null,{"$f":"IF(OR(E10=\"\",G10=\"\",I10=\"\"),\"-\",N43)","v":2000},"x",null,{"$f":"IF(OR(E10=\"\",G10=\"\",I10=\"\"),\"-\",Q19)","v":0.2}]
[]
[]
[null,null,null,null,null,null,null,null,null,null,null,null,null,null,{"$f":"IF(OR(E10=\"\",G10=\"\",I10=\"\"),\"-\",Q17)","v":"100%"}]
[]
[null,null,null,null,null,null,null,null,null,null,null,"y = ",null,{"$f":"IF(OR(E10=\"\",G10=\"\",I10=\"\"),\"-\",N21*Q21/O24)","v":400}]
[]
[null,null,null,null,null,null,null,null,null,null,null,null,null,null,null,null,null,null,null,null,{"$f":"\"Von \"&W30&\" nach \"&W34&\"!!!\"","v":"Von Netto nach Brutto!!!"}]
[null,null,null,{"$f":"IF(G10=Berechnung!$E$101,\"  \"&$Q$8,IF(G10=Berechnung!$E$100,\"  \"&$L$8,\"  -------------------->\"))","v":"  Brutto"}]
[null,null,null,null,"●",null,null,null,{"$f":"IF(OR(E10=\"\",G10=\"\",I10=\"\"),\"-\",IF(G10=\"exkl.\",\"Netto\",\"Brutto\"))","v":"Netto"},null,null,{"$f":"IF(OR(E10=\"\",G10=\"\",I10=\"\"),\"-\",E10)","v":2000},null,null,null,null,null,null,null,null,null,null,{"$f":"IF(OR(Hilfe!E10=\"\",Hilfe!G10=\"\",Hilfe!I10=\"\"),\"-\",IF(Hilfe!G10=\"exkl.\",\"Netto\",\"Brutto\"))","v":"Netto"},null,null,{"$f":"IF(OR(Hilfe!E10=\"\",Hilfe!G10=\"\",Hilfe!I10=\"\"),\"-\",Hilfe!E10)","v":2000},null,{"$f":"IF(OR(Hilfe!E10=\"\",Hilfe!G10=\"\",Hilfe!I10=\"\"),\"-\",IF(Hilfe!I39=\"Brutto\",TEXT(1+Hilfe!I10,\"0%\"),TEXT(1,\"0%\")))","v":"100%"}]
[]
[null,null,null,null,null,null,{"$f":"IF(I30=\"\",\"\",IF(I30=\"Brutto\",\"-\",\"+\"))","v":"+"},null,{"$f":"IF(OR(E10=\"\",G10=\"\",I10=\"\"),\"-\",\"USt\")","v":"USt"},null,null,{"$f":"IF(OR(E10=\"\",G10=\"\",I10=\"\"),\"-\",N26)","v":400},null,null,null,null,null,null,null,null,{"$f":"IF(W30=\"\",\"\",IF(W30=\"Brutto\",\"-\",\"+\"))","v":"+"},null,{"$f":"IF(OR(Hilfe!E10=\"\",Hilfe!G10=\"\",Hilfe!I10=\"\"),\"-\",\"USt\")","v":"USt"},null,null,{"$f":"IF(OR(Hilfe!E10=\"\",Hilfe!G10=\"\",Hilfe!I10=\"\"),\"-\",Hilfe!N26)","v":400},null,{"$f":"IF(OR(Hilfe!E10=\"\",Hilfe!G10=\"\",Hilfe!I10=\"\"),\"-\",Hilfe!I10)","v":0.2}]
[]
[null,null,null,null,null,null,"=",null,{"$f":"IF(OR(E10=\"\",G10=\"\",I10=\"\"),\"-\",IF(G10=\"inkl.\",\"Netto\",\"Brutto\"))","v":"Brutto"},null,null,{"$f":"IF(OR(E10=\"\",G10=\"\",I10=\"\"),\"-\",IF(G32=\"-\",SUM(L30,-L32),SUM(L30:L32)))","v":2400},null,null,null,null,null,null,null,null,"=",null,{"$f":"IF(OR(Hilfe!E10=\"\",Hilfe!G10=\"\",Hilfe!I10=\"\"),\"-\",IF(Hilfe!G10=\"inkl.\",\"Netto\",\"Brutto\"))","v":"Brutto"},null,null,{"$f":"IF(OR(Hilfe!E10=\"\",Hilfe!G10=\"\",Hilfe!I10=\"\"),\"-\",IF(U32=\"-\",SUM(Z30,-Z32),SUM(Z30:Z32)))","v":2400},null,{"$f":"IF(OR(Hilfe!E10=\"\",Hilfe!G10=\"\",Hilfe!I10=\"\"),\"-\",IF(Hilfe!I39=\"Netto\",TEXT(1+Hilfe!I10,\"0%\"),TEXT(1,\"0%\")))","v":"120%"}]
[]
[]
[]
[]
[null,null,null,null,"●",null,null,null,{"$f":"IF(OR(E10=\"\",G10=\"\",I10=\"\"),\"-\",MID(L13,1,FIND(\" →\",L13,1)-1))","v":"Netto"},null,null,{"$f":"IF(OR(E10=\"\",G10=\"\",I10=\"\"),\"-\",TEXT(E10,\"# ##0,00\"))","v":"2 000,00"},null,"…................................",null,null,{"$f":"IF(OR(E10=\"\",G10=\"\",I10=\"\"),\"-\",IF(I39=\"Brutto\",TEXT(1+I10,\"0%\"),TEXT(1,\"0%\")))","v":"100%"}]
[]
[null,null,null,null,null,null,null,null,{"$f":"IF(OR(E10=\"\",G10=\"\",I10=\"\"),\"-\",IF(G10=\"inkl.\",\"Netto\",\"Brutto\"))","v":"Brutto"},null,null,"x      ",null,"…................................",null,null,{"$f":"IF(OR(E10=\"\",G10=\"\",I10=\"\"),\"-\",IF(I39=\"Netto\",TEXT(1+I10,\"0%\"),TEXT(1,\"0%\")))","v":"120%"}]
[]
[null,null,null,null,null,null,null,null,null,null,null,"x = ",null,{"$f":"IF(OR(E10=\"\",G10=\"\",I10=\"\"),\"-\",E10)","v":2000},"x",null,{"$f":"IF(OR(E10=\"\",G10=\"\",I10=\"\"),\"-\",Q41)","v":"120%"}]
[]
[]
[null,null,null,null,null,null,null,null,null,null,null,null,null,null,{"$f":"IF(OR(E10=\"\",G10=\"\",I10=\"\"),\"-\",Q39)","v":"100%"}]
[]
[null,null,null,null,null,null,null,null,null,null,null,"x = ",null,{"$f":"IF(OR(E10=\"\",G10=\"\",I10=\"\"),\"-\",N43*Q43/O46)","v":2400}]
[null,null,null,{"$error":"#VALUE!"}]
[]
[null,null,"2.",null,{"$f":"IF(Berechnung!E51=\"\",\"\",Berechnung!E51)","v":220},null,{"$f":"IF(Berechnung!G51=\"\",\"\",Berechnung!G51)","v":"inkl."},null,{"$f":"IF(Berechnung!I51=\"\",\"\",Berechnung!I51)","v":0.1},"Ust.",null,{"$f":"IF(G51=Berechnung!$E$100,E51/(1+I51),E51)","v":199.99999999999997},null,{"$f":"L51*I51","v":20},null,null,{"$f":"SUM(L51:N51)","v":219.99999999999997}]
[]
[]
[null,null,null,null,{"$f":"IF(OR(E51=\"\",G51=\"\",I51=\"\"),\"-\",TEXT(E51,\"# ##0,00\")&\" \"&G51&\" \"&TEXT(I51,\"0%\")&\" \"&J51)","v":"220,00 inkl. 10% Ust."},null,null,null,null,"=",null,{"$f":"IF(OR(E51=\"\",G51=\"\",I51=\"\"),\"-\",IF(G51=\"exkl.\",\"Netto → 100%\",\"Brutto → \"&TEXT(1+I51,\"0%\")))","v":"Brutto → 110%"}]
[]
[]
[null,null,null,"  Umsatzsteuer"]
[null,null,null,null,"●",null,null,null,{"$f":"IF(OR(E51=\"\",G51=\"\",I51=\"\"),\"-\",MID(L54,1,FIND(\" →\",L54,1)-1))","v":"Brutto"},null,null,{"$f":"IF(OR(E51=\"\",G51=\"\",I51=\"\"),\"-\",TEXT(E51,\"# ##0,00\"))","v":"220,00"},null,"…................................",null,null,{"$f":"IF(OR(E51=\"\",G51=\"\",I51=\"\"),\"-\",IF(I80=\"Brutto\",TEXT(1+I51,\"0%\"),TEXT(1,\"0%\")))","v":"110%"}]
[]
[null,null,null,null,null,null,null,null,{"$f":"IF(OR(E51=\"\",G51=\"\",I51=\"\"),\"-\",\"USt\")","v":"USt"},null,null,"y      ",null,"…................................",null,null,{"$f":"IF(OR(E51=\"\",G51=\"\",I51=\"\"),\"-\",I51)","v":0.1}]
[]
[null,null,null,null,null,null,null,null,null,null,null,"y = ",null,{"$f":"IF(OR(E51=\"\",G51=\"\",I51=\"\"),\"-\",N84)","v":220},"x",null,{"$f":"IF(OR(E51=\"\",G51=\"\",I51=\"\"),\"-\",Q60)","v":0.1}]
[]
[]
[null,null,null,null,null,null,null,null,null,null,null,null,null,null,{"$f":"IF(OR(E51=\"\",G51=\"\",I51=\"\"),\"-\",Q58)","v":"110%"}]
[]
[null,null,null,null,null,null,null,null,null,null,null,"y = ",null,{"$f":"IF(OR(E51=\"\",G51=\"\",I51=\"\"),\"-\",N62*Q62/O65)","v":20}]
[]
[null,null,null,null,null,null,null,null,null,null,null,null,null,null,null,null,null,null,null,null,{"$f":"\"Von \"&W71&\" nach \"&W75&\"!!!\"","v":"Von Brutto nach Netto!!!"}]
[null,null,null,{"$f":"IF(G51=Berechnung!$E$101,\"  \"&$Q$8,IF(G51=Berechnung!$E$100,\"  \"&$L$8,\"  -------------------->\"))","v":"  Netto"}]
[null,null,null,null,"●",null,null,null,{"$f":"IF(OR(E51=\"\",G51=\"\",I51=\"\"),\"-\",IF(G51=\"exkl.\",\"Netto\",\"Brutto\"))","v":"Brutto"},null,null,{"$f":"IF(OR(E51=\"\",G51=\"\",I51=\"\"),\"-\",E51)","v":220},null,null,null,null,null,null,null,null,null,null,{"$f":"IF(OR(Hilfe!E51=\"\",Hilfe!G51=\"\",Hilfe!I51=\"\"),\"-\",IF(Hilfe!G51=\"exkl.\",\"Netto\",\"Brutto\"))","v":"Brutto"},null,null,{"$f":"IF(OR(Hilfe!E51=\"\",Hilfe!G51=\"\",Hilfe!I51=\"\"),\"-\",Hilfe!E51)","v":220},null,{"$f":"IF(OR(Hilfe!E51=\"\",Hilfe!G51=\"\",Hilfe!I51=\"\"),\"-\",IF(Hilfe!I80=\"Brutto\",TEXT(1+Hilfe!I51,\"0%\"),TEXT(1,\"0%\")))","v":"110%"}]
[]
[null,null,null,null,null,null,{"$f":"IF(I71=\"\",\"\",IF(I71=\"Brutto\",\"-\",\"+\"))","v":"-"},null,{"$f":"IF(OR(E51=\"\",G51=\"\",I51=\"\"),\"-\",\"USt\")","v":"USt"},null,null,{"$f":"IF(OR(E51=\"\",G51=\"\",I51=\"\"),\"-\",N67)","v":20},null,null,null,null,null,null,null,null,{"$f":"IF(W71=\"\",\"\",IF(W71=\"Brutto\",\"-\",\"+\"))","v":"-"},null,{"$f":"IF(OR(Hilfe!E51=\"\",Hilfe!G51=\"\",Hilfe!I51=\"\"),\"-\",\"USt\")","v":"USt"},null,null,{"$f":"IF(OR(Hilfe!E51=\"\",Hilfe!G51=\"\",Hilfe!I51=\"\"),\"-\",Hilfe!N67)","v":20},null,{"$f":"IF(OR(Hilfe!E51=\"\",Hilfe!G51=\"\",Hilfe!I51=\"\"),\"-\",Hilfe!I51)","v":0.1}]
[]
[null,null,null,null,null,null,"=",null,{"$f":"IF(OR(E51=\"\",G51=\"\",I51=\"\"),\"-\",IF(G51=\"inkl.\",\"Netto\",\"Brutto\"))","v":"Netto"},null,null,{"$f":"IF(OR(E51=\"\",G51=\"\",I51=\"\"),\"-\",IF(G73=\"-\",SUM(L71,-L73),SUM(L71:L73)))","v":200},null,null,null,null,null,null,null,null,"=",null,{"$f":"IF(OR(Hilfe!E51=\"\",Hilfe!G51=\"\",Hilfe!I51=\"\"),\"-\",IF(Hilfe!G51=\"inkl.\",\"Netto\",\"Brutto\"))","v":"Netto"},null,null,{"$f":"IF(OR(Hilfe!E51=\"\",Hilfe!G51=\"\",Hilfe!I51=\"\"),\"-\",IF(U73=\"-\",SUM(Z71,-Z73),SUM(Z71:Z73)))","v":200},null,{"$f":"IF(OR(Hilfe!E51=\"\",Hilfe!G51=\"\",Hilfe!I51=\"\"),\"-\",IF(Hilfe!I80=\"Netto\",TEXT(1+Hilfe!I51,\"0%\"),TEXT(1,\"0%\")))","v":"100%"}]
[]
[]
[]
[]
[null,null,null,null,"●",null,null,null,{"$f":"IF(OR(E51=\"\",G51=\"\",I51=\"\"),\"-\",MID(L54,1,FIND(\" →\",L54,1)-1))","v":"Brutto"},null,null,{"$f":"IF(OR(E51=\"\",G51=\"\",I51=\"\"),\"-\",TEXT(E51,\"# ##0,00\"))","v":"220,00"},null,"…................................",null,null,{"$f":"IF(OR(E51=\"\",G51=\"\",I51=\"\"),\"-\",IF(I80=\"Brutto\",TEXT(1+I51,\"0%\"),TEXT(1,\"0%\")))","v":"110%"}]
[]
[null,null,null,null,null,null,null,null,{"$f":"IF(OR(E51=\"\",G51=\"\",I51=\"\"),\"-\",IF(G51=\"inkl.\",\"Netto\",\"Brutto\"))","v":"Netto"},null,null,"x      ",null,"…................................",null,null,{"$f":"IF(OR(E51=\"\",G51=\"\",I51=\"\"),\"-\",IF(I80=\"Netto\",TEXT(1+I51,\"0%\"),TEXT(1,\"0%\")))","v":"100%"}]
[]
[null,null,null,null,null,null,null,null,null,null,null,"x = ",null,{"$f":"IF(OR(E51=\"\",G51=\"\",I51=\"\"),\"-\",E51)","v":220},"x",null,{"$f":"IF(OR(E51=\"\",G51=\"\",I51=\"\"),\"-\",Q82)","v":"100%"}]
[]
[]
[null,null,null,null,null,null,null,null,null,null,null,null,null,null,{"$f":"IF(OR(E51=\"\",G51=\"\",I51=\"\"),\"-\",Q80)","v":"110%"}]
[]
[null,null,null,null,null,null,null,null,null,null,null,"x = ",null,{"$f":"IF(OR(E51=\"\",G51=\"\",I51=\"\"),\"-\",N84*Q84/O87)","v":199.99999999999997}]
[null,null,null,{"$error":"#VALUE!"}]

{"sheet":"Korrektur","index":3,"n_rows":76,"n_cols":29,"rows_kept":76,"cut":false,"hidden":false,"merged":[[14,0,14,6],[72,0,72,6]]}
[{"$f":"\"Korrektur: \"&Berechnung!C2","v":"Korrektur: ÜMOD - Netto, Umsatzsteuer und brutto berechnen"},null,null,null,null,null,null,null,null,null,null,null,null,null,null,null,null,null,null,null,null,null,null,null,null,null,null,null,{"$f":"L_KNR","v":1}]
[{"$f":"IF(K3<>A3,\"???\",\"\")","v":""},null,null,null,null,null,{"$f":"IF(AB3<>G3,\"???\",\"\")","v":""},null,null,null,{"$f":"IF(K3<>A3,\"???\",\"\")","v":""},null,null,null,null,null,null,null,null,null,null,null,null,null,null,null,null,{"$f":"IF(AB3<>G3,\"???\",\"\")","v":""}]
[]
["Liebe/r Schüler/In!",null,null,null,null,null,null,null,null,null,"Notenliste: ",null,null,null,null,0.1]
[null,null,null,null,null,null,null,null,null,null,"Spaltenindeces: ",null,null,null,null,{"$f":"SPI_mPKTE","v":45},"/",{"$f":"SPI_gPKTE","v":47},{"$f":"SPI_KOMP","v":48}]
["Du hast die abgefragten Kompetenzen wiefolgt erfüllt:",null,null,null,null,null,null,null,null,null,"Genügend bei:",null,null,null,null,{"$f":"O21/M18","v":0.52083333333333337},null,null,null,null,null,null,null,"Punkte nach Kompetenzen"]
[{"$f":"IF(X7=\"\",\"\",X7&\": \"&Z7&AA7&AB7&IF(AND(Z7>=AB7*50%,Z7<AB7*75%),\"   →   überwiegend erfüllt!\",IF(Z7>=AB7*75%,\"   →   vollständig erfülltt!\",\"   →   nicht erfüllt!\")))","v":"GK4: 0/48   →   nicht erfüllt!"},null,null,null,null,null,null,null,null,null,"Nicht erfüllte Grundkompetenzen:",null,null,null,null,{"$f":"SUM(IF(Z7<AB7*50%,1,0),IF(Z8<AB8*50%,1,0),IF(Z9<AB9*50%,1,0))","v":1},null,null,null,null,null,null,null,"GK4",null,{"$f":"SUMIFS(Z$30:Z$69,$X$30:$X$69,$X7)","v":0},"/",{"$f":"SUMIFS(AB$30:AB$69,$X$30:$X$69,$X7)","v":48}]
["GK: 0/0   →   vollständig erfülltt!",null,null,null,null,null,null,null,null,null,null,null,null,null,null,null,null,null,null,null,null,null,null,"GK",null,0,"/",0]
["GK: 0/0   →   vollständig erfülltt!",null,null,null,null,null,null,null,null,null,null,null,null,null,null,null,null,null,null,null,null,null,null,"GK",null,0,"/",0]
["EK: 0/0   →   vollständig erfülltt!",null,null,null,null,null,null,null,null,null,null,null,null,null,null,null,null,null,null,null,null,null,null,"EK",null,0,"/",0]
["EK: 0/0   →   vollständig erfülltt!",null,null,null,null,null,null,null,null,null,null,null,null,null,null,null,null,null,null,null,null,null,null,"EK",null,0,"/",0]
["EK: 0/0   →   vollständig erfülltt!",null,null,null,null,null,null,null,null,null,null,null,null,null,null,null,null,null,null,null,null,null,null,"EK",null,0,"/",0]
[null,null,null,null,null,null,null,null,null,null,null,null,null,null,null,null,null,null,null,null,null,null,null,"Summe",null,{"$f":"SUM(Z7:Z12)","v":0},"/",{"$f":"SUM(AB7:AB12)","v":48}]
[{"$f":"\"Daraus würde sich für diese Aufgabe ein \"&IF(N25=1,UPPER(\"„Sehr gut”\"),IF(N25=2,UPPER(\"„Gut”\"),IF(N25=3,UPPER(\"„Befriedigend”\"),IF(N25=4,UPPER(\"„Genügend”\"),IF(N25=5,UPPER(\"„Nicht genügend”\"),\"---\")))))&\" ergeben.\"","v":"Daraus würde sich für diese Aufgabe ein „NICHT GENÜGEND” ergeben."},null,null,null,null,null,null,null,null,null,"Notenschlüssel:"]
[{"$f":"IF(N25=1,\"Das hast du ganz toll gemacht!!!   😀\",IF(N25=2,\"Das ist eine gute Arbeit geworden!!   🙂\",IF(N25=3,\"Das passt schon so!   😐\",IF(N25=4,\"Das geht noch besser!   🙁\",\"Das ist leider zu wenig!   ☹️   Schau dir deine Ergebnisse bitte noch einmal an und versuch' es beim nächsten Mal besser zu machen!!!\"))))","v":"Das ist leider zu wenig!   ☹️   Schau dir deine Ergebnisse bitte noch einmal an und versuch' es beim nächsten Mal besser zu machen!!!"},null,null,null,null,null,null,null,null,null,"❶",{"$f":"IF(O18=M18,M18&\" P\",O18&\" - \"&M18&\" P\")","v":"44 - 48 P"},"❷",{"$f":"IF(O19=M19,M19&\" P\",O19&\" - \"&M19&\" P\")","v":"38 - 43 P"},"❸",{"$f":"O20&\" - \"&M20&\" P\"","v":"32 - 37 P"},"❹",{"$f":"O21&\" - \"&M21&\" P\"","v":"25 - 31 P"},"❺",{"$f":"O22&\" - \"&M22&\" P\"","v":"0 - 24 P"}]
[]
["LG",null,null,null,null,null,null,null,null,null,null,null,null,null,null,null,null,"Differenz",null,"Abstufung"]
["FL Harasleben",null,null,null,null,null,null,null,null,null,null,"❶",{"$f":"AB13","v":48},"-",{"$f":"M19+1","v":44},null,null,{"$f":"M18-O18","v":4},null,1]
[null,null,null,null,null,null,null,null,null,null,null,"❷",{"$f":"ROUNDUP($M$18*T19,0)","v":43},"-",{"$f":"M20+1","v":38},null,null,{"$f":"M19-O19","v":5},null,0.88300000000000001]
["Punkterechner",null,null,{"$f":"SUM(AB7:AB12)","v":48},"…............",100," %",null,null,null,null,"❸",{"$f":"ROUNDUP($M$18*T20,0)","v":37},"-",{"$f":"M21+1","v":32},null,null,{"$f":"M20-O20","v":5},null,0.76]
[null,null,"Deine  erreichten Punkte:",{"$f":"ROUND(SUM(Z7:Z12),2)","v":0},"…............",{"$f":"D21*F20/(IF(D20=0,1,D20))","v":0}," %",null,null,null,null,"❹",31,"-",{"$f":"M22+1","v":25},null,null,{"$f":"M21-O21","v":6},null,0.628]
[null,null,null,null,null,null,null,null,null,null,null,"❺",24,"-",0,null,null,null,null,0.5]
[]
[null,null,null,null,null,null,null,null,null,null,"Erreichte Punkte:",null,null,{"$f":"SUM(Z7:Z12)","v":0},{"$f":"\"  das entspricht: \"&TEXT(ROUND(F21,4),\"# ##0,00\")&\" %\"","v":"  das entspricht: 0,00 %"}]
[null,null,null,null,null,null,null,null,null,null,"Note:",null,null,{"$f":"IF(P7>0,5,IF(N24>=O18,1,IF(AND(N24>=O19,N24<O18),2,IF(AND(N24>=O20,N24<O19),3,IF(AND(N24>=O21,N24<O20),4,5)))))","v":5}]
[]
["Deine Ergebnisse im Detail"]
[null,null,null,null,null,null,null,null,null,null,null,null,null,null,null,null,null,null,null,null,null,null,null," "]
["Frage",null,null,"Pkte","/","Ges.",null,null,null,null,null,null,null,null,null,null,null,null,null,null,null,null,null,null,null,"Pkte","/","Ges."]
["1.",{"$f":"IF(TYPE(VLOOKUP($A30,FB_1,2,0))=16,\"\",VLOOKUP($A30,FB_1,2,0))&IF(TYPE(VLOOKUP($A30,FB_2,2,0))=16,\"\",VLOOKUP($A30,FB_2,2,0))&IF(TYPE(VLOOKUP($A30,FB_3,2,0))=16,\"\",VLOOKUP($A30,FB_3,2,0))&IF(TYPE(VLOOKUP($A30,FB_4,2,0))=16,\"\",VLOOKUP($A30,FB_4,2,0))&IF(TYPE(VLOOKUP($A30,FB_5,2,0))=16,\"\",VLOOKUP($A30,FB_5,2,0))&IF(TYPE(VLOOKUP($A30,FB_6,2,0))=16,\"\",VLOOKUP($A30,FB_6,2,0))&IF(TYPE(VLOOKUP($A30,FB_7,2,0))=16,\"\",VLOOKUP($A30,FB_7,2,0))&IF(TYPE(VLOOKUP($A30,FB_8,2,0))=16,\"\",VLOOKUP($A30,FB_8,2,0))&IF(TYPE(VLOOKUP($A30,FB_9,2,0))=16,\"\",VLOOKUP($A30,FB_9,2,0))&IF(TYPE(VLOOKUP($A30,FB_10,2,0))=16,\"\",VLOOKUP($A30,FB_10,2,0))&IF(TYPE(VLOOKUP($A30,FB_11,2,0))=16,\"\",VLOOKUP($A30,FB_11,2,0))&IF(TYPE(VLOOKUP($A30,FB_12,2,0))=16,\"\",VLOOKUP($A30,FB_12,2,0))&IF(TYPE(VLOOKUP($A30,FB_13,2,0))=16,\"\",VLOOKUP($A30,FB_13,2,0))&IF(TYPE(VLOOKUP($A30,FB_14,2,0))=16,\"\",VLOOKUP($A30,FB_14,2,0))&IF(TYPE(VLOOKUP($A30,FB_15,2,0))=16,\"\",VLOOKUP($A30,FB_15,2,0))&IF(TYPE(VLOOKUP($A30,FB_16,2,0))=16,\"\",VLOOKUP($A30,FB_16,2,0))&IF(TYPE(VLOOKUP($A30,FB_17,2,0))=16,\"\",VLOOKUP($A30,FB_17,2,0))&IF(TYPE(VLOOKUP($A30,FB_18,2,0))=16,\"\",VLOOKUP($A30,FB_18,2,0))&IF(TYPE(VLOOKUP($A30,FB_19,2,0))=16,\"\",VLOOKUP($A30,FB_19,2,0))&IF(TYPE(VLOOKUP($A30,FB_20,2,0))=16,\"\",VLOOKUP($A30,FB_20,2,0))&IF(TYPE(VLOOKUP($A30,FB_21,2,0))=16,\"\",VLOOKUP($A30,FB_21,2,0))&IF(TYPE(VLOOKUP($A30,FB_22,2,0))=16,\"\",VLOOKUP($A30,FB_22,2,0))&IF(TYPE(VLOOKUP($A30,FB_23,2,0))=16,\"\",VLOOKUP($A30,FB_23,2,0))&IF(TYPE(VLOOKUP($A30,FB_24,2,0))=16,\"\",VLOOKUP($A30,FB_24,2,0))&IF(TYPE(VLOOKUP($A30,FB_25,2,0))=16,\"\",VLOOKUP($A30,FB_25,2,0))&IF(TYPE(VLOOKUP($A30,FB_26,2,0))=16,\"\",VLOOKUP($A30,FB_26,2,0))&IF(TYPE(VLOOKUP($A30,FB_27,2,0))=16,\"\",VLOOKUP($A30,FB_27,2,0))&IF(TYPE(VLOOKUP($A30,FB_28,2,0))=16,\"\",VLOOKUP($A30,FB_28,2,0))&IF(TYPE(VLOOKUP($A30,FB_29,2,0))=16,\"\",VLOOKUP($A30,FB_29,2,0))&IF(TYPE(VLOOKUP($A30,FB_30,2,0))=16,\"\",VLOOKUP($A30,FB_30,2,0))","v":"Von Netto nach Brutto!!!"},null,{"$f":"IF($B30=\"\",\"\",_xlfn.NUMBERVALUE(IF(TYPE(VLOOKUP($A30,FB_1,P$5,0))=16,\"\",VLOOKUP($A30,FB_1,P$5,0))&IF(TYPE(VLOOKUP($A30,FB_2,P$5,0))=16,\"\",VLOOKUP($A30,FB_2,P$5,0))&IF(TYPE(VLOOKUP($A30,FB_3,P$5,0))=16,\"\",VLOOKUP($A30,FB_3,P$5,0))&IF(TYPE(VLOOKUP($A30,FB_4,P$5,0))=16,\"\",VLOOKUP($A30,FB_4,P$5,0))&IF(TYPE(VLOOKUP($A30,FB_5,P$5,0))=16,\"\",VLOOKUP($A30,FB_5,P$5,0))&IF(TYPE(VLOOKUP($A30,FB_6,P$5,0))=16,\"\",VLOOKUP($A30,FB_6,P$5,0))&IF(TYPE(VLOOKUP($A30,FB_7,P$5,0))=16,\"\",VLOOKUP($A30,FB_7,P$5,0))&IF(TYPE(VLOOKUP($A30,FB_8,P$5,0))=16,\"\",VLOOKUP($A30,FB_8,P$5,0))&IF(TYPE(VLOOKUP($A30,FB_9,P$5,0))=16,\"\",VLOOKUP($A30,FB_9,P$5,0))&IF(TYPE(VLOOKUP($A30,FB_10,P$5,0))=16,\"\",VLOOKUP($A30,FB_10,P$5,0))&IF(TYPE(VLOOKUP($A30,FB_11,P$5,0))=16,\"\",VLOOKUP($A30,FB_11,P$5,0))&IF(TYPE(VLOOKUP($A30,FB_12,P$5,0))=16,\"\",VLOOKUP($A30,FB_12,P$5,0))&IF(TYPE(VLOOKUP($A30,FB_13,P$5,0))=16,\"\",VLOOKUP($A30,FB_13,P$5,0))&IF(TYPE(VLOOKUP($A30,FB_14,P$5,0))=16,\"\",VLOOKUP($A30,FB_14,P$5,0))&IF(TYPE(VLOOKUP($A30,FB_15,P$5,0))=16,\"\",VLOOKUP($A30,FB_15,P$5,0))&IF(TYPE(VLOOKUP($A30,FB_16,P$5,0))=16,\"\",VLOOKUP($A30,FB_16,P$5,0))&IF(TYPE(VLOOKUP($A30,FB_17,P$5,0))=16,\"\",VLOOKUP($A30,FB_17,P$5,0))&IF(TYPE(VLOOKUP($A30,FB_18,P$5,0))=16,\"\",VLOOKUP($A30,FB_18,P$5,0))&IF(TYPE(VLOOKUP($A30,FB_19,P$5,0))=16,\"\",VLOOKUP($A30,FB_19,P$5,0))&IF(TYPE(VLOOKUP($A30,FB_20,P$5,0))=16,\"\",VLOOKUP($A30,FB_20,P$5,0))&IF(TYPE(VLOOKUP($A30,FB_21,P$5,0))=16,\"\",VLOOKUP($A30,FB_21,P$5,0))&IF(TYPE(VLOOKUP($A30,FB_22,P$5,0))=16,\"\",VLOOKUP($A30,FB_22,P$5,0))&IF(TYPE(VLOOKUP($A30,FB_23,P$5,0))=16,\"\",VLOOKUP($A30,FB_23,P$5,0))&IF(TYPE(VLOOKUP($A30,FB_24,P$5,0))=16,\"\",VLOOKUP($A30,FB_24,P$5,0))&IF(TYPE(VLOOKUP($A30,FB_25,P$5,0))=16,\"\",VLOOKUP($A30,FB_25,P$5,0))&IF(TYPE(VLOOKUP($A30,FB_26,P$5,0))=16,\"\",VLOOKUP($A30,FB_26,P$5,0))&IF(TYPE(VLOOKUP($A30,FB_27,P$5,0))=16,\"\",VLOOKUP($A30,FB_27,P$5,0))&IF(TYPE(VLOOKUP($A30,FB_28,P$5,0))=16,\"\",VLOOKUP($A30,FB_28,P$5,0))&IF(TYPE(VLOOKUP($A30,FB_29,P$5,0))=16,\"\",VLOOKUP($A30,FB_29,P$5,0))&IF(TYPE(VLOOKUP($A30,FB_30,P$5,0))=16,\"\",VLOOKUP($A30,FB_30,P$5,0))))","v":0},{"$f":"IF(B30=\"\",\"\",\"/\")","v":"/"},{"$f":"IF($B30=\"\",\"\",_xlfn.NUMBERVALUE(IF(TYPE(VLOOKUP($A30,FB_1,R$5,0))=16,\"\",VLOOKUP($A30,FB_1,R$5,0))&IF(TYPE(VLOOKUP($A30,FB_2,R$5,0))=16,\"\",VLOOKUP($A30,FB_2,R$5,0))&IF(TYPE(VLOOKUP($A30,FB_3,R$5,0))=16,\"\",VLOOKUP($A30,FB_3,R$5,0))&IF(TYPE(VLOOKUP($A30,FB_4,R$5,0))=16,\"\",VLOOKUP($A30,FB_4,R$5,0))&IF(TYPE(VLOOKUP($A30,FB_5,R$5,0))=16,\"\",VLOOKUP($A30,FB_5,R$5,0))&IF(TYPE(VLOOKUP($A30,FB_6,R$5,0))=16,\"\",VLOOKUP($A30,FB_6,R$5,0))&IF(TYPE(VLOOKUP($A30,FB_7,R$5,0))=16,\"\",VLOOKUP($A30,FB_7,R$5,0))&IF(TYPE(VLOOKUP($A30,FB_8,R$5,0))=16,\"\",VLOOKUP($A30,FB_8,R$5,0))&IF(TYPE(VLOOKUP($A30,FB_9,R$5,0))=16,\"\",VLOOKUP($A30,FB_9,R$5,0))&IF(TYPE(VLOOKUP($A30,FB_10,R$5,0))=16,\"\",VLOOKUP($A30,FB_10,R$5,0))&IF(TYPE(VLOOKUP($A30,FB_11,R$5,0))=16,\"\",VLOOKUP($A30,FB_11,R$5,0))&IF(TYPE(VLOOKUP($A30,FB_12,R$5,0))=16,\"\",VLOOKUP($A30,FB_12,R$5,0))&IF(TYPE(VLOOKUP($A30,FB_13,R$5,0))=16,\"\",VLOOKUP($A30,FB_13,R$5,0))&IF(TYPE(VLOOKUP($A30,FB_14,R$5,0))=16,\"\",VLOOKUP($A30,FB_14,R$5,0))&IF(TYPE(VLOOKUP($A30,FB_15,R$5,0))=16,\"\",VLOOKUP($A30,FB_15,R$5,0))&IF(TYPE(VLOOKUP($A30,FB_16,R$5,0))=16,\"\",VLOOKUP($A30,FB_16,R$5,0))&IF(TYPE(VLOOKUP($A30,FB_17,R$5,0))=16,\"\",VLOOKUP($A30,FB_17,R$5,0))&IF(TYPE(VLOOKUP($A30,FB_18,R$5,0))=16,\"\",VLOOKUP($A30,FB_18,R$5,0))&IF(TYPE(VLOOKUP($A30,FB_19,R$5,0))=16,\"\",VLOOKUP($A30,FB_19,R$5,0))&IF(TYPE(VLOOKUP($A30,FB_20,R$5,0))=16,\"\",VLOOKUP($A30,FB_20,R$5,0))&IF(TYPE(VLOOKUP($A30,FB_21,R$5,0))=16,\"\",VLOOKUP($A30,FB_21,R$5,0))&IF(TYPE(VLOOKUP($A30,FB_22,R$5,0))=16,\"\",VLOOKUP($A30,FB_22,R$5,0))&IF(TYPE(VLOOKUP($A30,FB_23,R$5,0))=16,\"\",VLOOKUP($A30,FB_23,R$5,0))&IF(TYPE(VLOOKUP($A30,FB_24,R$5,0))=16,\"\",VLOOKUP($A30,FB_24,R$5,0))&IF(TYPE(VLOOKUP($A30,FB_25,R$5,0))=16,\"\",VLOOKUP($A30,FB_25,R$5,0))&IF(TYPE(VLOOKUP($A30,FB_26,R$5,0))=16,\"\",VLOOKUP($A30,FB_26,R$5,0))&IF(TYPE(VLOOKUP($A30,FB_27,R$5,0))=16,\"\",VLOOKUP($A30,FB_27,R$5,0))&IF(TYPE(VLOOKUP($A30,FB_28,R$5,0))=16,\"\",VLOOKUP($A30,FB_28,R$5,0))&IF(TYPE(VLOOKUP($A30,FB_29,R$5,0))=16,\"\",VLOOKUP($A30,FB_29,R$5,0))&IF(TYPE(VLOOKUP($A30,FB_30,R$5,0))=16,\"\",VLOOKUP($A30,FB_30,R$5,0))))","v":24},{"$f":"IF($B30=\"\",\"\",IF(TYPE(VLOOKUP($A30,FB_1,S$5,0))=16,\"\",VLOOKUP($A30,FB_1,S$5,0))&IF(TYPE(VLOOKUP($A30,FB_2,S$5,0))=16,\"\",VLOOKUP($A30,FB_2,S$5,0))&IF(TYPE(VLOOKUP($A30,FB_3,S$5,0))=16,\"\",VLOOKUP($A30,FB_3,S$5,0))&IF(TYPE(VLOOKUP($A30,FB_4,S$5,0))=16,\"\",VLOOKUP($A30,FB_4,S$5,0))&IF(TYPE(VLOOKUP($A30,FB_5,S$5,0))=16,\"\",VLOOKUP($A30,FB_5,S$5,0))&IF(TYPE(VLOOKUP($A30,FB_6,S$5,0))=16,\"\",VLOOKUP($A30,FB_6,S$5,0))&IF(TYPE(VLOOKUP($A30,FB_7,S$5,0))=16,\"\",VLOOKUP($A30,FB_7,S$5,0))&IF(TYPE(VLOOKUP($A30,FB_8,S$5,0))=16,\"\",VLOOKUP($A30,FB_8,S$5,0))&IF(TYPE(VLOOKUP($A30,FB_9,S$5,0))=16,\"\",VLOOKUP($A30,FB_9,S$5,0))&IF(TYPE(VLOOKUP($A30,FB_10,S$5,0))=16,\"\",VLOOKUP($A30,FB_10,S$5,0))&IF(TYPE(VLOOKUP($A30,FB_11,S$5,0))=16,\"\",VLOOKUP($A30,FB_11,S$5,0))&IF(TYPE(VLOOKUP($A30,FB_12,S$5,0))=16,\"\",VLOOKUP($A30,FB_12,S$5,0))&IF(TYPE(VLOOKUP($A30,FB_13,S$5,0))=16,\"\",VLOOKUP($A30,FB_13,S$5,0))&IF(TYPE(VLOOKUP($A30,FB_14,S$5,0))=16,\"\",VLOOKUP($A30,FB_14,S$5,0))&IF(TYPE(VLOOKUP($A30,FB_15,S$5,0))=16,\"\",VLOOKUP($A30,FB_15,S$5,0))&IF(TYPE(VLOOKUP($A30,FB_16,S$5,0))=16,\"\",VLOOKUP($A30,FB_16,S$5,0))&IF(TYPE(VLOOKUP($A30,FB_17,S$5,0))=16,\"\",VLOOKUP($A30,FB_17,S$5,0))&IF(TYPE(VLOOKUP($A30,FB_18,S$5,0))=16,\"\",VLOOKUP($A30,FB_18,S$5,0))&IF(TYPE(VLOOKUP($A30,FB_19,S$5,0))=16,\"\",VLOOKUP($A30,FB_19,S$5,0))&IF(TYPE(VLOOKUP($A30,FB_20,S$5,0))=16,\"\",VLOOKUP($A30,FB_20,S$5,0))&IF(TYPE(VLOOKUP($A30,FB_21,S$5,0))=16,\"\",VLOOKUP($A30,FB_21,S$5,0))&IF(TYPE(VLOOKUP($A30,FB_22,S$5,0))=16,\"\",VLOOKUP($A30,FB_22,S$5,0))&IF(TYPE(VLOOKUP($A30,FB_23,S$5,0))=16,\"\",VLOOKUP($A30,FB_23,S$5,0))&IF(TYPE(VLOOKUP($A30,FB_24,S$5,0))=16,\"\",VLOOKUP($A30,FB_24,S$5,0))&IF(TYPE(VLOOKUP($A30,FB_25,S$5,0))=16,\"\",VLOOKUP($A30,FB_25,S$5,0))&IF(TYPE(VLOOKUP($A30,FB_26,S$5,0))=16,\"\",VLOOKUP($A30,FB_26,S$5,0))&IF(TYPE(VLOOKUP($A30,FB_27,S$5,0))=16,\"\",VLOOKUP($A30,FB_27,S$5,0))&IF(TYPE(VLOOKUP($A30,FB_28,S$5,0))=16,\"\",VLOOKUP($A30,FB_28,S$5,0))&IF(TYPE(VLOOKUP($A30,FB_29,S$5,0))=16,\"\",VLOOKUP($A30,FB_29,S$5,0))&IF(TYPE(VLOOKUP($A30,FB_30,S$5,0))=16,\"\",VLOOKUP($A30,FB_30,S$5,0)))","v":"GK4"},null,null,null,null,null,null,null,null,null,null,null,null,null,null,null,null,{"$f":"IF(G30=\"\",\"\",G30)","v":"GK4"},":",{"$f":"D30","v":0},{"$f":"E30","v":"/"},{"$f":"F30","v":24}]
["2.",{"$f":"IF(TYPE(VLOOKUP($A31,FB_1,2,0))=16,\"\",VLOOKUP($A31,FB_1,2,0))&IF(TYPE(VLOOKUP($A31,FB_2,2,0))=16,\"\",VLOOKUP($A31,FB_2,2,0))&IF(TYPE(VLOOKUP($A31,FB_3,2,0))=16,\"\",VLOOKUP($A31,FB_3,2,0))&IF(TYPE(VLOOKUP($A31,FB_4,2,0))=16,\"\",VLOOKUP($A31,FB_4,2,0))&IF(TYPE(VLOOKUP($A31,FB_5,2,0))=16,\"\",VLOOKUP($A31,FB_5,2,0))&IF(TYPE(VLOOKUP($A31,FB_6,2,0))=16,\"\",VLOOKUP($A31,FB_6,2,0))&IF(TYPE(VLOOKUP($A31,FB_7,2,0))=16,\"\",VLOOKUP($A31,FB_7,2,0))&IF(TYPE(VLOOKUP($A31,FB_8,2,0))=16,\"\",VLOOKUP($A31,FB_8,2,0))&IF(TYPE(VLOOKUP($A31,FB_9,2,0))=16,\"\",VLOOKUP($A31,FB_9,2,0))&IF(TYPE(VLOOKUP($A31,FB_10,2,0))=16,\"\",VLOOKUP($A31,FB_10,2,0))&IF(TYPE(VLOOKUP($A31,FB_11,2,0))=16,\"\",VLOOKUP($A31,FB_11,2,0))&IF(TYPE(VLOOKUP($A31,FB_12,2,0))=16,\"\",VLOOKUP($A31,FB_12,2,0))&IF(TYPE(VLOOKUP($A31,FB_13,2,0))=16,\"\",VLOOKUP($A31,FB_13,2,0))&IF(TYPE(VLOOKUP($A31,FB_14,2,0))=16,\"\",VLOOKUP($A31,FB_14,2,0))&IF(TYPE(VLOOKUP($A31,FB_15,2,0))=16,\"\",VLOOKUP($A31,FB_15,2,0))&IF(TYPE(VLOOKUP($A31,FB_16,2,0))=16,\"\",VLOOKUP($A31,FB_16,2,0))&IF(TYPE(VLOOKUP($A31,FB_17,2,0))=16,\"\",VLOOKUP($A31,FB_17,2,0))&IF(TYPE(VLOOKUP($A31,FB_18,2,0))=16,\"\",VLOOKUP($A31,FB_18,2,0))&IF(TYPE(VLOOKUP($A31,FB_19,2,0))=16,\"\",VLOOKUP($A31,FB_19,2,0))&IF(TYPE(VLOOKUP($A31,FB_20,2,0))=16,\"\",VLOOKUP($A31,FB_20,2,0))&IF(TYPE(VLOOKUP($A31,FB_21,2,0))=16,\"\",VLOOKUP($A31,FB_21,2,0))&IF(TYPE(VLOOKUP($A31,FB_22,2,0))=16,\"\",VLOOKUP($A31,FB_22,2,0))&IF(TYPE(VLOOKUP($A31,FB_23,2,0))=16,\"\",VLOOKUP($A31,FB_23,2,0))&IF(TYPE(VLOOKUP($A31,FB_24,2,0))=16,\"\",VLOOKUP($A31,FB_24,2,0))&IF(TYPE(VLOOKUP($A31,FB_25,2,0))=16,\"\",VLOOKUP($A31,FB_25,2,0))&IF(TYPE(VLOOKUP($A31,FB_26,2,0))=16,\"\",VLOOKUP($A31,FB_26,2,0))&IF(TYPE(VLOOKUP($A31,FB_27,2,0))=16,\"\",VLOOKUP($A31,FB_27,2,0))&IF(TYPE(VLOOKUP($A31,FB_28,2,0))=16,\"\",VLOOKUP($A31,FB_28,2,0))&IF(TYPE(VLOOKUP($A31,FB_29,2,0))=16,\"\",VLOOKUP($A31,FB_29,2,0))&IF(TYPE(VLOOKUP($A31,FB_30,2,0))=16,\"\",VLOOKUP($A31,FB_30,2,0))","v":"Von Brutto nach Netto!!!"},null,{"$f":"IF($B31=\"\",\"\",_xlfn.NUMBERVALUE(IF(TYPE(VLOOKUP($A31,FB_1,P$5,0))=16,\"\",VLOOKUP($A31,FB_1,P$5,0))&IF(TYPE(VLOOKUP($A31,FB_2,P$5,0))=16,\"\",VLOOKUP($A31,FB_2,P$5,0))&IF(TYPE(VLOOKUP($A31,FB_3,P$5,0))=16,\"\",VLOOKUP($A31,FB_3,P$5,0))&IF(TYPE(VLOOKUP($A31,FB_4,P$5,0))=16,\"\",VLOOKUP($A31,FB_4,P$5,0))&IF(TYPE(VLOOKUP($A31,FB_5,P$5,0))=16,\"\",VLOOKUP($A31,FB_5,P$5,0))&IF(TYPE(VLOOKUP($A31,FB_6,P$5,0))=16,\"\",VLOOKUP($A31,FB_6,P$5,0))&IF(TYPE(VLOOKUP($A31,FB_7,P$5,0))=16,\"\",VLOOKUP($A31,FB_7,P$5,0))&IF(TYPE(VLOOKUP($A31,FB_8,P$5,0))=16,\"\",VLOOKUP($A31,FB_8,P$5,0))&IF(TYPE(VLOOKUP($A31,FB_9,P$5,0))=16,\"\",VLOOKUP($A31,FB_9,P$5,0))&IF(TYPE(VLOOKUP($A31,FB_10,P$5,0))=16,\"\",VLOOKUP($A31,FB_10,P$5,0))&IF(TYPE(VLOOKUP($A31,FB_11,P$5,0))=16,\"\",VLOOKUP($A31,FB_11,P$5,0))&IF(TYPE(VLOOKUP($A31,FB_12,P$5,0))=16,\"\",VLOOKUP($A31,FB_12,P$5,0))&IF(TYPE(VLOOKUP($A31,FB_13,P$5,0))=16,\"\",VLOOKUP($A31,FB_13,P$5,0))&IF(TYPE(VLOOKUP($A31,FB_14,P$5,0))=16,\"\",VLOOKUP($A31,FB_14,P$5,0))&IF(TYPE(VLOOKUP($A31,FB_15,P$5,0))=16,\"\",VLOOKUP($A31,FB_15,P$5,0))&IF(TYPE(VLOOKUP($A31,FB_16,P$5,0))=16,\"\",VLOOKUP($A31,FB_16,P$5,0))&IF(TYPE(VLOOKUP($A31,FB_17,P$5,0))=16,\"\",VLOOKUP($A31,FB_17,P$5,0))&IF(TYPE(VLOOKUP($A31,FB_18,P$5,0))=16,\"\",VLOOKUP($A31,FB_18,P$5,0))&IF(TYPE(VLOOKUP($A31,FB_19,P$5,0))=16,\"\",VLOOKUP($A31,FB_19,P$5,0))&IF(TYPE(VLOOKUP($A31,FB_20,P$5,0))=16,\"\",VLOOKUP($A31,FB_20,P$5,0))&IF(TYPE(VLOOKUP($A31,FB_21,P$5,0))=16,\"\",VLOOKUP($A31,FB_21,P$5,0))&IF(TYPE(VLOOKUP($A31,FB_22,P$5,0))=16,\"\",VLOOKUP($A31,FB_22,P$5,0))&IF(TYPE(VLOOKUP($A31,FB_23,P$5,0))=16,\"\",VLOOKUP($A31,FB_23,P$5,0))&IF(TYPE(VLOOKUP($A31,FB_24,P$5,0))=16,\"\",VLOOKUP($A31,FB_24,P$5,0))&IF(TYPE(VLOOKUP($A31,FB_25,P$5,0))=16,\"\",VLOOKUP($A31,FB_25,P$5,0))&IF(TYPE(VLOOKUP($A31,FB_26,P$5,0))=16,\"\",VLOOKUP($A31,FB_26,P$5,0))&IF(TYPE(VLOOKUP($A31,FB_27,P$5,0))=16,\"\",VLOOKUP($A31,FB_27,P$5,0))&IF(TYPE(VLOOKUP($A31,FB_28,P$5,0))=16,\"\",VLOOKUP($A31,FB_28,P$5,0))&IF(TYPE(VLOOKUP($A31,FB_29,P$5,0))=16,\"\",VLOOKUP($A31,FB_29,P$5,0))&IF(TYPE(VLOOKUP($A31,FB_30,P$5,0))=16,\"\",VLOOKUP($A31,FB_30,P$5,0))))","v":0},{"$f":"IF(B31=\"\",\"\",\"/\")","v":"/"},{"$f":"IF($B31=\"\",\"\",_xlfn.NUMBERVALUE(IF(TYPE(VLOOKUP($A31,FB_1,R$5,0))=16,\"\",VLOOKUP($A31,FB_1,R$5,0))&IF(TYPE(VLOOKUP($A31,FB_2,R$5,0))=16,\"\",VLOOKUP($A31,FB_2,R$5,0))&IF(TYPE(VLOOKUP($A31,FB_3,R$5,0))=16,\"\",VLOOKUP($A31,FB_3,R$5,0))&IF(TYPE(VLOOKUP($A31,FB_4,R$5,0))=16,\"\",VLOOKUP($A31,FB_4,R$5,0))&IF(TYPE(VLOOKUP($A31,FB_5,R$5,0))=16,\"\",VLOOKUP($A31,FB_5,R$5,0))&IF(TYPE(VLOOKUP($A31,FB_6,R$5,0))=16,\"\",VLOOKUP($A31,FB_6,R$5,0))&IF(TYPE(VLOOKUP($A31,FB_7,R$5,0))=16,\"\",VLOOKUP($A31,FB_7,R$5,0))&IF(TYPE(VLOOKUP($A31,FB_8,R$5,0))=16,\"\",VLOOKUP($A31,FB_8,R$5,0))&IF(TYPE(VLOOKUP($A31,FB_9,R$5,0))=16,\"\",VLOOKUP($A31,FB_9,R$5,0))&IF(TYPE(VLOOKUP($A31,FB_10,R$5,0))=16,\"\",VLOOKUP($A31,FB_10,R$5,0))&IF(TYPE(VLOOKUP($A31,FB_11,R$5,0))=16,\"\",VLOOKUP($A31,FB_11,R$5,0))&IF(TYPE(VLOOKUP($A31,FB_12,R$5,0))=16,\"\",VLOOKUP($A31,FB_12,R$5,0))&IF(TYPE(VLOOKUP($A31,FB_13,R$5,0))=16,\"\",VLOOKUP($A31,FB_13,R$5,0))&IF(TYPE(VLOOKUP($A31,FB_14,R$5,0))=16,\"\",VLOOKUP($A31,FB_14,R$5,0))&IF(TYPE(VLOOKUP($A31,FB_15,R$5,0))=16,\"\",VLOOKUP($A31,FB_15,R$5,0))&IF(TYPE(VLOOKUP($A31,FB_16,R$5,0))=16,\"\",VLOOKUP($A31,FB_16,R$5,0))&IF(TYPE(VLOOKUP($A31,FB_17,R$5,0))=16,\"\",VLOOKUP($A31,FB_17,R$5,0))&IF(TYPE(VLOOKUP($A31,FB_18,R$5,0))=16,\"\",VLOOKUP($A31,FB_18,R$5,0))&IF(TYPE(VLOOKUP($A31,FB_19,R$5,0))=16,\"\",VLOOKUP($A31,FB_19,R$5,0))&IF(TYPE(VLOOKUP($A31,FB_20,R$5,0))=16,\"\",VLOOKUP($A31,FB_20,R$5,0))&IF(TYPE(VLOOKUP($A31,FB_21,R$5,0))=16,\"\",VLOOKUP($A31,FB_21,R$5,0))&IF(TYPE(VLOOKUP($A31,FB_22,R$5,0))=16,\"\",VLOOKUP($A31,FB_22,R$5,0))&IF(TYPE(VLOOKUP($A31,FB_23,R$5,0))=16,\"\",VLOOKUP($A31,FB_23,R$5,0))&IF(TYPE(VLOOKUP($A31,FB_24,R$5,0))=16,\"\",VLOOKUP($A31,FB_24,R$5,0))&IF(TYPE(VLOOKUP($A31,FB_25,R$5,0))=16,\"\",VLOOKUP($A31,FB_25,R$5,0))&IF(TYPE(VLOOKUP($A31,FB_26,R$5,0))=16,\"\",VLOOKUP($A31,FB_26,R$5,0))&IF(TYPE(VLOOKUP($A31,FB_27,R$5,0))=16,\"\",VLOOKUP($A31,FB_27,R$5,0))&IF(TYPE(VLOOKUP($A31,FB_28,R$5,0))=16,\"\",VLOOKUP($A31,FB_28,R$5,0))&IF(TYPE(VLOOKUP($A31,FB_29,R$5,0))=16,\"\",VLOOKUP($A31,FB_29,R$5,0))&IF(TYPE(VLOOKUP($A31,FB_30,R$5,0))=16,\"\",VLOOKUP($A31,FB_30,R$5,0))))","v":24},{"$f":"IF($B31=\"\",\"\",IF(TYPE(VLOOKUP($A31,FB_1,S$5,0))=16,\"\",VLOOKUP($A31,FB_1,S$5,0))&IF(TYPE(VLOOKUP($A31,FB_2,S$5,0))=16,\"\",VLOOKUP($A31,FB_2,S$5,0))&IF(TYPE(VLOOKUP($A31,FB_3,S$5,0))=16,\"\",VLOOKUP($A31,FB_3,S$5,0))&IF(TYPE(VLOOKUP($A31,FB_4,S$5,0))=16,\"\",VLOOKUP($A31,FB_4,S$5,0))&IF(TYPE(VLOOKUP($A31,FB_5,S$5,0))=16,\"\",VLOOKUP($A31,FB_5,S$5,0))&IF(TYPE(VLOOKUP($A31,FB_6,S$5,0))=16,\"\",VLOOKUP($A31,FB_6,S$5,0))&IF(TYPE(VLOOKUP($A31,FB_7,S$5,0))=16,\"\",VLOOKUP($A31,FB_7,S$5,0))&IF(TYPE(VLOOKUP($A31,FB_8,S$5,0))=16,\"\",VLOOKUP($A31,FB_8,S$5,0))&IF(TYPE(VLOOKUP($A31,FB_9,S$5,0))=16,\"\",VLOOKUP($A31,FB_9,S$5,0))&IF(TYPE(VLOOKUP($A31,FB_10,S$5,0))=16,\"\",VLOOKUP($A31,FB_10,S$5,0))&IF(TYPE(VLOOKUP($A31,FB_11,S$5,0))=16,\"\",VLOOKUP($A31,FB_11,S$5,0))&IF(TYPE(VLOOKUP($A31,FB_12,S$5,0))=16,\"\",VLOOKUP($A31,FB_12,S$5,0))&IF(TYPE(VLOOKUP($A31,FB_13,S$5,0))=16,\"\",VLOOKUP($A31,FB_13,S$5,0))&IF(TYPE(VLOOKUP($A31,FB_14,S$5,0))=16,\"\",VLOOKUP($A31,FB_14,S$5,0))&IF(TYPE(VLOOKUP($A31,FB_15,S$5,0))=16,\"\",VLOOKUP($A31,FB_15,S$5,0))&IF(TYPE(VLOOKUP($A31,FB_16,S$5,0))=16,\"\",VLOOKUP($A31,FB_16,S$5,0))&IF(TYPE(VLOOKUP($A31,FB_17,S$5,0))=16,\"\",VLOOKUP($A31,FB_17,S$5,0))&IF(TYPE(VLOOKUP($A31,FB_18,S$5,0))=16,\"\",VLOOKUP($A31,FB_18,S$5,0))&IF(TYPE(VLOOKUP($A31,FB_19,S$5,0))=16,\"\",VLOOKUP($A31,FB_19,S$5,0))&IF(TYPE(VLOOKUP($A31,FB_20,S$5,0))=16,\"\",VLOOKUP($A31,FB_20,S$5,0))&IF(TYPE(VLOOKUP($A31,FB_21,S$5,0))=16,\"\",VLOOKUP($A31,FB_21,S$5,0))&IF(TYPE(VLOOKUP($A31,FB_22,S$5,0))=16,\"\",VLOOKUP($A31,FB_22,S$5,0))&IF(TYPE(VLOOKUP($A31,FB_23,S$5,0))=16,\"\",VLOOKUP($A31,FB_23,S$5,0))&IF(TYPE(VLOOKUP($A31,FB_24,S$5,0))=16,\"\",VLOOKUP($A31,FB_24,S$5,0))&IF(TYPE(VLOOKUP($A31,FB_25,S$5,0))=16,\"\",VLOOKUP($A31,FB_25,S$5,0))&IF(TYPE(VLOOKUP($A31,FB_26,S$5,0))=16,\"\",VLOOKUP($A31,FB_26,S$5,0))&IF(TYPE(VLOOKUP($A31,FB_27,S$5,0))=16,\"\",VLOOKUP($A31,FB_27,S$5,0))&IF(TYPE(VLOOKUP($A31,FB_28,S$5,0))=16,\"\",VLOOKUP($A31,FB_28,S$5,0))&IF(TYPE(VLOOKUP($A31,FB_29,S$5,0))=16,\"\",VLOOKUP($A31,FB_29,S$5,0))&IF(TYPE(VLOOKUP($A31,FB_30,S$5,0))=16,\"\",VLOOKUP($A31,FB_30,S$5,0)))","v":"GK4"},null,null,null,null,null,null,null,null,null,null,null,null,null,null,null,null,{"$f":"IF(G31=\"\",\"\",G31)","v":"GK4"},":",{"$f":"D31","v":0},"/",24]
["3.",{"$f":"IF(TYPE(VLOOKUP($A32,FB_1,2,0))=16,\"\",VLOOKUP($A32,FB_1,2,0))&IF(TYPE(VLOOKUP($A32,FB_2,2,0))=16,\"\",VLOOKUP($A32,FB_2,2,0))&IF(TYPE(VLOOKUP($A32,FB_3,2,0))=16,\"\",VLOOKUP($A32,FB_3,2,0))&IF(TYPE(VLOOKUP($A32,FB_4,2,0))=16,\"\",VLOOKUP($A32,FB_4,2,0))&IF(TYPE(VLOOKUP($A32,FB_5,2,0))=16,\"\",VLOOKUP($A32,FB_5,2,0))&IF(TYPE(VLOOKUP($A32,FB_6,2,0))=16,\"\",VLOOKUP($A32,FB_6,2,0))&IF(TYPE(VLOOKUP($A32,FB_7,2,0))=16,\"\",VLOOKUP($A32,FB_7,2,0))&IF(TYPE(VLOOKUP($A32,FB_8,2,0))=16,\"\",VLOOKUP($A32,FB_8,2,0))&IF(TYPE(VLOOKUP($A32,FB_9,2,0))=16,\"\",VLOOKUP($A32,FB_9,2,0))&IF(TYPE(VLOOKUP($A32,FB_10,2,0))=16,\"\",VLOOKUP($A32,FB_10,2,0))&IF(TYPE(VLOOKUP($A32,FB_11,2,0))=16,\"\",VLOOKUP($A32,FB_11,2,0))&IF(TYPE(VLOOKUP($A32,FB_12,2,0))=16,\"\",VLOOKUP($A32,FB_12,2,0))&IF(TYPE(VLOOKUP($A32,FB_13,2,0))=16,\"\",VLOOKUP($A32,FB_13,2,0))&IF(TYPE(VLOOKUP($A32,FB_14,2,0))=16,\"\",VLOOKUP($A32,FB_14,2,0))&IF(TYPE(VLOOKUP($A32,FB_15,2,0))=16,\"\",VLOOKUP($A32,FB_15,2,0))&IF(TYPE(VLOOKUP($A32,FB_16,2,0))=16,\"\",VLOOKUP($A32,FB_16,2,0))&IF(TYPE(VLOOKUP($A32,FB_17,2,0))=16,\"\",VLOOKUP($A32,FB_17,2,0))&IF(TYPE(VLOOKUP($A32,FB_18,2,0))=16,\"\",VLOOKUP($A32,FB_18,2,0))&IF(TYPE(VLOOKUP($A32,FB_19,2,0))=16,\"\",VLOOKUP($A32,FB_19,2,0))&IF(TYPE(VLOOKUP($A32,FB_20,2,0))=16,\"\",VLOOKUP($A32,FB_20,2,0))&IF(TYPE(VLOOKUP($A32,FB_21,2,0))=16,\"\",VLOOKUP($A32,FB_21,2,0))&IF(TYPE(VLOOKUP($A32,FB_22,2,0))=16,\"\",VLOOKUP($A32,FB_22,2,0))&IF(TYPE(VLOOKUP($A32,FB_23,2,0))=16,\"\",VLOOKUP($A32,FB_23,2,0))&IF(TYPE(VLOOKUP($A32,FB_24,2,0))=16,\"\",VLOOKUP($A32,FB_24,2,0))&IF(TYPE(VLOOKUP($A32,FB_25,2,0))=16,\"\",VLOOKUP($A32,FB_25,2,0))&IF(TYPE(VLOOKUP($A32,FB_26,2,0))=16,\"\",VLOOKUP($A32,FB_26,2,0))&IF(TYPE(VLOOKUP($A32,FB_27,2,0))=16,\"\",VLOOKUP($A32,FB_27,2,0))&IF(TYPE(VLOOKUP($A32,FB_28,2,0))=16,\"\",VLOOKUP($A32,FB_28,2,0))&IF(TYPE(VLOOKUP($A32,FB_29,2,0))=16,\"\",VLOOKUP($A32,FB_29,2,0))&IF(TYPE(VLOOKUP($A32,FB_30,2,0))=16,\"\",VLOOKUP($A32,FB_30,2,0))","v":""},null,{"$f":"IF($B32=\"\",\"\",_xlfn.NUMBERVALUE(IF(TYPE(VLOOKUP($A32,FB_1,P$5,0))=16,\"\",VLOOKUP($A32,FB_1,P$5,0))&IF(TYPE(VLOOKUP($A32,FB_2,P$5,0))=16,\"\",VLOOKUP($A32,FB_2,P$5,0))&IF(TYPE(VLOOKUP($A32,FB_3,P$5,0))=16,\"\",VLOOKUP($A32,FB_3,P$5,0))&IF(TYPE(VLOOKUP($A32,FB_4,P$5,0))=16,\"\",VLOOKUP($A32,FB_4,P$5,0))&IF(TYPE(VLOOKUP($A32,FB_5,P$5,0))=16,\"\",VLOOKUP($A32,FB_5,P$5,0))&IF(TYPE(VLOOKUP($A32,FB_6,P$5,0))=16,\"\",VLOOKUP($A32,FB_6,P$5,0))&IF(TYPE(VLOOKUP($A32,FB_7,P$5,0))=16,\"\",VLOOKUP($A32,FB_7,P$5,0))&IF(TYPE(VLOOKUP($A32,FB_8,P$5,0))=16,\"\",VLOOKUP($A32,FB_8,P$5,0))&IF(TYPE(VLOOKUP($A32,FB_9,P$5,0))=16,\"\",VLOOKUP($A32,FB_9,P$5,0))&IF(TYPE(VLOOKUP($A32,FB_10,P$5,0))=16,\"\",VLOOKUP($A32,FB_10,P$5,0))&IF(TYPE(VLOOKUP($A32,FB_11,P$5,0))=16,\"\",VLOOKUP($A32,FB_11,P$5,0))&IF(TYPE(VLOOKUP($A32,FB_12,P$5,0))=16,\"\",VLOOKUP($A32,FB_12,P$5,0))&IF(TYPE(VLOOKUP($A32,FB_13,P$5,0))=16,\"\",VLOOKUP($A32,FB_13,P$5,0))&IF(TYPE(VLOOKUP($A32,FB_14,P$5,0))=16,\"\",VLOOKUP($A32,FB_14,P$5,0))&IF(TYPE(VLOOKUP($A32,FB_15,P$5,0))=16,\"\",VLOOKUP($A32,FB_15,P$5,0))&IF(TYPE(VLOOKUP($A32,FB_16,P$5,0))=16,\"\",VLOOKUP($A32,FB_16,P$5,0))&IF(TYPE(VLOOKUP($A32,FB_17,P$5,0))=16,\"\",VLOOKUP($A32,FB_17,P$5,0))&IF(TYPE(VLOOKUP($A32,FB_18,P$5,0))=16,\"\",VLOOKUP($A32,FB_18,P$5,0))&IF(TYPE(VLOOKUP($A32,FB_19,P$5,0))=16,\"\",VLOOKUP($A32,FB_19,P$5,0))&IF(TYPE(VLOOKUP($A32,FB_20,P$5,0))=16,\"\",VLOOKUP($A32,FB_20,P$5,0))&IF(TYPE(VLOOKUP($A32,FB_21,P$5,0))=16,\"\",VLOOKUP($A32,FB_21,P$5,0))&IF(TYPE(VLOOKUP($A32,FB_22,P$5,0))=16,\"\",VLOOKUP($A32,FB_22,P$5,0))&IF(TYPE(VLOOKUP($A32,FB_23,P$5,0))=16,\"\",VLOOKUP($A32,FB_23,P$5,0))&IF(TYPE(VLOOKUP($A32,FB_24,P$5,0))=16,\"\",VLOOKUP($A32,FB_24,P$5,0))&IF(TYPE(VLOOKUP($A32,FB_25,P$5,0))=16,\"\",VLOOKUP($A32,FB_25,P$5,0))&IF(TYPE(VLOOKUP($A32,FB_26,P$5,0))=16,\"\",VLOOKUP($A32,FB_26,P$5,0))&IF(TYPE(VLOOKUP($A32,FB_27,P$5,0))=16,\"\",VLOOKUP($A32,FB_27,P$5,0))&IF(TYPE(VLOOKUP($A32,FB_28,P$5,0))=16,\"\",VLOOKUP($A32,FB_28,P$5,0))&IF(TYPE(VLOOKUP($A32,FB_29,P$5,0))=16,\"\",VLOOKUP($A32,FB_29,P$5,0))&IF(TYPE(VLOOKUP($A32,FB_30,P$5,0))=16,\"\",VLOOKUP($A32,FB_30,P$5,0))))","v":""},"",{"$f":"IF($B32=\"\",\"\",_xlfn.NUMBERVALUE(IF(TYPE(VLOOKUP($A32,FB_1,R$5,0))=16,\"\",VLOOKUP($A32,FB_1,R$5,0))&IF(TYPE(VLOOKUP($A32,FB_2,R$5,0))=16,\"\",VLOOKUP($A32,FB_2,R$5,0))&IF(TYPE(VLOOKUP($A32,FB_3,R$5,0))=16,\"\",VLOOKUP($A32,FB_3,R$5,0))&IF(TYPE(VLOOKUP($A32,FB_4,R$5,0))=16,\"\",VLOOKUP($A32,FB_4,R$5,0))&IF(TYPE(VLOOKUP($A32,FB_5,R$5,0))=16,\"\",VLOOKUP($A32,FB_5,R$5,0))&IF(TYPE(VLOOKUP($A32,FB_6,R$5,0))=16,\"\",VLOOKUP($A32,FB_6,R$5,0))&IF(TYPE(VLOOKUP($A32,FB_7,R$5,0))=16,\"\",VLOOKUP($A32,FB_7,R$5,0))&IF(TYPE(VLOOKUP($A32,FB_8,R$5,0))=16,\"\",VLOOKUP($A32,FB_8,R$5,0))&IF(TYPE(VLOOKUP($A32,FB_9,R$5,0))=16,\"\",VLOOKUP($A32,FB_9,R$5,0))&IF(TYPE(VLOOKUP($A32,FB_10,R$5,0))=16,\"\",VLOOKUP($A32,FB_10,R$5,0))&IF(TYPE(VLOOKUP($A32,FB_11,R$5,0))=16,\"\",VLOOKUP($A32,FB_11,R$5,0))&IF(TYPE(VLOOKUP($A32,FB_12,R$5,0))=16,\"\",VLOOKUP($A32,FB_12,R$5,0))&IF(TYPE(VLOOKUP($A32,FB_13,R$5,0))=16,\"\",VLOOKUP($A32,FB_13,R$5,0))&IF(TYPE(VLOOKUP($A32,FB_14,R$5,0))=16,\"\",VLOOKUP($A32,FB_14,R$5,0))&IF(TYPE(VLOOKUP($A32,FB_15,R$5,0))=16,\"\",VLOOKUP($A32,FB_15,R$5,0))&IF(TYPE(VLOOKUP($A32,FB_16,R$5,0))=16,\"\",VLOOKUP($A32,FB_16,R$5,0))&IF(TYPE(VLOOKUP($A32,FB_17,R$5,0))=16,\"\",VLOOKUP($A32,FB_17,R$5,0))&IF(TYPE(VLOOKUP($A32,FB_18,R$5,0))=16,\"\",VLOOKUP($A32,FB_18,R$5,0))&IF(TYPE(VLOOKUP($A32,FB_19,R$5,0))=16,\"\",VLOOKUP($A32,FB_19,R$5,0))&IF(TYPE(VLOOKUP($A32,FB_20,R$5,0))=16,\"\",VLOOKUP($A32,FB_20,R$5,0))&IF(TYPE(VLOOKUP($A32,FB_21,R$5,0))=16,\"\",VLOOKUP($A32,FB_21,R$5,0))&IF(TYPE(VLOOKUP($A32,FB_22,R$5,0))=16,\"\",VLOOKUP($A32,FB_22,R$5,0))&IF(TYPE(VLOOKUP($A32,FB_23,R$5,0))=16,\"\",VLOOKUP($A32,FB_23,R$5,0))&IF(TYPE(VLOOKUP($A32,FB_24,R$5,0))=16,\"\",VLOOKUP($A32,FB_24,R$5,0))&IF(TYPE(VLOOKUP($A32,FB_25,R$5,0))=16,\"\",VLOOKUP($A32,FB_25,R$5,0))&IF(TYPE(VLOOKUP($A32,FB_26,R$5,0))=16,\"\",VLOOKUP($A32,FB_26,R$5,0))&IF(TYPE(VLOOKUP($A32,FB_27,R$5,0))=16,\"\",VLOOKUP($A32,FB_27,R$5,0))&IF(TYPE(VLOOKUP($A32,FB_28,R$5,0))=16,\"\",VLOOKUP($A32,FB_28,R$5,0))&IF(TYPE(VLOOKUP($A32,FB_29,R$5,0))=16,\"\",VLOOKUP($A32,FB_29,R$5,0))&IF(TYPE(VLOOKUP($A32,FB_30,R$5,0))=16,\"\",VLOOKUP($A32,FB_30,R$5,0))))","v":""},{"$f":"IF($B32=\"\",\"\",IF(TYPE(VLOOKUP($A32,FB_1,S$5,0))=16,\"\",VLOOKUP($A32,FB_1,S$5,0))&IF(TYPE(VLOOKUP($A32,FB_2,S$5,0))=16,\"\",VLOOKUP($A32,FB_2,S$5,0))&IF(TYPE(VLOOKUP($A32,FB_3,S$5,0))=16,\"\",VLOOKUP($A32,FB_3,S$5,0))&IF(TYPE(VLOOKUP($A32,FB_4,S$5,0))=16,\"\",VLOOKUP($A32,FB_4,S$5,0))&IF(TYPE(VLOOKUP($A32,FB_5,S$5,0))=16,\"\",VLOOKUP($A32,FB_5,S$5,0))&IF(TYPE(VLOOKUP($A32,FB_6,S$5,0))=16,\"\",VLOOKUP($A32,FB_6,S$5,0))&IF(TYPE(VLOOKUP($A32,FB_7,S$5,0))=16,\"\",VLOOKUP($A32,FB_7,S$5,0))&IF(TYPE(VLOOKUP($A32,FB_8,S$5,0))=16,\"\",VLOOKUP($A32,FB_8,S$5,0))&IF(TYPE(VLOOKUP($A32,FB_9,S$5,0))=16,\"\",VLOOKUP($A32,FB_9,S$5,0))&IF(TYPE(VLOOKUP($A32,FB_10,S$5,0))=16,\"\",VLOOKUP($A32,FB_10,S$5,0))&IF(TYPE(VLOOKUP($A32,FB_11,S$5,0))=16,\"\",VLOOKUP($A32,FB_11,S$5,0))&IF(TYPE(VLOOKUP($A32,FB_12,S$5,0))=16,\"\",VLOOKUP($A32,FB_12,S$5,0))&IF(TYPE(VLOOKUP($A32,FB_13,S$5,0))=16,\"\",VLOOKUP($A32,FB_13,S$5,0))&IF(TYPE(VLOOKUP($A32,FB_14,S$5,0))=16,\"\",VLOOKUP($A32,FB_14,S$5,0))&IF(TYPE(VLOOKUP($A32,FB_15,S$5,0))=16,\"\",VLOOKUP($A32,FB_15,S$5,0))&IF(TYPE(VLOOKUP($A32,FB_16,S$5,0))=16,\"\",VLOOKUP($A32,FB_16,S$5,0))&IF(TYPE(VLOOKUP($A32,FB_17,S$5,0))=16,\"\",VLOOKUP($A32,FB_17,S$5,0))&IF(TYPE(VLOOKUP($A32,FB_18,S$5,0))=16,\"\",VLOOKUP($A32,FB_18,S$5,0))&IF(TYPE(VLOOKUP($A32,FB_19,S$5,0))=16,\"\",VLOOKUP($A32,FB_19,S$5,0))&IF(TYPE(VLOOKUP($A32,FB_20,S$5,0))=16,\"\",VLOOKUP($A32,FB_20,S$5,0))&IF(TYPE(VLOOKUP($A32,FB_21,S$5,0))=16,\"\",VLOOKUP($A32,FB_21,S$5,0))&IF(TYPE(VLOOKUP($A32,FB_22,S$5,0))=16,\"\",VLOOKUP($A32,FB_22,S$5,0))&IF(TYPE(VLOOKUP($A32,FB_23,S$5,0))=16,\"\",VLOOKUP($A32,FB_23,S$5,0))&IF(TYPE(VLOOKUP($A32,FB_24,S$5,0))=16,\"\",VLOOKUP($A32,FB_24,S$5,0))&IF(TYPE(VLOOKUP($A32,FB_25,S$5,0))=16,\"\",VLOOKUP($A32,FB_25,S$5,0))&IF(TYPE(VLOOKUP($A32,FB_26,S$5,0))=16,\"\",VLOOKUP($A32,FB_26,S$5,0))&IF(TYPE(VLOOKUP($A32,FB_27,S$5,0))=16,\"\",VLOOKUP($A32,FB_27,S$5,0))&IF(TYPE(VLOOKUP($A32,FB_28,S$5,0))=16,\"\",VLOOKUP($A32,FB_28,S$5,0))&IF(TYPE(VLOOKUP($A32,FB_29,S$5,0))=16,\"\",VLOOKUP($A32,FB_29,S$5,0))&IF(TYPE(VLOOKUP($A32,FB_30,S$5,0))=16,\"\",VLOOKUP($A32,FB_30,S$5,0)))","v":""},null,null,null,null,null,null,null,null,null,null,null,null,null,null,null,null,"",":","","",""]
["4.",{"$f":"IF(TYPE(VLOOKUP($A33,FB_1,2,0))=16,\"\",VLOOKUP($A33,FB_1,2,0))&IF(TYPE(VLOOKUP($A33,FB_2,2,0))=16,\"\",VLOOKUP($A33,FB_2,2,0))&IF(TYPE(VLOOKUP($A33,FB_3,2,0))=16,\"\",VLOOKUP($A33,FB_3,2,0))&IF(TYPE(VLOOKUP($A33,FB_4,2,0))=16,\"\",VLOOKUP($A33,FB_4,2,0))&IF(TYPE(VLOOKUP($A33,FB_5,2,0))=16,\"\",VLOOKUP($A33,FB_5,2,0))&IF(TYPE(VLOOKUP($A33,FB_6,2,0))=16,\"\",VLOOKUP($A33,FB_6,2,0))&IF(TYPE(VLOOKUP($A33,FB_7,2,0))=16,\"\",VLOOKUP($A33,FB_7,2,0))&IF(TYPE(VLOOKUP($A33,FB_8,2,0))=16,\"\",VLOOKUP($A33,FB_8,2,0))&IF(TYPE(VLOOKUP($A33,FB_9,2,0))=16,\"\",VLOOKUP($A33,FB_9,2,0))&IF(TYPE(VLOOKUP($A33,FB_10,2,0))=16,\"\",VLOOKUP($A33,FB_10,2,0))&IF(TYPE(VLOOKUP($A33,FB_11,2,0))=16,\"\",VLOOKUP($A33,FB_11,2,0))&IF(TYPE(VLOOKUP($A33,FB_12,2,0))=16,\"\",VLOOKUP($A33,FB_12,2,0))&IF(TYPE(VLOOKUP($A33,FB_13,2,0))=16,\"\",VLOOKUP($A33,FB_13,2,0))&IF(TYPE(VLOOKUP($A33,FB_14,2,0))=16,\"\",VLOOKUP($A33,FB_14,2,0))&IF(TYPE(VLOOKUP($A33,FB_15,2,0))=16,\"\",VLOOKUP($A33,FB_15,2,0))&IF(TYPE(VLOOKUP($A33,FB_16,2,0))=16,\"\",VLOOKUP($A33,FB_16,2,0))&IF(TYPE(VLOOKUP($A33,FB_17,2,0))=16,\"\",VLOOKUP($A33,FB_17,2,0))&IF(TYPE(VLOOKUP($A33,FB_18,2,0))=16,\"\",VLOOKUP($A33,FB_18,2,0))&IF(TYPE(VLOOKUP($A33,FB_19,2,0))=16,\"\",VLOOKUP($A33,FB_19,2,0))&IF(TYPE(VLOOKUP($A33,FB_20,2,0))=16,\"\",VLOOKUP($A33,FB_20,2,0))&IF(TYPE(VLOOKUP($A33,FB_21,2,0))=16,\"\",VLOOKUP($A33,FB_21,2,0))&IF(TYPE(VLOOKUP($A33,FB_22,2,0))=16,\"\",VLOOKUP($A33,FB_22,2,0))&IF(TYPE(VLOOKUP($A33,FB_23,2,0))=16,\"\",VLOOKUP($A33,FB_23,2,0))&IF(TYPE(VLOOKUP($A33,FB_24,2,0))=16,\"\",VLOOKUP($A33,FB_24,2,0))&IF(TYPE(VLOOKUP($A33,FB_25,2,0))=16,\"\",VLOOKUP($A33,FB_25,2,0))&IF(TYPE(VLOOKUP($A33,FB_26,2,0))=16,\"\",VLOOKUP($A33,FB_26,2,0))&IF(TYPE(VLOOKUP($A33,FB_27,2,0))=16,\"\",VLOOKUP($A33,FB_27,2,0))&IF(TYPE(VLOOKUP($A33,FB_28,2,0))=16,\"\",VLOOKUP($A33,FB_28,2,0))&IF(TYPE(VLOOKUP($A33,FB_29,2,0))=16,\"\",VLOOKUP($A33,FB_29,2,0))&IF(TYPE(VLOOKUP($A33,FB_30,2,0))=16,\"\",VLOOKUP($A33,FB_30,2,0))","v":""},null,{"$f":"IF($B33=\"\",\"\",_xlfn.NUMBERVALUE(IF(TYPE(VLOOKUP($A33,FB_1,P$5,0))=16,\"\",VLOOKUP($A33,FB_1,P$5,0))&IF(TYPE(VLOOKUP($A33,FB_2,P$5,0))=16,\"\",VLOOKUP($A33,FB_2,P$5,0))&IF(TYPE(VLOOKUP($A33,FB_3,P$5,0))=16,\"\",VLOOKUP($A33,FB_3,P$5,0))&IF(TYPE(VLOOKUP($A33,FB_4,P$5,0))=16,\"\",VLOOKUP($A33,FB_4,P$5,0))&IF(TYPE(VLOOKUP($A33,FB_5,P$5,0))=16,\"\",VLOOKUP($A33,FB_5,P$5,0))&IF(TYPE(VLOOKUP($A33,FB_6,P$5,0))=16,\"\",VLOOKUP($A33,FB_6,P$5,0))&IF(TYPE(VLOOKUP($A33,FB_7,P$5,0))=16,\"\",VLOOKUP($A33,FB_7,P$5,0))&IF(TYPE(VLOOKUP($A33,FB_8,P$5,0))=16,\"\",VLOOKUP($A33,FB_8,P$5,0))&IF(TYPE(VLOOKUP($A33,FB_9,P$5,0))=16,\"\",VLOOKUP($A33,FB_9,P$5,0))&IF(TYPE(VLOOKUP($A33,FB_10,P$5,0))=16,\"\",VLOOKUP($A33,FB_10,P$5,0))&IF(TYPE(VLOOKUP($A33,FB_11,P$5,0))=16,\"\",VLOOKUP($A33,FB_11,P$5,0))&IF(TYPE(VLOOKUP($A33,FB_12,P$5,0))=16,\"\",VLOOKUP($A33,FB_12,P$5,0))&IF(TYPE(VLOOKUP($A33,FB_13,P$5,0))=16,\"\",VLOOKUP($A33,FB_13,P$5,0))&IF(TYPE(VLOOKUP($A33,FB_14,P$5,0))=16,\"\",VLOOKUP($A33,FB_14,P$5,0))&IF(TYPE(VLOOKUP($A33,FB_15,P$5,0))=16,\"\",VLOOKUP($A33,FB_15,P$5,0))&IF(TYPE(VLOOKUP($A33,FB_16,P$5,0))=16,\"\",VLOOKUP($A33,FB_16,P$5,0))&IF(TYPE(VLOOKUP($A33,FB_17,P$5,0))=16,\"\",VLOOKUP($A33,FB_17,P$5,0))&IF(TYPE(VLOOKUP($A33,FB_18,P$5,0))=16,\"\",VLOOKUP($A33,FB_18,P$5,0))&IF(TYPE(VLOOKUP($A33,FB_19,P$5,0))=16,\"\",VLOOKUP($A33,FB_19,P$5,0))&IF(TYPE(VLOOKUP($A33,FB_20,P$5,0))=16,\"\",VLOOKUP($A33,FB_20,P$5,0))&IF(TYPE(VLOOKUP($A33,FB_21,P$5,0))=16,\"\",VLOOKUP($A33,FB_21,P$5,0))&IF(TYPE(VLOOKUP($A33,FB_22,P$5,0))=16,\"\",VLOOKUP($A33,FB_22,P$5,0))&IF(TYPE(VLOOKUP($A33,FB_23,P$5,0))=16,\"\",VLOOKUP($A33,FB_23,P$5,0))&IF(TYPE(VLOOKUP($A33,FB_24,P$5,0))=16,\"\",VLOOKUP($A33,FB_24,P$5,0))&IF(TYPE(VLOOKUP($A33,FB_25,P$5,0))=16,\"\",VLOOKUP($A33,FB_25,P$5,0))&IF(TYPE(VLOOKUP($A33,FB_26,P$5,0))=16,\"\",VLOOKUP($A33,FB_26,P$5,0))&IF(TYPE(VLOOKUP($A33,FB_27,P$5,0))=16,\"\",VLOOKUP($A33,FB_27,P$5,0))&IF(TYPE(VLOOKUP($A33,FB_28,P$5,0))=16,\"\",VLOOKUP($A33,FB_28,P$5,0))&IF(TYPE(VLOOKUP($A33,FB_29,P$5,0))=16,\"\",VLOOKUP($A33,FB_29,P$5,0))&IF(TYPE(VLOOKUP($A33,FB_30,P$5,0))=16,\"\",VLOOKUP($A33,FB_30,P$5,0))))","v":""},"",{"$f":"IF($B33=\"\",\"\",_xlfn.NUMBERVALUE(IF(TYPE(VLOOKUP($A33,FB_1,R$5,0))=16,\"\",VLOOKUP($A33,FB_1,R$5,0))&IF(TYPE(VLOOKUP($A33,FB_2,R$5,0))=16,\"\",VLOOKUP($A33,FB_2,R$5,0))&IF(TYPE(VLOOKUP($A33,FB_3,R$5,0))=16,\"\",VLOOKUP($A33,FB_3,R$5,0))&IF(TYPE(VLOOKUP($A33,FB_4,R$5,0))=16,\"\",VLOOKUP($A33,FB_4,R$5,0))&IF(TYPE(VLOOKUP($A33,FB_5,R$5,0))=16,\"\",VLOOKUP($A33,FB_5,R$5,0))&IF(TYPE(VLOOKUP($A33,FB_6,R$5,0))=16,\"\",VLOOKUP($A33,FB_6,R$5,0))&IF(TYPE(VLOOKUP($A33,FB_7,R$5,0))=16,\"\",VLOOKUP($A33,FB_7,R$5,0))&IF(TYPE(VLOOKUP($A33,FB_8,R$5,0))=16,\"\",VLOOKUP($A33,FB_8,R$5,0))&IF(TYPE(VLOOKUP($A33,FB_9,R$5,0))=16,\"\",VLOOKUP($A33,FB_9,R$5,0))&IF(TYPE(VLOOKUP($A33,FB_10,R$5,0))=16,\"\",VLOOKUP($A33,FB_10,R$5,0))&IF(TYPE(VLOOKUP($A33,FB_11,R$5,0))=16,\"\",VLOOKUP($A33,FB_11,R$5,0))&IF(TYPE(VLOOKUP($A33,FB_12,R$5,0))=16,\"\",VLOOKUP($A33,FB_12,R$5,0))&IF(TYPE(VLOOKUP($A33,FB_13,R$5,0))=16,\"\",VLOOKUP($A33,FB_13,R$5,0))&IF(TYPE(VLOOKUP($A33,FB_14,R$5,0))=16,\"\",VLOOKUP($A33,FB_14,R$5,0))&IF(TYPE(VLOOKUP($A33,FB_15,R$5,0))=16,\"\",VLOOKUP($A33,FB_15,R$5,0))&IF(TYPE(VLOOKUP($A33,FB_16,R$5,0))=16,\"\",VLOOKUP($A33,FB_16,R$5,0))&IF(TYPE(VLOOKUP($A33,FB_17,R$5,0))=16,\"\",VLOOKUP($A33,FB_17,R$5,0))&IF(TYPE(VLOOKUP($A33,FB_18,R$5,0))=16,\"\",VLOOKUP($A33,FB_18,R$5,0))&IF(TYPE(VLOOKUP($A33,FB_19,R$5,0))=16,\"\",VLOOKUP($A33,FB_19,R$5,0))&IF(TYPE(VLOOKUP($A33,FB_20,R$5,0))=16,\"\",VLOOKUP($A33,FB_20,R$5,0))&IF(TYPE(VLOOKUP($A33,FB_21,R$5,0))=16,\"\",VLOOKUP($A33,FB_21,R$5,0))&IF(TYPE(VLOOKUP($A33,FB_22,R$5,0))=16,\"\",VLOOKUP($A33,FB_22,R$5,0))&IF(TYPE(VLOOKUP($A33,FB_23,R$5,0))=16,\"\",VLOOKUP($A33,FB_23,R$5,0))&IF(TYPE(VLOOKUP($A33,FB_24,R$5,0))=16,\"\",VLOOKUP($A33,FB_24,R$5,0))&IF(TYPE(VLOOKUP($A33,FB_25,R$5,0))=16,\"\",VLOOKUP($A33,FB_25,R$5,0))&IF(TYPE(VLOOKUP($A33,FB_26,R$5,0))=16,\"\",VLOOKUP($A33,FB_26,R$5,0))&IF(TYPE(VLOOKUP($A33,FB_27,R$5,0))=16,\"\",VLOOKUP($A33,FB_27,R$5,0))&IF(TYPE(VLOOKUP($A33,FB_28,R$5,0))=16,\"\",VLOOKUP($A33,FB_28,R$5,0))&IF(TYPE(VLOOKUP($A33,FB_29,R$5,0))=16,\"\",VLOOKUP($A33,FB_29,R$5,0))&IF(TYPE(VLOOKUP($A33,FB_30,R$5,0))=16,\"\",VLOOKUP($A33,FB_30,R$5,0))))","v":""},{"$f":"IF($B33=\"\",\"\",IF(TYPE(VLOOKUP($A33,FB_1,S$5,0))=16,\"\",VLOOKUP($A33,FB_1,S$5,0))&IF(TYPE(VLOOKUP($A33,FB_2,S$5,0))=16,\"\",VLOOKUP($A33,FB_2,S$5,0))&IF(TYPE(VLOOKUP($A33,FB_3,S$5,0))=16,\"\",VLOOKUP($A33,FB_3,S$5,0))&IF(TYPE(VLOOKUP($A33,FB_4,S$5,0))=16,\"\",VLOOKUP($A33,FB_4,S$5,0))&IF(TYPE(VLOOKUP($A33,FB_5,S$5,0))=16,\"\",VLOOKUP($A33,FB_5,S$5,0))&IF(TYPE(VLOOKUP($A33,FB_6,S$5,0))=16,\"\",VLOOKUP($A33,FB_6,S$5,0))&IF(TYPE(VLOOKUP($A33,FB_7,S$5,0))=16,\"\",VLOOKUP($A33,FB_7,S$5,0))&IF(TYPE(VLOOKUP($A33,FB_8,S$5,0))=16,\"\",VLOOKUP($A33,FB_8,S$5,0))&IF(TYPE(VLOOKUP($A33,FB_9,S$5,0))=16,\"\",VLOOKUP($A33,FB_9,S$5,0))&IF(TYPE(VLOOKUP($A33,FB_10,S$5,0))=16,\"\",VLOOKUP($A33,FB_10,S$5,0))&IF(TYPE(VLOOKUP($A33,FB_11,S$5,0))=16,\"\",VLOOKUP($A33,FB_11,S$5,0))&IF(TYPE(VLOOKUP($A33,FB_12,S$5,0))=16,\"\",VLOOKUP($A33,FB_12,S$5,0))&IF(TYPE(VLOOKUP($A33,FB_13,S$5,0))=16,\"\",VLOOKUP($A33,FB_13,S$5,0))&IF(TYPE(VLOOKUP($A33,FB_14,S$5,0))=16,\"\",VLOOKUP($A33,FB_14,S$5,0))&IF(TYPE(VLOOKUP($A33,FB_15,S$5,0))=16,\"\",VLOOKUP($A33,FB_15,S$5,0))&IF(TYPE(VLOOKUP($A33,FB_16,S$5,0))=16,\"\",VLOOKUP($A33,FB_16,S$5,0))&IF(TYPE(VLOOKUP($A33,FB_17,S$5,0))=16,\"\",VLOOKUP($A33,FB_17,S$5,0))&IF(TYPE(VLOOKUP($A33,FB_18,S$5,0))=16,\"\",VLOOKUP($A33,FB_18,S$5,0))&IF(TYPE(VLOOKUP($A33,FB_19,S$5,0))=16,\"\",VLOOKUP($A33,FB_19,S$5,0))&IF(TYPE(VLOOKUP($A33,FB_20,S$5,0))=16,\"\",VLOOKUP($A33,FB_20,S$5,0))&IF(TYPE(VLOOKUP($A33,FB_21,S$5,0))=16,\"\",VLOOKUP($A33,FB_21,S$5,0))&IF(TYPE(VLOOKUP($A33,FB_22,S$5,0))=16,\"\",VLOOKUP($A33,FB_22,S$5,0))&IF(TYPE(VLOOKUP($A33,FB_23,S$5,0))=16,\"\",VLOOKUP($A33,FB_23,S$5,0))&IF(TYPE(VLOOKUP($A33,FB_24,S$5,0))=16,\"\",VLOOKUP($A33,FB_24,S$5,0))&IF(TYPE(VLOOKUP($A33,FB_25,S$5,0))=16,\"\",VLOOKUP($A33,FB_25,S$5,0))&IF(TYPE(VLOOKUP($A33,FB_26,S$5,0))=16,\"\",VLOOKUP($A33,FB_26,S$5,0))&IF(TYPE(VLOOKUP($A33,FB_27,S$5,0))=16,\"\",VLOOKUP($A33,FB_27,S$5,0))&IF(TYPE(VLOOKUP($A33,FB_28,S$5,0))=16,\"\",VLOOKUP($A33,FB_28,S$5,0))&IF(TYPE(VLOOKUP($A33,FB_29,S$5,0))=16,\"\",VLOOKUP($A33,FB_29,S$5,0))&IF(TYPE(VLOOKUP($A33,FB_30,S$5,0))=16,\"\",VLOOKUP($A33,FB_30,S$5,0)))","v":""},null,null,null,null,null,null,null,null,null,null,null,null,null,null,null,null,"",":","","",""]
["5.",{"$f":"IF(TYPE(VLOOKUP($A34,FB_1,2,0))=16,\"\",VLOOKUP($A34,FB_1,2,0))&IF(TYPE(VLOOKUP($A34,FB_2,2,0))=16,\"\",VLOOKUP($A34,FB_2,2,0))&IF(TYPE(VLOOKUP($A34,FB_3,2,0))=16,\"\",VLOOKUP($A34,FB_3,2,0))&IF(TYPE(VLOOKUP($A34,FB_4,2,0))=16,\"\",VLOOKUP($A34,FB_4,2,0))&IF(TYPE(VLOOKUP($A34,FB_5,2,0))=16,\"\",VLOOKUP($A34,FB_5,2,0))&IF(TYPE(VLOOKUP($A34,FB_6,2,0))=16,\"\",VLOOKUP($A34,FB_6,2,0))&IF(TYPE(VLOOKUP($A34,FB_7,2,0))=16,\"\",VLOOKUP($A34,FB_7,2,0))&IF(TYPE(VLOOKUP($A34,FB_8,2,0))=16,\"\",VLOOKUP($A34,FB_8,2,0))&IF(TYPE(VLOOKUP($A34,FB_9,2,0))=16,\"\",VLOOKUP($A34,FB_9,2,0))&IF(TYPE(VLOOKUP($A34,FB_10,2,0))=16,\"\",VLOOKUP($A34,FB_10,2,0))&IF(TYPE(VLOOKUP($A34,FB_11,2,0))=16,\"\",VLOOKUP($A34,FB_11,2,0))&IF(TYPE(VLOOKUP($A34,FB_12,2,0))=16,\"\",VLOOKUP($A34,FB_12,2,0))&IF(TYPE(VLOOKUP($A34,FB_13,2,0))=16,\"\",VLOOKUP($A34,FB_13,2,0))&IF(TYPE(VLOOKUP($A34,FB_14,2,0))=16,\"\",VLOOKUP($A34,FB_14,2,0))&IF(TYPE(VLOOKUP($A34,FB_15,2,0))=16,\"\",VLOOKUP($A34,FB_15,2,0))&IF(TYPE(VLOOKUP($A34,FB_16,2,0))=16,\"\",VLOOKUP($A34,FB_16,2,0))&IF(TYPE(VLOOKUP($A34,FB_17,2,0))=16,\"\",VLOOKUP($A34,FB_17,2,0))&IF(TYPE(VLOOKUP($A34,FB_18,2,0))=16,\"\",VLOOKUP($A34,FB_18,2,0))&IF(TYPE(VLOOKUP($A34,FB_19,2,0))=16,\"\",VLOOKUP($A34,FB_19,2,0))&IF(TYPE(VLOOKUP($A34,FB_20,2,0))=16,\"\",VLOOKUP($A34,FB_20,2,0))&IF(TYPE(VLOOKUP($A34,FB_21,2,0))=16,\"\",VLOOKUP($A34,FB_21,2,0))&IF(TYPE(VLOOKUP($A34,FB_22,2,0))=16,\"\",VLOOKUP($A34,FB_22,2,0))&IF(TYPE(VLOOKUP($A34,FB_23,2,0))=16,\"\",VLOOKUP($A34,FB_23,2,0))&IF(TYPE(VLOOKUP($A34,FB_24,2,0))=16,\"\",VLOOKUP($A34,FB_24,2,0))&IF(TYPE(VLOOKUP($A34,FB_25,2,0))=16,\"\",VLOOKUP($A34,FB_25,2,0))&IF(TYPE(VLOOKUP($A34,FB_26,2,0))=16,\"\",VLOOKUP($A34,FB_26,2,0))&IF(TYPE(VLOOKUP($A34,FB_27,2,0))=16,\"\",VLOOKUP($A34,FB_27,2,0))&IF(TYPE(VLOOKUP($A34,FB_28,2,0))=16,\"\",VLOOKUP($A34,FB_28,2,0))&IF(TYPE(VLOOKUP($A34,FB_29,2,0))=16,\"\",VLOOKUP($A34,FB_29,2,0))&IF(TYPE(VLOOKUP($A34,FB_30,2,0))=16,\"\",VLOOKUP($A34,FB_30,2,0))","v":""},null,{"$f":"IF($B34=\"\",\"\",_xlfn.NUMBERVALUE(IF(TYPE(VLOOKUP($A34,FB_1,P$5,0))=16,\"\",VLOOKUP($A34,FB_1,P$5,0))&IF(TYPE(VLOOKUP($A34,FB_2,P$5,0))=16,\"\",VLOOKUP($A34,FB_2,P$5,0))&IF(TYPE(VLOOKUP($A34,FB_3,P$5,0))=16,\"\",VLOOKUP($A34,FB_3,P$5,0))&IF(TYPE(VLOOKUP($A34,FB_4,P$5,0))=16,\"\",VLOOKUP($A34,FB_4,P$5,0))&IF(TYPE(VLOOKUP($A34,FB_5,P$5,0))=16,\"\",VLOOKUP($A34,FB_5,P$5,0))&IF(TYPE(VLOOKUP($A34,FB_6,P$5,0))=16,\"\",VLOOKUP($A34,FB_6,P$5,0))&IF(TYPE(VLOOKUP($A34,FB_7,P$5,0))=16,\"\",VLOOKUP($A34,FB_7,P$5,0))&IF(TYPE(VLOOKUP($A34,FB_8,P$5,0))=16,\"\",VLOOKUP($A34,FB_8,P$5,0))&IF(TYPE(VLOOKUP($A34,FB_9,P$5,0))=16,\"\",VLOOKUP($A34,FB_9,P$5,0))&IF(TYPE(VLOOKUP($A34,FB_10,P$5,0))=16,\"\",VLOOKUP($A34,FB_10,P$5,0))&IF(TYPE(VLOOKUP($A34,FB_11,P$5,0))=16,\"\",VLOOKUP($A34,FB_11,P$5,0))&IF(TYPE(VLOOKUP($A34,FB_12,P$5,0))=16,\"\",VLOOKUP($A34,FB_12,P$5,0))&IF(TYPE(VLOOKUP($A34,FB_13,P$5,0))=16,\"\",VLOOKUP($A34,FB_13,P$5,0))&IF(TYPE(VLOOKUP($A34,FB_14,P$5,0))=16,\"\",VLOOKUP($A34,FB_14,P$5,0))&IF(TYPE(VLOOKUP($A34,FB_15,P$5,0))=16,\"\",VLOOKUP($A34,FB_15,P$5,0))&IF(TYPE(VLOOKUP($A34,FB_16,P$5,0))=16,\"\",VLOOKUP($A34,FB_16,P$5,0))&IF(TYPE(VLOOKUP($A34,FB_17,P$5,0))=16,\"\",VLOOKUP($A34,FB_17,P$5,0))&IF(TYPE(VLOOKUP($A34,FB_18,P$5,0))=16,\"\",VLOOKUP($A34,FB_18,P$5,0))&IF(TYPE(VLOOKUP($A34,FB_19,P$5,0))=16,\"\",VLOOKUP($A34,FB_19,P$5,0))&IF(TYPE(VLOOKUP($A34,FB_20,P$5,0))=16,\"\",VLOOKUP($A34,FB_20,P$5,0))&IF(TYPE(VLOOKUP($A34,FB_21,P$5,0))=16,\"\",VLOOKUP($A34,FB_21,P$5,0))&IF(TYPE(VLOOKUP($A34,FB_22,P$5,0))=16,\"\",VLOOKUP($A34,FB_22,P$5,0))&IF(TYPE(VLOOKUP($A34,FB_23,P$5,0))=16,\"\",VLOOKUP($A34,FB_23,P$5,0))&IF(TYPE(VLOOKUP($A34,FB_24,P$5,0))=16,\"\",VLOOKUP($A34,FB_24,P$5,0))&IF(TYPE(VLOOKUP($A34,FB_25,P$5,0))=16,\"\",VLOOKUP($A34,FB_25,P$5,0))&IF(TYPE(VLOOKUP($A34,FB_26,P$5,0))=16,\"\",VLOOKUP($A34,FB_26,P$5,0))&IF(TYPE(VLOOKUP($A34,FB_27,P$5,0))=16,\"\",VLOOKUP($A34,FB_27,P$5,0))&IF(TYPE(VLOOKUP($A34,FB_28,P$5,0))=16,\"\",VLOOKUP($A34,FB_28,P$5,0))&IF(TYPE(VLOOKUP($A34,FB_29,P$5,0))=16,\"\",VLOOKUP($A34,FB_29,P$5,0))&IF(TYPE(VLOOKUP($A34,FB_30,P$5,0))=16,\"\",VLOOKUP($A34,FB_30,P$5,0))))","v":""},"",{"$f":"IF($B34=\"\",\"\",_xlfn.NUMBERVALUE(IF(TYPE(VLOOKUP($A34,FB_1,R$5,0))=16,\"\",VLOOKUP($A34,FB_1,R$5,0))&IF(TYPE(VLOOKUP($A34,FB_2,R$5,0))=16,\"\",VLOOKUP($A34,FB_2,R$5,0))&IF(TYPE(VLOOKUP($A34,FB_3,R$5,0))=16,\"\",VLOOKUP($A34,FB_3,R$5,0))&IF(TYPE(VLOOKUP($A34,FB_4,R$5,0))=16,\"\",VLOOKUP($A34,FB_4,R$5,0))&IF(TYPE(VLOOKUP($A34,FB_5,R$5,0))=16,\"\",VLOOKUP($A34,FB_5,R$5,0))&IF(TYPE(VLOOKUP($A34,FB_6,R$5,0))=16,\"\",VLOOKUP($A34,FB_6,R$5,0))&IF(TYPE(VLOOKUP($A34,FB_7,R$5,0))=16,\"\",VLOOKUP($A34,FB_7,R$5,0))&IF(TYPE(VLOOKUP($A34,FB_8,R$5,0))=16,\"\",VLOOKUP($A34,FB_8,R$5,0))&IF(TYPE(VLOOKUP($A34,FB_9,R$5,0))=16,\"\",VLOOKUP($A34,FB_9,R$5,0))&IF(TYPE(VLOOKUP($A34,FB_10,R$5,0))=16,\"\",VLOOKUP($A34,FB_10,R$5,0))&IF(TYPE(VLOOKUP($A34,FB_11,R$5,0))=16,\"\",VLOOKUP($A34,FB_11,R$5,0))&IF(TYPE(VLOOKUP($A34,FB_12,R$5,0))=16,\"\",VLOOKUP($A34,FB_12,R$5,0))&IF(TYPE(VLOOKUP($A34,FB_13,R$5,0))=16,\"\",VLOOKUP($A34,FB_13,R$5,0))&IF(TYPE(VLOOKUP($A34,FB_14,R$5,0))=16,\"\",VLOOKUP($A34,FB_14,R$5,0))&IF(TYPE(VLOOKUP($A34,FB_15,R$5,0))=16,\"\",VLOOKUP($A34,FB_15,R$5,0))&IF(TYPE(VLOOKUP($A34,FB_16,R$5,0))=16,\"\",VLOOKUP($A34,FB_16,R$5,0))&IF(TYPE(VLOOKUP($A34,FB_17,R$5,0))=16,\"\",VLOOKUP($A34,FB_17,R$5,0))&IF(TYPE(VLOOKUP($A34,FB_18,R$5,0))=16,\"\",VLOOKUP($A34,FB_18,R$5,0))&IF(TYPE(VLOOKUP($A34,FB_19,R$5,0))=16,\"\",VLOOKUP($A34,FB_19,R$5,0))&IF(TYPE(VLOOKUP($A34,FB_20,R$5,0))=16,\"\",VLOOKUP($A34,FB_20,R$5,0))&IF(TYPE(VLOOKUP($A34,FB_21,R$5,0))=16,\"\",VLOOKUP($A34,FB_21,R$5,0))&IF(TYPE(VLOOKUP($A34,FB_22,R$5,0))=16,\"\",VLOOKUP($A34,FB_22,R$5,0))&IF(TYPE(VLOOKUP($A34,FB_23,R$5,0))=16,\"\",VLOOKUP($A34,FB_23,R$5,0))&IF(TYPE(VLOOKUP($A34,FB_24,R$5,0))=16,\"\",VLOOKUP($A34,FB_24,R$5,0))&IF(TYPE(VLOOKUP($A34,FB_25,R$5,0))=16,\"\",VLOOKUP($A34,FB_25,R$5,0))&IF(TYPE(VLOOKUP($A34,FB_26,R$5,0))=16,\"\",VLOOKUP($A34,FB_26,R$5,0))&IF(TYPE(VLOOKUP($A34,FB_27,R$5,0))=16,\"\",VLOOKUP($A34,FB_27,R$5,0))&IF(TYPE(VLOOKUP($A34,FB_28,R$5,0))=16,\"\",VLOOKUP($A34,FB_28,R$5,0))&IF(TYPE(VLOOKUP($A34,FB_29,R$5,0))=16,\"\",VLOOKUP($A34,FB_29,R$5,0))&IF(TYPE(VLOOKUP($A34,FB_30,R$5,0))=16,\"\",VLOOKUP($A34,FB_30,R$5,0))))","v":""},{"$f":"IF($B34=\"\",\"\",IF(TYPE(VLOOKUP($A34,FB_1,S$5,0))=16,\"\",VLOOKUP($A34,FB_1,S$5,0))&IF(TYPE(VLOOKUP($A34,FB_2,S$5,0))=16,\"\",VLOOKUP($A34,FB_2,S$5,0))&IF(TYPE(VLOOKUP($A34,FB_3,S$5,0))=16,\"\",VLOOKUP($A34,FB_3,S$5,0))&IF(TYPE(VLOOKUP($A34,FB_4,S$5,0))=16,\"\",VLOOKUP($A34,FB_4,S$5,0))&IF(TYPE(VLOOKUP($A34,FB_5,S$5,0))=16,\"\",VLOOKUP($A34,FB_5,S$5,0))&IF(TYPE(VLOOKUP($A34,FB_6,S$5,0))=16,\"\",VLOOKUP($A34,FB_6,S$5,0))&IF(TYPE(VLOOKUP($A34,FB_7,S$5,0))=16,\"\",VLOOKUP($A34,FB_7,S$5,0))&IF(TYPE(VLOOKUP($A34,FB_8,S$5,0))=16,\"\",VLOOKUP($A34,FB_8,S$5,0))&IF(TYPE(VLOOKUP($A34,FB_9,S$5,0))=16,\"\",VLOOKUP($A34,FB_9,S$5,0))&IF(TYPE(VLOOKUP($A34,FB_10,S$5,0))=16,\"\",VLOOKUP($A34,FB_10,S$5,0))&IF(TYPE(VLOOKUP($A34,FB_11,S$5,0))=16,\"\",VLOOKUP($A34,FB_11,S$5,0))&IF(TYPE(VLOOKUP($A34,FB_12,S$5,0))=16,\"\",VLOOKUP($A34,FB_12,S$5,0))&IF(TYPE(VLOOKUP($A34,FB_13,S$5,0))=16,\"\",VLOOKUP($A34,FB_13,S$5,0))&IF(TYPE(VLOOKUP($A34,FB_14,S$5,0))=16,\"\",VLOOKUP($A34,FB_14,S$5,0))&IF(TYPE(VLOOKUP($A34,FB_15,S$5,0))=16,\"\",VLOOKUP($A34,FB_15,S$5,0))&IF(TYPE(VLOOKUP($A34,FB_16,S$5,0))=16,\"\",VLOOKUP($A34,FB_16,S$5,0))&IF(TYPE(VLOOKUP($A34,FB_17,S$5,0))=16,\"\",VLOOKUP($A34,FB_17,S$5,0))&IF(TYPE(VLOOKUP($A34,FB_18,S$5,0))=16,\"\",VLOOKUP($A34,FB_18,S$5,0))&IF(TYPE(VLOOKUP($A34,FB_19,S$5,0))=16,\"\",VLOOKUP($A34,FB_19,S$5,0))&IF(TYPE(VLOOKUP($A34,FB_20,S$5,0))=16,\"\",VLOOKUP($A34,FB_20,S$5,0))&IF(TYPE(VLOOKUP($A34,FB_21,S$5,0))=16,\"\",VLOOKUP($A34,FB_21,S$5,0))&IF(TYPE(VLOOKUP($A34,FB_22,S$5,0))=16,\"\",VLOOKUP($A34,FB_22,S$5,0))&IF(TYPE(VLOOKUP($A34,FB_23,S$5,0))=16,\"\",VLOOKUP($A34,FB_23,S$5,0))&IF(TYPE(VLOOKUP($A34,FB_24,S$5,0))=16,\"\",VLOOKUP($A34,FB_24,S$5,0))&IF(TYPE(VLOOKUP($A34,FB_25,S$5,0))=16,\"\",VLOOKUP($A34,FB_25,S$5,0))&IF(TYPE(VLOOKUP($A34,FB_26,S$5,0))=16,\"\",VLOOKUP($A34,FB_26,S$5,0))&IF(TYPE(VLOOKUP($A34,FB_27,S$5,0))=16,\"\",VLOOKUP($A34,FB_27,S$5,0))&IF(TYPE(VLOOKUP($A34,FB_28,S$5,0))=16,\"\",VLOOKUP($A34,FB_28,S$5,0))&IF(TYPE(VLOOKUP($A34,FB_29,S$5,0))=16,\"\",VLOOKUP($A34,FB_29,S$5,0))&IF(TYPE(VLOOKUP($A34,FB_30,S$5,0))=16,\"\",VLOOKUP($A34,FB_30,S$5,0)))","v":""},null,null,null,null,null,null,null,null,null,null,null,null,null,null,null,null,"",":","","",""]
["6.",{"$f":"IF(TYPE(VLOOKUP($A35,FB_1,2,0))=16,\"\",VLOOKUP($A35,FB_1,2,0))&IF(TYPE(VLOOKUP($A35,FB_2,2,0))=16,\"\",VLOOKUP($A35,FB_2,2,0))&IF(TYPE(VLOOKUP($A35,FB_3,2,0))=16,\"\",VLOOKUP($A35,FB_3,2,0))&IF(TYPE(VLOOKUP($A35,FB_4,2,0))=16,\"\",VLOOKUP($A35,FB_4,2,0))&IF(TYPE(VLOOKUP($A35,FB_5,2,0))=16,\"\",VLOOKUP($A35,FB_5,2,0))&IF(TYPE(VLOOKUP($A35,FB_6,2,0))=16,\"\",VLOOKUP($A35,FB_6,2,0))&IF(TYPE(VLOOKUP($A35,FB_7,2,0))=16,\"\",VLOOKUP($A35,FB_7,2,0))&IF(TYPE(VLOOKUP($A35,FB_8,2,0))=16,\"\",VLOOKUP($A35,FB_8,2,0))&IF(TYPE(VLOOKUP($A35,FB_9,2,0))=16,\"\",VLOOKUP($A35,FB_9,2,0))&IF(TYPE(VLOOKUP($A35,FB_10,2,0))=16,\"\",VLOOKUP($A35,FB_10,2,0))&IF(TYPE(VLOOKUP($A35,FB_11,2,0))=16,\"\",VLOOKUP($A35,FB_11,2,0))&IF(TYPE(VLOOKUP($A35,FB_12,2,0))=16,\"\",VLOOKUP($A35,FB_12,2,0))&IF(TYPE(VLOOKUP($A35,FB_13,2,0))=16,\"\",VLOOKUP($A35,FB_13,2,0))&IF(TYPE(VLOOKUP($A35,FB_14,2,0))=16,\"\",VLOOKUP($A35,FB_14,2,0))&IF(TYPE(VLOOKUP($A35,FB_15,2,0))=16,\"\",VLOOKUP($A35,FB_15,2,0))&IF(TYPE(VLOOKUP($A35,FB_16,2,0))=16,\"\",VLOOKUP($A35,FB_16,2,0))&IF(TYPE(VLOOKUP($A35,FB_17,2,0))=16,\"\",VLOOKUP($A35,FB_17,2,0))&IF(TYPE(VLOOKUP($A35,FB_18,2,0))=16,\"\",VLOOKUP($A35,FB_18,2,0))&IF(TYPE(VLOOKUP($A35,FB_19,2,0))=16,\"\",VLOOKUP($A35,FB_19,2,0))&IF(TYPE(VLOOKUP($A35,FB_20,2,0))=16,\"\",VLOOKUP($A35,FB_20,2,0))&IF(TYPE(VLOOKUP($A35,FB_21,2,0))=16,\"\",VLOOKUP($A35,FB_21,2,0))&IF(TYPE(VLOOKUP($A35,FB_22,2,0))=16,\"\",VLOOKUP($A35,FB_22,2,0))&IF(TYPE(VLOOKUP($A35,FB_23,2,0))=16,\"\",VLOOKUP($A35,FB_23,2,0))&IF(TYPE(VLOOKUP($A35,FB_24,2,0))=16,\"\",VLOOKUP($A35,FB_24,2,0))&IF(TYPE(VLOOKUP($A35,FB_25,2,0))=16,\"\",VLOOKUP($A35,FB_25,2,0))&IF(TYPE(VLOOKUP($A35,FB_26,2,0))=16,\"\",VLOOKUP($A35,FB_26,2,0))&IF(TYPE(VLOOKUP($A35,FB_27,2,0))=16,\"\",VLOOKUP($A35,FB_27,2,0))&IF(TYPE(VLOOKUP($A35,FB_28,2,0))=16,\"\",VLOOKUP($A35,FB_28,2,0))&IF(TYPE(VLOOKUP($A35,FB_29,2,0))=16,\"\",VLOOKUP($A35,FB_29,2,0))&IF(TYPE(VLOOKUP($A35,FB_30,2,0))=16,\"\",VLOOKUP($A35,FB_30,2,0))","v":""},null,{"$f":"IF($B35=\"\",\"\",_xlfn.NUMBERVALUE(IF(TYPE(VLOOKUP($A35,FB_1,P$5,0))=16,\"\",VLOOKUP($A35,FB_1,P$5,0))&IF(TYPE(VLOOKUP($A35,FB_2,P$5,0))=16,\"\",VLOOKUP($A35,FB_2,P$5,0))&IF(TYPE(VLOOKUP($A35,FB_3,P$5,0))=16,\"\",VLOOKUP($A35,FB_3,P$5,0))&IF(TYPE(VLOOKUP($A35,FB_4,P$5,0))=16,\"\",VLOOKUP($A35,FB_4,P$5,0))&IF(TYPE(VLOOKUP($A35,FB_5,P$5,0))=16,\"\",VLOOKUP($A35,FB_5,P$5,0))&IF(TYPE(VLOOKUP($A35,FB_6,P$5,0))=16,\"\",VLOOKUP($A35,FB_6,P$5,0))&IF(TYPE(VLOOKUP($A35,FB_7,P$5,0))=16,\"\",VLOOKUP($A35,FB_7,P$5,0))&IF(TYPE(VLOOKUP($A35,FB_8,P$5,0))=16,\"\",VLOOKUP($A35,FB_8,P$5,0))&IF(TYPE(VLOOKUP($A35,FB_9,P$5,0))=16,\"\",VLOOKUP($A35,FB_9,P$5,0))&IF(TYPE(VLOOKUP($A35,FB_10,P$5,0))=16,\"\",VLOOKUP($A35,FB_10,P$5,0))&IF(TYPE(VLOOKUP($A35,FB_11,P$5,0))=16,\"\",VLOOKUP($A35,FB_11,P$5,0))&IF(TYPE(VLOOKUP($A35,FB_12,P$5,0))=16,\"\",VLOOKUP($A35,FB_12,P$5,0))&IF(TYPE(VLOOKUP($A35,FB_13,P$5,0))=16,\"\",VLOOKUP($A35,FB_13,P$5,0))&IF(TYPE(VLOOKUP($A35,FB_14,P$5,0))=16,\"\",VLOOKUP($A35,FB_14,P$5,0))&IF(TYPE(VLOOKUP($A35,FB_15,P$5,0))=16,\"\",VLOOKUP($A35,FB_15,P$5,0))&IF(TYPE(VLOOKUP($A35,FB_16,P$5,0))=16,\"\",VLOOKUP($A35,FB_16,P$5,0))&IF(TYPE(VLOOKUP($A35,FB_17,P$5,0))=16,\"\",VLOOKUP($A35,FB_17,P$5,0))&IF(TYPE(VLOOKUP($A35,FB_18,P$5,0))=16,\"\",VLOOKUP($A35,FB_18,P$5,0))&IF(TYPE(VLOOKUP($A35,FB_19,P$5,0))=16,\"\",VLOOKUP($A35,FB_19,P$5,0))&IF(TYPE(VLOOKUP($A35,FB_20,P$5,0))=16,\"\",VLOOKUP($A35,FB_20,P$5,0))&IF(TYPE(VLOOKUP($A35,FB_21,P$5,0))=16,\"\",VLOOKUP($A35,FB_21,P$5,0))&IF(TYPE(VLOOKUP($A35,FB_22,P$5,0))=16,\"\",VLOOKUP($A35,FB_22,P$5,0))&IF(TYPE(VLOOKUP($A35,FB_23,P$5,0))=16,\"\",VLOOKUP($A35,FB_23,P$5,0))&IF(TYPE(VLOOKUP($A35,FB_24,P$5,0))=16,\"\",VLOOKUP($A35,FB_24,P$5,0))&IF(TYPE(VLOOKUP($A35,FB_25,P$5,0))=16,\"\",VLOOKUP($A35,FB_25,P$5,0))&IF(TYPE(VLOOKUP($A35,FB_26,P$5,0))=16,\"\",VLOOKUP($A35,FB_26,P$5,0))&IF(TYPE(VLOOKUP($A35,FB_27,P$5,0))=16,\"\",VLOOKUP($A35,FB_27,P$5,0))&IF(TYPE(VLOOKUP($A35,FB_28,P$5,0))=16,\"\",VLOOKUP($A35,FB_28,P$5,0))&IF(TYPE(VLOOKUP($A35,FB_29,P$5,0))=16,\"\",VLOOKUP($A35,FB_29,P$5,0))&IF(TYPE(VLOOKUP($A35,FB_30,P$5,0))=16,\"\",VLOOKUP($A35,FB_30,P$5,0))))","v":""},"",{"$f":"IF($B35=\"\",\"\",_xlfn.NUMBERVALUE(IF(TYPE(VLOOKUP($A35,FB_1,R$5,0))=16,\"\",VLOOKUP($A35,FB_1,R$5,0))&IF(TYPE(VLOOKUP($A35,FB_2,R$5,0))=16,\"\",VLOOKUP($A35,FB_2,R$5,0))&IF(TYPE(VLOOKUP($A35,FB_3,R$5,0))=16,\"\",VLOOKUP($A35,FB_3,R$5,0))&IF(TYPE(VLOOKUP($A35,FB_4,R$5,0))=16,\"\",VLOOKUP($A35,FB_4,R$5,0))&IF(TYPE(VLOOKUP($A35,FB_5,R$5,0))=16,\"\",VLOOKUP($A35,FB_5,R$5,0))&IF(TYPE(VLOOKUP($A35,FB_6,R$5,0))=16,\"\",VLOOKUP($A35,FB_6,R$5,0))&IF(TYPE(VLOOKUP($A35,FB_7,R$5,0))=16,\"\",VLOOKUP($A35,FB_7,R$5,0))&IF(TYPE(VLOOKUP($A35,FB_8,R$5,0))=16,\"\",VLOOKUP($A35,FB_8,R$5,0))&IF(TYPE(VLOOKUP($A35,FB_9,R$5,0))=16,\"\",VLOOKUP($A35,FB_9,R$5,0))&IF(TYPE(VLOOKUP($A35,FB_10,R$5,0))=16,\"\",VLOOKUP($A35,FB_10,R$5,0))&IF(TYPE(VLOOKUP($A35,FB_11,R$5,0))=16,\"\",VLOOKUP($A35,FB_11,R$5,0))&IF(TYPE(VLOOKUP($A35,FB_12,R$5,0))=16,\"\",VLOOKUP($A35,FB_12,R$5,0))&IF(TYPE(VLOOKUP($A35,FB_13,R$5,0))=16,\"\",VLOOKUP($A35,FB_13,R$5,0))&IF(TYPE(VLOOKUP($A35,FB_14,R$5,0))=16,\"\",VLOOKUP($A35,FB_14,R$5,0))&IF(TYPE(VLOOKUP($A35,FB_15,R$5,0))=16,\"\",VLOOKUP($A35,FB_15,R$5,0))&IF(TYPE(VLOOKUP($A35,FB_16,R$5,0))=16,\"\",VLOOKUP($A35,FB_16,R$5,0))&IF(TYPE(VLOOKUP($A35,FB_17,R$5,0))=16,\"\",VLOOKUP($A35,FB_17,R$5,0))&IF(TYPE(VLOOKUP($A35,FB_18,R$5,0))=16,\"\",VLOOKUP($A35,FB_18,R$5,0))&IF(TYPE(VLOOKUP($A35,FB_19,R$5,0))=16,\"\",VLOOKUP($A35,FB_19,R$5,0))&IF(TYPE(VLOOKUP($A35,FB_20,R$5,0))=16,\"\",VLOOKUP($A35,FB_20,R$5,0))&IF(TYPE(VLOOKUP($A35,FB_21,R$5,0))=16,\"\",VLOOKUP($A35,FB_21,R$5,0))&IF(TYPE(VLOOKUP($A35,FB_22,R$5,0))=16,\"\",VLOOKUP($A35,FB_22,R$5,0))&IF(TYPE(VLOOKUP($A35,FB_23,R$5,0))=16,\"\",VLOOKUP($A35,FB_23,R$5,0))&IF(TYPE(VLOOKUP($A35,FB_24,R$5,0))=16,\"\",VLOOKUP($A35,FB_24,R$5,0))&IF(TYPE(VLOOKUP($A35,FB_25,R$5,0))=16,\"\",VLOOKUP($A35,FB_25,R$5,0))&IF(TYPE(VLOOKUP($A35,FB_26,R$5,0))=16,\"\",VLOOKUP($A35,FB_26,R$5,0))&IF(TYPE(VLOOKUP($A35,FB_27,R$5,0))=16,\"\",VLOOKUP($A35,FB_27,R$5,0))&IF(TYPE(VLOOKUP($A35,FB_28,R$5,0))=16,\"\",VLOOKUP($A35,FB_28,R$5,0))&IF(TYPE(VLOOKUP($A35,FB_29,R$5,0))=16,\"\",VLOOKUP($A35,FB_29,R$5,0))&IF(TYPE(VLOOKUP($A35,FB_30,R$5,0))=16,\"\",VLOOKUP($A35,FB_30,R$5,0))))","v":""},{"$f":"IF($B35=\"\",\"\",IF(TYPE(VLOOKUP($A35,FB_1,S$5,0))=16,\"\",VLOOKUP($A35,FB_1,S$5,0))&IF(TYPE(VLOOKUP($A35,FB_2,S$5,0))=16,\"\",VLOOKUP($A35,FB_2,S$5,0))&IF(TYPE(VLOOKUP($A35,FB_3,S$5,0))=16,\"\",VLOOKUP($A35,FB_3,S$5,0))&IF(TYPE(VLOOKUP($A35,FB_4,S$5,0))=16,\"\",VLOOKUP($A35,FB_4,S$5,0))&IF(TYPE(VLOOKUP($A35,FB_5,S$5,0))=16,\"\",VLOOKUP($A35,FB_5,S$5,0))&IF(TYPE(VLOOKUP($A35,FB_6,S$5,0))=16,\"\",VLOOKUP($A35,FB_6,S$5,0))&IF(TYPE(VLOOKUP($A35,FB_7,S$5,0))=16,\"\",VLOOKUP($A35,FB_7,S$5,0))&IF(TYPE(VLOOKUP($A35,FB_8,S$5,0))=16,\"\",VLOOKUP($A35,FB_8,S$5,0))&IF(TYPE(VLOOKUP($A35,FB_9,S$5,0))=16,\"\",VLOOKUP($A35,FB_9,S$5,0))&IF(TYPE(VLOOKUP($A35,FB_10,S$5,0))=16,\"\",VLOOKUP($A35,FB_10,S$5,0))&IF(TYPE(VLOOKUP($A35,FB_11,S$5,0))=16,\"\",VLOOKUP($A35,FB_11,S$5,0))&IF(TYPE(VLOOKUP($A35,FB_12,S$5,0))=16,\"\",VLOOKUP($A35,FB_12,S$5,0))&IF(TYPE(VLOOKUP($A35,FB_13,S$5,0))=16,\"\",VLOOKUP($A35,FB_13,S$5,0))&IF(TYPE(VLOOKUP($A35,FB_14,S$5,0))=16,\"\",VLOOKUP($A35,FB_14,S$5,0))&IF(TYPE(VLOOKUP($A35,FB_15,S$5,0))=16,\"\",VLOOKUP($A35,FB_15,S$5,0))&IF(TYPE(VLOOKUP($A35,FB_16,S$5,0))=16,\"\",VLOOKUP($A35,FB_16,S$5,0))&IF(TYPE(VLOOKUP($A35,FB_17,S$5,0))=16,\"\",VLOOKUP($A35,FB_17,S$5,0))&IF(TYPE(VLOOKUP($A35,FB_18,S$5,0))=16,\"\",VLOOKUP($A35,FB_18,S$5,0))&IF(TYPE(VLOOKUP($A35,FB_19,S$5,0))=16,\"\",VLOOKUP($A35,FB_19,S$5,0))&IF(TYPE(VLOOKUP($A35,FB_20,S$5,0))=16,\"\",VLOOKUP($A35,FB_20,S$5,0))&IF(TYPE(VLOOKUP($A35,FB_21,S$5,0))=16,\"\",VLOOKUP($A35,FB_21,S$5,0))&IF(TYPE(VLOOKUP($A35,FB_22,S$5,0))=16,\"\",VLOOKUP($A35,FB_22,S$5,0))&IF(TYPE(VLOOKUP($A35,FB_23,S$5,0))=16,\"\",VLOOKUP($A35,FB_23,S$5,0))&IF(TYPE(VLOOKUP($A35,FB_24,S$5,0))=16,\"\",VLOOKUP($A35,FB_24,S$5,0))&IF(TYPE(VLOOKUP($A35,FB_25,S$5,0))=16,\"\",VLOOKUP($A35,FB_25,S$5,0))&IF(TYPE(VLOOKUP($A35,FB_26,S$5,0))=16,\"\",VLOOKUP($A35,FB_26,S$5,0))&IF(TYPE(VLOOKUP($A35,FB_27,S$5,0))=16,\"\",VLOOKUP($A35,FB_27,S$5,0))&IF(TYPE(VLOOKUP($A35,FB_28,S$5,0))=16,\"\",VLOOKUP($A35,FB_28,S$5,0))&IF(TYPE(VLOOKUP($A35,FB_29,S$5,0))=16,\"\",VLOOKUP($A35,FB_29,S$5,0))&IF(TYPE(VLOOKUP($A35,FB_30,S$5,0))=16,\"\",VLOOKUP($A35,FB_30,S$5,0)))","v":""},null,null,null,null,null,null,null,null,null,null,null,null,null,null,null,null,"",":","","",""]
["7.",{"$f":"IF(TYPE(VLOOKUP($A36,FB_1,2,0))=16,\"\",VLOOKUP($A36,FB_1,2,0))&IF(TYPE(VLOOKUP($A36,FB_2,2,0))=16,\"\",VLOOKUP($A36,FB_2,2,0))&IF(TYPE(VLOOKUP($A36,FB_3,2,0))=16,\"\",VLOOKUP($A36,FB_3,2,0))&IF(TYPE(VLOOKUP($A36,FB_4,2,0))=16,\"\",VLOOKUP($A36,FB_4,2,0))&IF(TYPE(VLOOKUP($A36,FB_5,2,0))=16,\"\",VLOOKUP($A36,FB_5,2,0))&IF(TYPE(VLOOKUP($A36,FB_6,2,0))=16,\"\",VLOOKUP($A36,FB_6,2,0))&IF(TYPE(VLOOKUP($A36,FB_7,2,0))=16,\"\",VLOOKUP($A36,FB_7,2,0))&IF(TYPE(VLOOKUP($A36,FB_8,2,0))=16,\"\",VLOOKUP($A36,FB_8,2,0))&IF(TYPE(VLOOKUP($A36,FB_9,2,0))=16,\"\",VLOOKUP($A36,FB_9,2,0))&IF(TYPE(VLOOKUP($A36,FB_10,2,0))=16,\"\",VLOOKUP($A36,FB_10,2,0))&IF(TYPE(VLOOKUP($A36,FB_11,2,0))=16,\"\",VLOOKUP($A36,FB_11,2,0))&IF(TYPE(VLOOKUP($A36,FB_12,2,0))=16,\"\",VLOOKUP($A36,FB_12,2,0))&IF(TYPE(VLOOKUP($A36,FB_13,2,0))=16,\"\",VLOOKUP($A36,FB_13,2,0))&IF(TYPE(VLOOKUP($A36,FB_14,2,0))=16,\"\",VLOOKUP($A36,FB_14,2,0))&IF(TYPE(VLOOKUP($A36,FB_15,2,0))=16,\"\",VLOOKUP($A36,FB_15,2,0))&IF(TYPE(VLOOKUP($A36,FB_16,2,0))=16,\"\",VLOOKUP($A36,FB_16,2,0))&IF(TYPE(VLOOKUP($A36,FB_17,2,0))=16,\"\",VLOOKUP($A36,FB_17,2,0))&IF(TYPE(VLOOKUP($A36,FB_18,2,0))=16,\"\",VLOOKUP($A36,FB_18,2,0))&IF(TYPE(VLOOKUP($A36,FB_19,2,0))=16,\"\",VLOOKUP($A36,FB_19,2,0))&IF(TYPE(VLOOKUP($A36,FB_20,2,0))=16,\"\",VLOOKUP($A36,FB_20,2,0))&IF(TYPE(VLOOKUP($A36,FB_21,2,0))=16,\"\",VLOOKUP($A36,FB_21,2,0))&IF(TYPE(VLOOKUP($A36,FB_22,2,0))=16,\"\",VLOOKUP($A36,FB_22,2,0))&IF(TYPE(VLOOKUP($A36,FB_23,2,0))=16,\"\",VLOOKUP($A36,FB_23,2,0))&IF(TYPE(VLOOKUP($A36,FB_24,2,0))=16,\"\",VLOOKUP($A36,FB_24,2,0))&IF(TYPE(VLOOKUP($A36,FB_25,2,0))=16,\"\",VLOOKUP($A36,FB_25,2,0))&IF(TYPE(VLOOKUP($A36,FB_26,2,0))=16,\"\",VLOOKUP($A36,FB_26,2,0))&IF(TYPE(VLOOKUP($A36,FB_27,2,0))=16,\"\",VLOOKUP($A36,FB_27,2,0))&IF(TYPE(VLOOKUP($A36,FB_28,2,0))=16,\"\",VLOOKUP($A36,FB_28,2,0))&IF(TYPE(VLOOKUP($A36,FB_29,2,0))=16,\"\",VLOOKUP($A36,FB_29,2,0))&IF(TYPE(VLOOKUP($A36,FB_30,2,0))=16,\"\",VLOOKUP($A36,FB_30,2,0))","v":""},null,{"$f":"IF($B36=\"\",\"\",_xlfn.NUMBERVALUE(IF(TYPE(VLOOKUP($A36,FB_1,P$5,0))=16,\"\",VLOOKUP($A36,FB_1,P$5,0))&IF(TYPE(VLOOKUP($A36,FB_2,P$5,0))=16,\"\",VLOOKUP($A36,FB_2,P$5,0))&IF(TYPE(VLOOKUP($A36,FB_3,P$5,0))=16,\"\",VLOOKUP($A36,FB_3,P$5,0))&IF(TYPE(VLOOKUP($A36,FB_4,P$5,0))=16,\"\",VLOOKUP($A36,FB_4,P$5,0))&IF(TYPE(VLOOKUP($A36,FB_5,P$5,0))=16,\"\",VLOOKUP($A36,FB_5,P$5,0))&IF(TYPE(VLOOKUP($A36,FB_6,P$5,0))=16,\"\",VLOOKUP($A36,FB_6,P$5,0))&IF(TYPE(VLOOKUP($A36,FB_7,P$5,0))=16,\"\",VLOOKUP($A36,FB_7,P$5,0))&IF(TYPE(VLOOKUP($A36,FB_8,P$5,0))=16,\"\",VLOOKUP($A36,FB_8,P$5,0))&IF(TYPE(VLOOKUP($A36,FB_9,P$5,0))=16,\"\",VLOOKUP($A36,FB_9,P$5,0))&IF(TYPE(VLOOKUP($A36,FB_10,P$5,0))=16,\"\",VLOOKUP($A36,FB_10,P$5,0))&IF(TYPE(VLOOKUP($A36,FB_11,P$5,0))=16,\"\",VLOOKUP($A36,FB_11,P$5,0))&IF(TYPE(VLOOKUP($A36,FB_12,P$5,0))=16,\"\",VLOOKUP($A36,FB_12,P$5,0))&IF(TYPE(VLOOKUP($A36,FB_13,P$5,0))=16,\"\",VLOOKUP($A36,FB_13,P$5,0))&IF(TYPE(VLOOKUP($A36,FB_14,P$5,0))=16,\"\",VLOOKUP($A36,FB_14,P$5,0))&IF(TYPE(VLOOKUP($A36,FB_15,P$5,0))=16,\"\",VLOOKUP($A36,FB_15,P$5,0))&IF(TYPE(VLOOKUP($A36,FB_16,P$5,0))=16,\"\",VLOOKUP($A36,FB_16,P$5,0))&IF(TYPE(VLOOKUP($A36,FB_17,P$5,0))=16,\"\",VLOOKUP($A36,FB_17,P$5,0))&IF(TYPE(VLOOKUP($A36,FB_18,P$5,0))=16,\"\",VLOOKUP($A36,FB_18,P$5,0))&IF(TYPE(VLOOKUP($A36,FB_19,P$5,0))=16,\"\",VLOOKUP($A36,FB_19,P$5,0))&IF(TYPE(VLOOKUP($A36,FB_20,P$5,0))=16,\"\",VLOOKUP($A36,FB_20,P$5,0))&IF(TYPE(VLOOKUP($A36,FB_21,P$5,0))=16,\"\",VLOOKUP($A36,FB_21,P$5,0))&IF(TYPE(VLOOKUP($A36,FB_22,P$5,0))=16,\"\",VLOOKUP($A36,FB_22,P$5,0))&IF(TYPE(VLOOKUP($A36,FB_23,P$5,0))=16,\"\",VLOOKUP($A36,FB_23,P$5,0))&IF(TYPE(VLOOKUP($A36,FB_24,P$5,0))=16,\"\",VLOOKUP($A36,FB_24,P$5,0))&IF(TYPE(VLOOKUP($A36,FB_25,P$5,0))=16,\"\",VLOOKUP($A36,FB_25,P$5,0))&IF(TYPE(VLOOKUP($A36,FB_26,P$5,0))=16,\"\",VLOOKUP($A36,FB_26,P$5,0))&IF(TYPE(VLOOKUP($A36,FB_27,P$5,0))=16,\"\",VLOOKUP($A36,FB_27,P$5,0))&IF(TYPE(VLOOKUP($A36,FB_28,P$5,0))=16,\"\",VLOOKUP($A36,FB_28,P$5,0))&IF(TYPE(VLOOKUP($A36,FB_29,P$5,0))=16,\"\",VLOOKUP($A36,FB_29,P$5,0))&IF(TYPE(VLOOKUP($A36,FB_30,P$5,0))=16,\"\",VLOOKUP($A36,FB_30,P$5,0))))","v":""},"",{"$f":"IF($B36=\"\",\"\",_xlfn.NUMBERVALUE(IF(TYPE(VLOOKUP($A36,FB_1,R$5,0))=16,\"\",VLOOKUP($A36,FB_1,R$5,0))&IF(TYPE(VLOOKUP($A36,FB_2,R$5,0))=16,\"\",VLOOKUP($A36,FB_2,R$5,0))&IF(TYPE(VLOOKUP($A36,FB_3,R$5,0))=16,\"\",VLOOKUP($A36,FB_3,R$5,0))&IF(TYPE(VLOOKUP($A36,FB_4,R$5,0))=16,\"\",VLOOKUP($A36,FB_4,R$5,0))&IF(TYPE(VLOOKUP($A36,FB_5,R$5,0))=16,\"\",VLOOKUP($A36,FB_5,R$5,0))&IF(TYPE(VLOOKUP($A36,FB_6,R$5,0))=16,\"\",VLOOKUP($A36,FB_6,R$5,0))&IF(TYPE(VLOOKUP($A36,FB_7,R$5,0))=16,\"\",VLOOKUP($A36,FB_7,R$5,0))&IF(TYPE(VLOOKUP($A36,FB_8,R$5,0))=16,\"\",VLOOKUP($A36,FB_8,R$5,0))&IF(TYPE(VLOOKUP($A36,FB_9,R$5,0))=16,\"\",VLOOKUP($A36,FB_9,R$5,0))&IF(TYPE(VLOOKUP($A36,FB_10,R$5,0))=16,\"\",VLOOKUP($A36,FB_10,R$5,0))&IF(TYPE(VLOOKUP($A36,FB_11,R$5,0))=16,\"\",VLOOKUP($A36,FB_11,R$5,0))&IF(TYPE(VLOOKUP($A36,FB_12,R$5,0))=16,\"\",VLOOKUP($A36,FB_12,R$5,0))&IF(TYPE(VLOOKUP($A36,FB_13,R$5,0))=16,\"\",VLOOKUP($A36,FB_13,R$5,0))&IF(TYPE(VLOOKUP($A36,FB_14,R$5,0))=16,\"\",VLOOKUP($A36,FB_14,R$5,0))&IF(TYPE(VLOOKUP($A36,FB_15,R$5,0))=16,\"\",VLOOKUP($A36,FB_15,R$5,0))&IF(TYPE(VLOOKUP($A36,FB_16,R$5,0))=16,\"\",VLOOKUP($A36,FB_16,R$5,0))&IF(TYPE(VLOOKUP($A36,FB_17,R$5,0))=16,\"\",VLOOKUP($A36,FB_17,R$5,0))&IF(TYPE(VLOOKUP($A36,FB_18,R$5,0))=16,\"\",VLOOKUP($A36,FB_18,R$5,0))&IF(TYPE(VLOOKUP($A36,FB_19,R$5,0))=16,\"\",VLOOKUP($A36,FB_19,R$5,0))&IF(TYPE(VLOOKUP($A36,FB_20,R$5,0))=16,\"\",VLOOKUP($A36,FB_20,R$5,0))&IF(TYPE(VLOOKUP($A36,FB_21,R$5,0))=16,\"\",VLOOKUP($A36,FB_21,R$5,0))&IF(TYPE(VLOOKUP($A36,FB_22,R$5,0))=16,\"\",VLOOKUP($A36,FB_22,R$5,0))&IF(TYPE(VLOOKUP($A36,FB_23,R$5,0))=16,\"\",VLOOKUP($A36,FB_23,R$5,0))&IF(TYPE(VLOOKUP($A36,FB_24,R$5,0))=16,\"\",VLOOKUP($A36,FB_24,R$5,0))&IF(TYPE(VLOOKUP($A36,FB_25,R$5,0))=16,\"\",VLOOKUP($A36,FB_25,R$5,0))&IF(TYPE(VLOOKUP($A36,FB_26,R$5,0))=16,\"\",VLOOKUP($A36,FB_26,R$5,0))&IF(TYPE(VLOOKUP($A36,FB_27,R$5,0))=16,\"\",VLOOKUP($A36,FB_27,R$5,0))&IF(TYPE(VLOOKUP($A36,FB_28,R$5,0))=16,\"\",VLOOKUP($A36,FB_28,R$5,0))&IF(TYPE(VLOOKUP($A36,FB_29,R$5,0))=16,\"\",VLOOKUP($A36,FB_29,R$5,0))&IF(TYPE(VLOOKUP($A36,FB_30,R$5,0))=16,\"\",VLOOKUP($A36,FB_30,R$5,0))))","v":""},{"$f":"IF($B36=\"\",\"\",IF(TYPE(VLOOKUP($A36,FB_1,S$5,0))=16,\"\",VLOOKUP($A36,FB_1,S$5,0))&IF(TYPE(VLOOKUP($A36,FB_2,S$5,0))=16,\"\",VLOOKUP($A36,FB_2,S$5,0))&IF(TYPE(VLOOKUP($A36,FB_3,S$5,0))=16,\"\",VLOOKUP($A36,FB_3,S$5,0))&IF(TYPE(VLOOKUP($A36,FB_4,S$5,0))=16,\"\",VLOOKUP($A36,FB_4,S$5,0))&IF(TYPE(VLOOKUP($A36,FB_5,S$5,0))=16,\"\",VLOOKUP($A36,FB_5,S$5,0))&IF(TYPE(VLOOKUP($A36,FB_6,S$5,0))=16,\"\",VLOOKUP($A36,FB_6,S$5,0))&IF(TYPE(VLOOKUP($A36,FB_7,S$5,0))=16,\"\",VLOOKUP($A36,FB_7,S$5,0))&IF(TYPE(VLOOKUP($A36,FB_8,S$5,0))=16,\"\",VLOOKUP($A36,FB_8,S$5,0))&IF(TYPE(VLOOKUP($A36,FB_9,S$5,0))=16,\"\",VLOOKUP($A36,FB_9,S$5,0))&IF(TYPE(VLOOKUP($A36,FB_10,S$5,0))=16,\"\",VLOOKUP($A36,FB_10,S$5,0))&IF(TYPE(VLOOKUP($A36,FB_11,S$5,0))=16,\"\",VLOOKUP($A36,FB_11,S$5,0))&IF(TYPE(VLOOKUP($A36,FB_12,S$5,0))=16,\"\",VLOOKUP($A36,FB_12,S$5,0))&IF(TYPE(VLOOKUP($A36,FB_13,S$5,0))=16,\"\",VLOOKUP($A36,FB_13,S$5,0))&IF(TYPE(VLOOKUP($A36,FB_14,S$5,0))=16,\"\",VLOOKUP($A36,FB_14,S$5,0))&IF(TYPE(VLOOKUP($A36,FB_15,S$5,0))=16,\"\",VLOOKUP($A36,FB_15,S$5,0))&IF(TYPE(VLOOKUP($A36,FB_16,S$5,0))=16,\"\",VLOOKUP($A36,FB_16,S$5,0))&IF(TYPE(VLOOKUP($A36,FB_17,S$5,0))=16,\"\",VLOOKUP($A36,FB_17,S$5,0))&IF(TYPE(VLOOKUP($A36,FB_18,S$5,0))=16,\"\",VLOOKUP($A36,FB_18,S$5,0))&IF(TYPE(VLOOKUP($A36,FB_19,S$5,0))=16,\"\",VLOOKUP($A36,FB_19,S$5,0))&IF(TYPE(VLOOKUP($A36,FB_20,S$5,0))=16,\"\",VLOOKUP($A36,FB_20,S$5,0))&IF(TYPE(VLOOKUP($A36,FB_21,S$5,0))=16,\"\",VLOOKUP($A36,FB_21,S$5,0))&IF(TYPE(VLOOKUP($A36,FB_22,S$5,0))=16,\"\",VLOOKUP($A36,FB_22,S$5,0))&IF(TYPE(VLOOKUP($A36,FB_23,S$5,0))=16,\"\",VLOOKUP($A36,FB_23,S$5,0))&IF(TYPE(VLOOKUP($A36,FB_24,S$5,0))=16,\"\",VLOOKUP($A36,FB_24,S$5,0))&IF(TYPE(VLOOKUP($A36,FB_25,S$5,0))=16,\"\",VLOOKUP($A36,FB_25,S$5,0))&IF(TYPE(VLOOKUP($A36,FB_26,S$5,0))=16,\"\",VLOOKUP($A36,FB_26,S$5,0))&IF(TYPE(VLOOKUP($A36,FB_27,S$5,0))=16,\"\",VLOOKUP($A36,FB_27,S$5,0))&IF(TYPE(VLOOKUP($A36,FB_28,S$5,0))=16,\"\",VLOOKUP($A36,FB_28,S$5,0))&IF(TYPE(VLOOKUP($A36,FB_29,S$5,0))=16,\"\",VLOOKUP($A36,FB_29,S$5,0))&IF(TYPE(VLOOKUP($A36,FB_30,S$5,0))=16,\"\",VLOOKUP($A36,FB_30,S$5,0)))","v":""},null,null,null,null,null,null,null,null,null,null,null,null,null,null,null,null,"",":","","",""]
["8.",{"$f":"IF(TYPE(VLOOKUP($A37,FB_1,2,0))=16,\"\",VLOOKUP($A37,FB_1,2,0))&IF(TYPE(VLOOKUP($A37,FB_2,2,0))=16,\"\",VLOOKUP($A37,FB_2,2,0))&IF(TYPE(VLOOKUP($A37,FB_3,2,0))=16,\"\",VLOOKUP($A37,FB_3,2,0))&IF(TYPE(VLOOKUP($A37,FB_4,2,0))=16,\"\",VLOOKUP($A37,FB_4,2,0))&IF(TYPE(VLOOKUP($A37,FB_5,2,0))=16,\"\",VLOOKUP($A37,FB_5,2,0))&IF(TYPE(VLOOKUP($A37,FB_6,2,0))=16,\"\",VLOOKUP($A37,FB_6,2,0))&IF(TYPE(VLOOKUP($A37,FB_7,2,0))=16,\"\",VLOOKUP($A37,FB_7,2,0))&IF(TYPE(VLOOKUP($A37,FB_8,2,0))=16,\"\",VLOOKUP($A37,FB_8,2,0))&IF(TYPE(VLOOKUP($A37,FB_9,2,0))=16,\"\",VLOOKUP($A37,FB_9,2,0))&IF(TYPE(VLOOKUP($A37,FB_10,2,0))=16,\"\",VLOOKUP($A37,FB_10,2,0))&IF(TYPE(VLOOKUP($A37,FB_11,2,0))=16,\"\",VLOOKUP($A37,FB_11,2,0))&IF(TYPE(VLOOKUP($A37,FB_12,2,0))=16,\"\",VLOOKUP($A37,FB_12,2,0))&IF(TYPE(VLOOKUP($A37,FB_13,2,0))=16,\"\",VLOOKUP($A37,FB_13,2,0))&IF(TYPE(VLOOKUP($A37,FB_14,2,0))=16,\"\",VLOOKUP($A37,FB_14,2,0))&IF(TYPE(VLOOKUP($A37,FB_15,2,0))=16,\"\",VLOOKUP($A37,FB_15,2,0))&IF(TYPE(VLOOKUP($A37,FB_16,2,0))=16,\"\",VLOOKUP($A37,FB_16,2,0))&IF(TYPE(VLOOKUP($A37,FB_17,2,0))=16,\"\",VLOOKUP($A37,FB_17,2,0))&IF(TYPE(VLOOKUP($A37,FB_18,2,0))=16,\"\",VLOOKUP($A37,FB_18,2,0))&IF(TYPE(VLOOKUP($A37,FB_19,2,0))=16,\"\",VLOOKUP($A37,FB_19,2,0))&IF(TYPE(VLOOKUP($A37,FB_20,2,0))=16,\"\",VLOOKUP($A37,FB_20,2,0))&IF(TYPE(VLOOKUP($A37,FB_21,2,0))=16,\"\",VLOOKUP($A37,FB_21,2,0))&IF(TYPE(VLOOKUP($A37,FB_22,2,0))=16,\"\",VLOOKUP($A37,FB_22,2,0))&IF(TYPE(VLOOKUP($A37,FB_23,2,0))=16,\"\",VLOOKUP($A37,FB_23,2,0))&IF(TYPE(VLOOKUP($A37,FB_24,2,0))=16,\"\",VLOOKUP($A37,FB_24,2,0))&IF(TYPE(VLOOKUP($A37,FB_25,2,0))=16,\"\",VLOOKUP($A37,FB_25,2,0))&IF(TYPE(VLOOKUP($A37,FB_26,2,0))=16,\"\",VLOOKUP($A37,FB_26,2,0))&IF(TYPE(VLOOKUP($A37,FB_27,2,0))=16,\"\",VLOOKUP($A37,FB_27,2,0))&IF(TYPE(VLOOKUP($A37,FB_28,2,0))=16,\"\",VLOOKUP($A37,FB_28,2,0))&IF(TYPE(VLOOKUP($A37,FB_29,2,0))=16,\"\",VLOOKUP($A37,FB_29,2,0))&IF(TYPE(VLOOKUP($A37,FB_30,2,0))=16,\"\",VLOOKUP($A37,FB_30,2,0))","v":""},null,{"$f":"IF($B37=\"\",\"\",_xlfn.NUMBERVALUE(IF(TYPE(VLOOKUP($A37,FB_1,P$5,0))=16,\"\",VLOOKUP($A37,FB_1,P$5,0))&IF(TYPE(VLOOKUP($A37,FB_2,P$5,0))=16,\"\",VLOOKUP($A37,FB_2,P$5,0))&IF(TYPE(VLOOKUP($A37,FB_3,P$5,0))=16,\"\",VLOOKUP($A37,FB_3,P$5,0))&IF(TYPE(VLOOKUP($A37,FB_4,P$5,0))=16,\"\",VLOOKUP($A37,FB_4,P$5,0))&IF(TYPE(VLOOKUP($A37,FB_5,P$5,0))=16,\"\",VLOOKUP($A37,FB_5,P$5,0))&IF(TYPE(VLOOKUP($A37,FB_6,P$5,0))=16,\"\",VLOOKUP($A37,FB_6,P$5,0))&IF(TYPE(VLOOKUP($A37,FB_7,P$5,0))=16,\"\",VLOOKUP($A37,FB_7,P$5,0))&IF(TYPE(VLOOKUP($A37,FB_8,P$5,0))=16,\"\",VLOOKUP($A37,FB_8,P$5,0))&IF(TYPE(VLOOKUP($A37,FB_9,P$5,0))=16,\"\",VLOOKUP($A37,FB_9,P$5,0))&IF(TYPE(VLOOKUP($A37,FB_10,P$5,0))=16,\"\",VLOOKUP($A37,FB_10,P$5,0))&IF(TYPE(VLOOKUP($A37,FB_11,P$5,0))=16,\"\",VLOOKUP($A37,FB_11,P$5,0))&IF(TYPE(VLOOKUP($A37,FB_12,P$5,0))=16,\"\",VLOOKUP($A37,FB_12,P$5,0))&IF(TYPE(VLOOKUP($A37,FB_13,P$5,0))=16,\"\",VLOOKUP($A37,FB_13,P$5,0))&IF(TYPE(VLOOKUP($A37,FB_14,P$5,0))=16,\"\",VLOOKUP($A37,FB_14,P$5,0))&IF(TYPE(VLOOKUP($A37,FB_15,P$5,0))=16,\"\",VLOOKUP($A37,FB_15,P$5,0))&IF(TYPE(VLOOKUP($A37,FB_16,P$5,0))=16,\"\",VLOOKUP($A37,FB_16,P$5,0))&IF(TYPE(VLOOKUP($A37,FB_17,P$5,0))=16,\"\",VLOOKUP($A37,FB_17,P$5,0))&IF(TYPE(VLOOKUP($A37,FB_18,P$5,0))=16,\"\",VLOOKUP($A37,FB_18,P$5,0))&IF(TYPE(VLOOKUP($A37,FB_19,P$5,0))=16,\"\",VLOOKUP($A37,FB_19,P$5,0))&IF(TYPE(VLOOKUP($A37,FB_20,P$5,0))=16,\"\",VLOOKUP($A37,FB_20,P$5,0))&IF(TYPE(VLOOKUP($A37,FB_21,P$5,0))=16,\"\",VLOOKUP($A37,FB_21,P$5,0))&IF(TYPE(VLOOKUP($A37,FB_22,P$5,0))=16,\"\",VLOOKUP($A37,FB_22,P$5,0))&IF(TYPE(VLOOKUP($A37,FB_23,P$5,0))=16,\"\",VLOOKUP($A37,FB_23,P$5,0))&IF(TYPE(VLOOKUP($A37,FB_24,P$5,0))=16,\"\",VLOOKUP($A37,FB_24,P$5,0))&IF(TYPE(VLOOKUP($A37,FB_25,P$5,0))=16,\"\",VLOOKUP($A37,FB_25,P$5,0))&IF(TYPE(VLOOKUP($A37,FB_26,P$5,0))=16,\"\",VLOOKUP($A37,FB_26,P$5,0))&IF(TYPE(VLOOKUP($A37,FB_27,P$5,0))=16,\"\",VLOOKUP($A37,FB_27,P$5,0))&IF(TYPE(VLOOKUP($A37,FB_28,P$5,0))=16,\"\",VLOOKUP($A37,FB_28,P$5,0))&IF(TYPE(VLOOKUP($A37,FB_29,P$5,0))=16,\"\",VLOOKUP($A37,FB_29,P$5,0))&IF(TYPE(VLOOKUP($A37,FB_30,P$5,0))=16,\"\",VLOOKUP($A37,FB_30,P$5,0))))","v":""},"",{"$f":"IF($B37=\"\",\"\",_xlfn.NUMBERVALUE(IF(TYPE(VLOOKUP($A37,FB_1,R$5,0))=16,\"\",VLOOKUP($A37,FB_1,R$5,0))&IF(TYPE(VLOOKUP($A37,FB_2,R$5,0))=16,\"\",VLOOKUP($A37,FB_2,R$5,0))&IF(TYPE(VLOOKUP($A37,FB_3,R$5,0))=16,\"\",VLOOKUP($A37,FB_3,R$5,0))&IF(TYPE(VLOOKUP($A37,FB_4,R$5,0))=16,\"\",VLOOKUP($A37,FB_4,R$5,0))&IF(TYPE(VLOOKUP($A37,FB_5,R$5,0))=16,\"\",VLOOKUP($A37,FB_5,R$5,0))&IF(TYPE(VLOOKUP($A37,FB_6,R$5,0))=16,\"\",VLOOKUP($A37,FB_6,R$5,0))&IF(TYPE(VLOOKUP($A37,FB_7,R$5,0))=16,\"\",VLOOKUP($A37,FB_7,R$5,0))&IF(TYPE(VLOOKUP($A37,FB_8,R$5,0))=16,\"\",VLOOKUP($A37,FB_8,R$5,0))&IF(TYPE(VLOOKUP($A37,FB_9,R$5,0))=16,\"\",VLOOKUP($A37,FB_9,R$5,0))&IF(TYPE(VLOOKUP($A37,FB_10,R$5,0))=16,\"\",VLOOKUP($A37,FB_10,R$5,0))&IF(TYPE(VLOOKUP($A37,FB_11,R$5,0))=16,\"\",VLOOKUP($A37,FB_11,R$5,0))&IF(TYPE(VLOOKUP($A37,FB_12,R$5,0))=16,\"\",VLOOKUP($A37,FB_12,R$5,0))&IF(TYPE(VLOOKUP($A37,FB_13,R$5,0))=16,\"\",VLOOKUP($A37,FB_13,R$5,0))&IF(TYPE(VLOOKUP($A37,FB_14,R$5,0))=16,\"\",VLOOKUP($A37,FB_14,R$5,0))&IF(TYPE(VLOOKUP($A37,FB_15,R$5,0))=16,\"\",VLOOKUP($A37,FB_15,R$5,0))&IF(TYPE(VLOOKUP($A37,FB_16,R$5,0))=16,\"\",VLOOKUP($A37,FB_16,R$5,0))&IF(TYPE(VLOOKUP($A37,FB_17,R$5,0))=16,\"\",VLOOKUP($A37,FB_17,R$5,0))&IF(TYPE(VLOOKUP($A37,FB_18,R$5,0))=16,\"\",VLOOKUP($A37,FB_18,R$5,0))&IF(TYPE(VLOOKUP($A37,FB_19,R$5,0))=16,\"\",VLOOKUP($A37,FB_19,R$5,0))&IF(TYPE(VLOOKUP($A37,FB_20,R$5,0))=16,\"\",VLOOKUP($A37,FB_20,R$5,0))&IF(TYPE(VLOOKUP($A37,FB_21,R$5,0))=16,\"\",VLOOKUP($A37,FB_21,R$5,0))&IF(TYPE(VLOOKUP($A37,FB_22,R$5,0))=16,\"\",VLOOKUP($A37,FB_22,R$5,0))&IF(TYPE(VLOOKUP($A37,FB_23,R$5,0))=16,\"\",VLOOKUP($A37,FB_23,R$5,0))&IF(TYPE(VLOOKUP($A37,FB_24,R$5,0))=16,\"\",VLOOKUP($A37,FB_24,R$5,0))&IF(TYPE(VLOOKUP($A37,FB_25,R$5,0))=16,\"\",VLOOKUP($A37,FB_25,R$5,0))&IF(TYPE(VLOOKUP($A37,FB_26,R$5,0))=16,\"\",VLOOKUP($A37,FB_26,R$5,0))&IF(TYPE(VLOOKUP($A37,FB_27,R$5,0))=16,\"\",VLOOKUP($A37,FB_27,R$5,0))&IF(TYPE(VLOOKUP($A37,FB_28,R$5,0))=16,\"\",VLOOKUP($A37,FB_28,R$5,0))&IF(TYPE(VLOOKUP($A37,FB_29,R$5,0))=16,\"\",VLOOKUP($A37,FB_29,R$5,0))&IF(TYPE(VLOOKUP($A37,FB_30,R$5,0))=16,\"\",VLOOKUP($A37,FB_30,R$5,0))))","v":""},{"$f":"IF($B37=\"\",\"\",IF(TYPE(VLOOKUP($A37,FB_1,S$5,0))=16,\"\",VLOOKUP($A37,FB_1,S$5,0))&IF(TYPE(VLOOKUP($A37,FB_2,S$5,0))=16,\"\",VLOOKUP($A37,FB_2,S$5,0))&IF(TYPE(VLOOKUP($A37,FB_3,S$5,0))=16,\"\",VLOOKUP($A37,FB_3,S$5,0))&IF(TYPE(VLOOKUP($A37,FB_4,S$5,0))=16,\"\",VLOOKUP($A37,FB_4,S$5,0))&IF(TYPE(VLOOKUP($A37,FB_5,S$5,0))=16,\"\",VLOOKUP($A37,FB_5,S$5,0))&IF(TYPE(VLOOKUP($A37,FB_6,S$5,0))=16,\"\",VLOOKUP($A37,FB_6,S$5,0))&IF(TYPE(VLOOKUP($A37,FB_7,S$5,0))=16,\"\",VLOOKUP($A37,FB_7,S$5,0))&IF(TYPE(VLOOKUP($A37,FB_8,S$5,0))=16,\"\",VLOOKUP($A37,FB_8,S$5,0))&IF(TYPE(VLOOKUP($A37,FB_9,S$5,0))=16,\"\",VLOOKUP($A37,FB_9,S$5,0))&IF(TYPE(VLOOKUP($A37,FB_10,S$5,0))=16,\"\",VLOOKUP($A37,FB_10,S$5,0))&IF(TYPE(VLOOKUP($A37,FB_11,S$5,0))=16,\"\",VLOOKUP($A37,FB_11,S$5,0))&IF(TYPE(VLOOKUP($A37,FB_12,S$5,0))=16,\"\",VLOOKUP($A37,FB_12,S$5,0))&IF(TYPE(VLOOKUP($A37,FB_13,S$5,0))=16,\"\",VLOOKUP($A37,FB_13,S$5,0))&IF(TYPE(VLOOKUP($A37,FB_14,S$5,0))=16,\"\",VLOOKUP($A37,FB_14,S$5,0))&IF(TYPE(VLOOKUP($A37,FB_15,S$5,0))=16,\"\",VLOOKUP($A37,FB_15,S$5,0))&IF(TYPE(VLOOKUP($A37,FB_16,S$5,0))=16,\"\",VLOOKUP($A37,FB_16,S$5,0))&IF(TYPE(VLOOKUP($A37,FB_17,S$5,0))=16,\"\",VLOOKUP($A37,FB_17,S$5,0))&IF(TYPE(VLOOKUP($A37,FB_18,S$5,0))=16,\"\",VLOOKUP($A37,FB_18,S$5,0))&IF(TYPE(VLOOKUP($A37,FB_19,S$5,0))=16,\"\",VLOOKUP($A37,FB_19,S$5,0))&IF(TYPE(VLOOKUP($A37,FB_20,S$5,0))=16,\"\",VLOOKUP($A37,FB_20,S$5,0))&IF(TYPE(VLOOKUP($A37,FB_21,S$5,0))=16,\"\",VLOOKUP($A37,FB_21,S$5,0))&IF(TYPE(VLOOKUP($A37,FB_22,S$5,0))=16,\"\",VLOOKUP($A37,FB_22,S$5,0))&IF(TYPE(VLOOKUP($A37,FB_23,S$5,0))=16,\"\",VLOOKUP($A37,FB_23,S$5,0))&IF(TYPE(VLOOKUP($A37,FB_24,S$5,0))=16,\"\",VLOOKUP($A37,FB_24,S$5,0))&IF(TYPE(VLOOKUP($A37,FB_25,S$5,0))=16,\"\",VLOOKUP($A37,FB_25,S$5,0))&IF(TYPE(VLOOKUP($A37,FB_26,S$5,0))=16,\"\",VLOOKUP($A37,FB_26,S$5,0))&IF(TYPE(VLOOKUP($A37,FB_27,S$5,0))=16,\"\",VLOOKUP($A37,FB_27,S$5,0))&IF(TYPE(VLOOKUP($A37,FB_28,S$5,0))=16,\"\",VLOOKUP($A37,FB_28,S$5,0))&IF(TYPE(VLOOKUP($A37,FB_29,S$5,0))=16,\"\",VLOOKUP($A37,FB_29,S$5,0))&IF(TYPE(VLOOKUP($A37,FB_30,S$5,0))=16,\"\",VLOOKUP($A37,FB_30,S$5,0)))","v":""},null,null,null,null,null,null,null,null,null,null,null,null,null,null,null,null,"",":","","",""]
["9.",{"$f":"IF(TYPE(VLOOKUP($A38,FB_1,2,0))=16,\"\",VLOOKUP($A38,FB_1,2,0))&IF(TYPE(VLOOKUP($A38,FB_2,2,0))=16,\"\",VLOOKUP($A38,FB_2,2,0))&IF(TYPE(VLOOKUP($A38,FB_3,2,0))=16,\"\",VLOOKUP($A38,FB_3,2,0))&IF(TYPE(VLOOKUP($A38,FB_4,2,0))=16,\"\",VLOOKUP($A38,FB_4,2,0))&IF(TYPE(VLOOKUP($A38,FB_5,2,0))=16,\"\",VLOOKUP($A38,FB_5,2,0))&IF(TYPE(VLOOKUP($A38,FB_6,2,0))=16,\"\",VLOOKUP($A38,FB_6,2,0))&IF(TYPE(VLOOKUP($A38,FB_7,2,0))=16,\"\",VLOOKUP($A38,FB_7,2,0))&IF(TYPE(VLOOKUP($A38,FB_8,2,0))=16,\"\",VLOOKUP($A38,FB_8,2,0))&IF(TYPE(VLOOKUP($A38,FB_9,2,0))=16,\"\",VLOOKUP($A38,FB_9,2,0))&IF(TYPE(VLOOKUP($A38,FB_10,2,0))=16,\"\",VLOOKUP($A38,FB_10,2,0))&IF(TYPE(VLOOKUP($A38,FB_11,2,0))=16,\"\",VLOOKUP($A38,FB_11,2,0))&IF(TYPE(VLOOKUP($A38,FB_12,2,0))=16,\"\",VLOOKUP($A38,FB_12,2,0))&IF(TYPE(VLOOKUP($A38,FB_13,2,0))=16,\"\",VLOOKUP($A38,FB_13,2,0))&IF(TYPE(VLOOKUP($A38,FB_14,2,0))=16,\"\",VLOOKUP($A38,FB_14,2,0))&IF(TYPE(VLOOKUP($A38,FB_15,2,0))=16,\"\",VLOOKUP($A38,FB_15,2,0))&IF(TYPE(VLOOKUP($A38,FB_16,2,0))=16,\"\",VLOOKUP($A38,FB_16,2,0))&IF(TYPE(VLOOKUP($A38,FB_17,2,0))=16,\"\",VLOOKUP($A38,FB_17,2,0))&IF(TYPE(VLOOKUP($A38,FB_18,2,0))=16,\"\",VLOOKUP($A38,FB_18,2,0))&IF(TYPE(VLOOKUP($A38,FB_19,2,0))=16,\"\",VLOOKUP($A38,FB_19,2,0))&IF(TYPE(VLOOKUP($A38,FB_20,2,0))=16,\"\",VLOOKUP($A38,FB_20,2,0))&IF(TYPE(VLOOKUP($A38,FB_21,2,0))=16,\"\",VLOOKUP($A38,FB_21,2,0))&IF(TYPE(VLOOKUP($A38,FB_22,2,0))=16,\"\",VLOOKUP($A38,FB_22,2,0))&IF(TYPE(VLOOKUP($A38,FB_23,2,0))=16,\"\",VLOOKUP($A38,FB_23,2,0))&IF(TYPE(VLOOKUP($A38,FB_24,2,0))=16,\"\",VLOOKUP($A38,FB_24,2,0))&IF(TYPE(VLOOKUP($A38,FB_25,2,0))=16,\"\",VLOOKUP($A38,FB_25,2,0))&IF(TYPE(VLOOKUP($A38,FB_26,2,0))=16,\"\",VLOOKUP($A38,FB_26,2,0))&IF(TYPE(VLOOKUP($A38,FB_27,2,0))=16,\"\",VLOOKUP($A38,FB_27,2,0))&IF(TYPE(VLOOKUP($A38,FB_28,2,0))=16,\"\",VLOOKUP($A38,FB_28,2,0))&IF(TYPE(VLOOKUP($A38,FB_29,2,0))=16,\"\",VLOOKUP($A38,FB_29,2,0))&IF(TYPE(VLOOKUP($A38,FB_30,2,0))=16,\"\",VLOOKUP($A38,FB_30,2,0))","v":""},null,{"$f":"IF($B38=\"\",\"\",_xlfn.NUMBERVALUE(IF(TYPE(VLOOKUP($A38,FB_1,P$5,0))=16,\"\",VLOOKUP($A38,FB_1,P$5,0))&IF(TYPE(VLOOKUP($A38,FB_2,P$5,0))=16,\"\",VLOOKUP($A38,FB_2,P$5,0))&IF(TYPE(VLOOKUP($A38,FB_3,P$5,0))=16,\"\",VLOOKUP($A38,FB_3,P$5,0))&IF(TYPE(VLOOKUP($A38,FB_4,P$5,0))=16,\"\",VLOOKUP($A38,FB_4,P$5,0))&IF(TYPE(VLOOKUP($A38,FB_5,P$5,0))=16,\"\",VLOOKUP($A38,FB_5,P$5,0))&IF(TYPE(VLOOKUP($A38,FB_6,P$5,0))=16,\"\",VLOOKUP($A38,FB_6,P$5,0))&IF(TYPE(VLOOKUP($A38,FB_7,P$5,0))=16,\"\",VLOOKUP($A38,FB_7,P$5,0))&IF(TYPE(VLOOKUP($A38,FB_8,P$5,0))=16,\"\",VLOOKUP($A38,FB_8,P$5,0))&IF(TYPE(VLOOKUP($A38,FB_9,P$5,0))=16,\"\",VLOOKUP($A38,FB_9,P$5,0))&IF(TYPE(VLOOKUP($A38,FB_10,P$5,0))=16,\"\",VLOOKUP($A38,FB_10,P$5,0))&IF(TYPE(VLOOKUP($A38,FB_11,P$5,0))=16,\"\",VLOOKUP($A38,FB_11,P$5,0))&IF(TYPE(VLOOKUP($A38,FB_12,P$5,0))=16,\"\",VLOOKUP($A38,FB_12,P$5,0))&IF(TYPE(VLOOKUP($A38,FB_13,P$5,0))=16,\"\",VLOOKUP($A38,FB_13,P$5,0))&IF(TYPE(VLOOKUP($A38,FB_14,P$5,0))=16,\"\",VLOOKUP($A38,FB_14,P$5,0))&IF(TYPE(VLOOKUP($A38,FB_15,P$5,0))=16,\"\",VLOOKUP($A38,FB_15,P$5,0))&IF(TYPE(VLOOKUP($A38,FB_16,P$5,0))=16,\"\",VLOOKUP($A38,FB_16,P$5,0))&IF(TYPE(VLOOKUP($A38,FB_17,P$5,0))=16,\"\",VLOOKUP($A38,FB_17,P$5,0))&IF(TYPE(VLOOKUP($A38,FB_18,P$5,0))=16,\"\",VLOOKUP($A38,FB_18,P$5,0))&IF(TYPE(VLOOKUP($A38,FB_19,P$5,0))=16,\"\",VLOOKUP($A38,FB_19,P$5,0))&IF(TYPE(VLOOKUP($A38,FB_20,P$5,0))=16,\"\",VLOOKUP($A38,FB_20,P$5,0))&IF(TYPE(VLOOKUP($A38,FB_21,P$5,0))=16,\"\",VLOOKUP($A38,FB_21,P$5,0))&IF(TYPE(VLOOKUP($A38,FB_22,P$5,0))=16,\"\",VLOOKUP($A38,FB_22,P$5,0))&IF(TYPE(VLOOKUP($A38,FB_23,P$5,0))=16,\"\",VLOOKUP($A38,FB_23,P$5,0))&IF(TYPE(VLOOKUP($A38,FB_24,P$5,0))=16,\"\",VLOOKUP($A38,FB_24,P$5,0))&IF(TYPE(VLOOKUP($A38,FB_25,P$5,0))=16,\"\",VLOOKUP($A38,FB_25,P$5,0))&IF(TYPE(VLOOKUP($A38,FB_26,P$5,0))=16,\"\",VLOOKUP($A38,FB_26,P$5,0))&IF(TYPE(VLOOKUP($A38,FB_27,P$5,0))=16,\"\",VLOOKUP($A38,FB_27,P$5,0))&IF(TYPE(VLOOKUP($A38,FB_28,P$5,0))=16,\"\",VLOOKUP($A38,FB_28,P$5,0))&IF(TYPE(VLOOKUP($A38,FB_29,P$5,0))=16,\"\",VLOOKUP($A38,FB_29,P$5,0))&IF(TYPE(VLOOKUP($A38,FB_30,P$5,0))=16,\"\",VLOOKUP($A38,FB_30,P$5,0))))","v":""},"",{"$f":"IF($B38=\"\",\"\",_xlfn.NUMBERVALUE(IF(TYPE(VLOOKUP($A38,FB_1,R$5,0))=16,\"\",VLOOKUP($A38,FB_1,R$5,0))&IF(TYPE(VLOOKUP($A38,FB_2,R$5,0))=16,\"\",VLOOKUP($A38,FB_2,R$5,0))&IF(TYPE(VLOOKUP($A38,FB_3,R$5,0))=16,\"\",VLOOKUP($A38,FB_3,R$5,0))&IF(TYPE(VLOOKUP($A38,FB_4,R$5,0))=16,\"\",VLOOKUP($A38,FB_4,R$5,0))&IF(TYPE(VLOOKUP($A38,FB_5,R$5,0))=16,\"\",VLOOKUP($A38,FB_5,R$5,0))&IF(TYPE(VLOOKUP($A38,FB_6,R$5,0))=16,\"\",VLOOKUP($A38,FB_6,R$5,0))&IF(TYPE(VLOOKUP($A38,FB_7,R$5,0))=16,\"\",VLOOKUP($A38,FB_7,R$5,0))&IF(TYPE(VLOOKUP($A38,FB_8,R$5,0))=16,\"\",VLOOKUP($A38,FB_8,R$5,0))&IF(TYPE(VLOOKUP($A38,FB_9,R$5,0))=16,\"\",VLOOKUP($A38,FB_9,R$5,0))&IF(TYPE(VLOOKUP($A38,FB_10,R$5,0))=16,\"\",VLOOKUP($A38,FB_10,R$5,0))&IF(TYPE(VLOOKUP($A38,FB_11,R$5,0))=16,\"\",VLOOKUP($A38,FB_11,R$5,0))&IF(TYPE(VLOOKUP($A38,FB_12,R$5,0))=16,\"\",VLOOKUP($A38,FB_12,R$5,0))&IF(TYPE(VLOOKUP($A38,FB_13,R$5,0))=16,\"\",VLOOKUP($A38,FB_13,R$5,0))&IF(TYPE(VLOOKUP($A38,FB_14,R$5,0))=16,\"\",VLOOKUP($A38,FB_14,R$5,0))&IF(TYPE(VLOOKUP($A38,FB_15,R$5,0))=16,\"\",VLOOKUP($A38,FB_15,R$5,0))&IF(TYPE(VLOOKUP($A38,FB_16,R$5,0))=16,\"\",VLOOKUP($A38,FB_16,R$5,0))&IF(TYPE(VLOOKUP($A38,FB_17,R$5,0))=16,\"\",VLOOKUP($A38,FB_17,R$5,0))&IF(TYPE(VLOOKUP($A38,FB_18,R$5,0))=16,\"\",VLOOKUP($A38,FB_18,R$5,0))&IF(TYPE(VLOOKUP($A38,FB_19,R$5,0))=16,\"\",VLOOKUP($A38,FB_19,R$5,0))&IF(TYPE(VLOOKUP($A38,FB_20,R$5,0))=16,\"\",VLOOKUP($A38,FB_20,R$5,0))&IF(TYPE(VLOOKUP($A38,FB_21,R$5,0))=16,\"\",VLOOKUP($A38,FB_21,R$5,0))&IF(TYPE(VLOOKUP($A38,FB_22,R$5,0))=16,\"\",VLOOKUP($A38,FB_22,R$5,0))&IF(TYPE(VLOOKUP($A38,FB_23,R$5,0))=16,\"\",VLOOKUP($A38,FB_23,R$5,0))&IF(TYPE(VLOOKUP($A38,FB_24,R$5,0))=16,\"\",VLOOKUP($A38,FB_24,R$5,0))&IF(TYPE(VLOOKUP($A38,FB_25,R$5,0))=16,\"\",VLOOKUP($A38,FB_25,R$5,0))&IF(TYPE(VLOOKUP($A38,FB_26,R$5,0))=16,\"\",VLOOKUP($A38,FB_26,R$5,0))&IF(TYPE(VLOOKUP($A38,FB_27,R$5,0))=16,\"\",VLOOKUP($A38,FB_27,R$5,0))&IF(TYPE(VLOOKUP($A38,FB_28,R$5,0))=16,\"\",VLOOKUP($A38,FB_28,R$5,0))&IF(TYPE(VLOOKUP($A38,FB_29,R$5,0))=16,\"\",VLOOKUP($A38,FB_29,R$5,0))&IF(TYPE(VLOOKUP($A38,FB_30,R$5,0))=16,\"\",VLOOKUP($A38,FB_30,R$5,0))))","v":""},{"$f":"IF($B38=\"\",\"\",IF(TYPE(VLOOKUP($A38,FB_1,S$5,0))=16,\"\",VLOOKUP($A38,FB_1,S$5,0))&IF(TYPE(VLOOKUP($A38,FB_2,S$5,0))=16,\"\",VLOOKUP($A38,FB_2,S$5,0))&IF(TYPE(VLOOKUP($A38,FB_3,S$5,0))=16,\"\",VLOOKUP($A38,FB_3,S$5,0))&IF(TYPE(VLOOKUP($A38,FB_4,S$5,0))=16,\"\",VLOOKUP($A38,FB_4,S$5,0))&IF(TYPE(VLOOKUP($A38,FB_5,S$5,0))=16,\"\",VLOOKUP($A38,FB_5,S$5,0))&IF(TYPE(VLOOKUP($A38,FB_6,S$5,0))=16,\"\",VLOOKUP($A38,FB_6,S$5,0))&IF(TYPE(VLOOKUP($A38,FB_7,S$5,0))=16,\"\",VLOOKUP($A38,FB_7,S$5,0))&IF(TYPE(VLOOKUP($A38,FB_8,S$5,0))=16,\"\",VLOOKUP($A38,FB_8,S$5,0))&IF(TYPE(VLOOKUP($A38,FB_9,S$5,0))=16,\"\",VLOOKUP($A38,FB_9,S$5,0))&IF(TYPE(VLOOKUP($A38,FB_10,S$5,0))=16,\"\",VLOOKUP($A38,FB_10,S$5,0))&IF(TYPE(VLOOKUP($A38,FB_11,S$5,0))=16,\"\",VLOOKUP($A38,FB_11,S$5,0))&IF(TYPE(VLOOKUP($A38,FB_12,S$5,0))=16,\"\",VLOOKUP($A38,FB_12,S$5,0))&IF(TYPE(VLOOKUP($A38,FB_13,S$5,0))=16,\"\",VLOOKUP($A38,FB_13,S$5,0))&IF(TYPE(VLOOKUP($A38,FB_14,S$5,0))=16,\"\",VLOOKUP($A38,FB_14,S$5,0))&IF(TYPE(VLOOKUP($A38,FB_15,S$5,0))=16,\"\",VLOOKUP($A38,FB_15,S$5,0))&IF(TYPE(VLOOKUP($A38,FB_16,S$5,0))=16,\"\",VLOOKUP($A38,FB_16,S$5,0))&IF(TYPE(VLOOKUP($A38,FB_17,S$5,0))=16,\"\",VLOOKUP($A38,FB_17,S$5,0))&IF(TYPE(VLOOKUP($A38,FB_18,S$5,0))=16,\"\",VLOOKUP($A38,FB_18,S$5,0))&IF(TYPE(VLOOKUP($A38,FB_19,S$5,0))=16,\"\",VLOOKUP($A38,FB_19,S$5,0))&IF(TYPE(VLOOKUP($A38,FB_20,S$5,0))=16,\"\",VLOOKUP($A38,FB_20,S$5,0))&IF(TYPE(VLOOKUP($A38,FB_21,S$5,0))=16,\"\",VLOOKUP($A38,FB_21,S$5,0))&IF(TYPE(VLOOKUP($A38,FB_22,S$5,0))=16,\"\",VLOOKUP($A38,FB_22,S$5,0))&IF(TYPE(VLOOKUP($A38,FB_23,S$5,0))=16,\"\",VLOOKUP($A38,FB_23,S$5,0))&IF(TYPE(VLOOKUP($A38,FB_24,S$5,0))=16,\"\",VLOOKUP($A38,FB_24,S$5,0))&IF(TYPE(VLOOKUP($A38,FB_25,S$5,0))=16,\"\",VLOOKUP($A38,FB_25,S$5,0))&IF(TYPE(VLOOKUP($A38,FB_26,S$5,0))=16,\"\",VLOOKUP($A38,FB_26,S$5,0))&IF(TYPE(VLOOKUP($A38,FB_27,S$5,0))=16,\"\",VLOOKUP($A38,FB_27,S$5,0))&IF(TYPE(VLOOKUP($A38,FB_28,S$5,0))=16,\"\",VLOOKUP($A38,FB_28,S$5,0))&IF(TYPE(VLOOKUP($A38,FB_29,S$5,0))=16,\"\",VLOOKUP($A38,FB_29,S$5,0))&IF(TYPE(VLOOKUP($A38,FB_30,S$5,0))=16,\"\",VLOOKUP($A38,FB_30,S$5,0)))","v":""},null,null,null,null,null,null,null,null,null,null,null,null,null,null,null,null,"",":","","",""]
["10.",{"$f":"IF(TYPE(VLOOKUP($A39,FB_1,2,0))=16,\"\",VLOOKUP($A39,FB_1,2,0))&IF(TYPE(VLOOKUP($A39,FB_2,2,0))=16,\"\",VLOOKUP($A39,FB_2,2,0))&IF(TYPE(VLOOKUP($A39,FB_3,2,0))=16,\"\",VLOOKUP($A39,FB_3,2,0))&IF(TYPE(VLOOKUP($A39,FB_4,2,0))=16,\"\",VLOOKUP($A39,FB_4,2,0))&IF(TYPE(VLOOKUP($A39,FB_5,2,0))=16,\"\",VLOOKUP($A39,FB_5,2,0))&IF(TYPE(VLOOKUP($A39,FB_6,2,0))=16,\"\",VLOOKUP($A39,FB_6,2,0))&IF(TYPE(VLOOKUP($A39,FB_7,2,0))=16,\"\",VLOOKUP($A39,FB_7,2,0))&IF(TYPE(VLOOKUP($A39,FB_8,2,0))=16,\"\",VLOOKUP($A39,FB_8,2,0))&IF(TYPE(VLOOKUP($A39,FB_9,2,0))=16,\"\",VLOOKUP($A39,FB_9,2,0))&IF(TYPE(VLOOKUP($A39,FB_10,2,0))=16,\"\",VLOOKUP($A39,FB_10,2,0))&IF(TYPE(VLOOKUP($A39,FB_11,2,0))=16,\"\",VLOOKUP($A39,FB_11,2,0))&IF(TYPE(VLOOKUP($A39,FB_12,2,0))=16,\"\",VLOOKUP($A39,FB_12,2,0))&IF(TYPE(VLOOKUP($A39,FB_13,2,0))=16,\"\",VLOOKUP($A39,FB_13,2,0))&IF(TYPE(VLOOKUP($A39,FB_14,2,0))=16,\"\",VLOOKUP($A39,FB_14,2,0))&IF(TYPE(VLOOKUP($A39,FB_15,2,0))=16,\"\",VLOOKUP($A39,FB_15,2,0))&IF(TYPE(VLOOKUP($A39,FB_16,2,0))=16,\"\",VLOOKUP($A39,FB_16,2,0))&IF(TYPE(VLOOKUP($A39,FB_17,2,0))=16,\"\",VLOOKUP($A39,FB_17,2,0))&IF(TYPE(VLOOKUP($A39,FB_18,2,0))=16,\"\",VLOOKUP($A39,FB_18,2,0))&IF(TYPE(VLOOKUP($A39,FB_19,2,0))=16,\"\",VLOOKUP($A39,FB_19,2,0))&IF(TYPE(VLOOKUP($A39,FB_20,2,0))=16,\"\",VLOOKUP($A39,FB_20,2,0))&IF(TYPE(VLOOKUP($A39,FB_21,2,0))=16,\"\",VLOOKUP($A39,FB_21,2,0))&IF(TYPE(VLOOKUP($A39,FB_22,2,0))=16,\"\",VLOOKUP($A39,FB_22,2,0))&IF(TYPE(VLOOKUP($A39,FB_23,2,0))=16,\"\",VLOOKUP($A39,FB_23,2,0))&IF(TYPE(VLOOKUP($A39,FB_24,2,0))=16,\"\",VLOOKUP($A39,FB_24,2,0))&IF(TYPE(VLOOKUP($A39,FB_25,2,0))=16,\"\",VLOOKUP($A39,FB_25,2,0))&IF(TYPE(VLOOKUP($A39,FB_26,2,0))=16,\"\",VLOOKUP($A39,FB_26,2,0))&IF(TYPE(VLOOKUP($A39,FB_27,2,0))=16,\"\",VLOOKUP($A39,FB_27,2,0))&IF(TYPE(VLOOKUP($A39,FB_28,2,0))=16,\"\",VLOOKUP($A39,FB_28,2,0))&IF(TYPE(VLOOKUP($A39,FB_29,2,0))=16,\"\",VLOOKUP($A39,FB_29,2,0))&IF(TYPE(VLOOKUP($A39,FB_30,2,0))=16,\"\",VLOOKUP($A39,FB_30,2,0))","v":""},null,{"$f":"IF($B39=\"\",\"\",_xlfn.NUMBERVALUE(IF(TYPE(VLOOKUP($A39,FB_1,P$5,0))=16,\"\",VLOOKUP($A39,FB_1,P$5,0))&IF(TYPE(VLOOKUP($A39,FB_2,P$5,0))=16,\"\",VLOOKUP($A39,FB_2,P$5,0))&IF(TYPE(VLOOKUP($A39,FB_3,P$5,0))=16,\"\",VLOOKUP($A39,FB_3,P$5,0))&IF(TYPE(VLOOKUP($A39,FB_4,P$5,0))=16,\"\",VLOOKUP($A39,FB_4,P$5,0))&IF(TYPE(VLOOKUP($A39,FB_5,P$5,0))=16,\"\",VLOOKUP($A39,FB_5,P$5,0))&IF(TYPE(VLOOKUP($A39,FB_6,P$5,0))=16,\"\",VLOOKUP($A39,FB_6,P$5,0))&IF(TYPE(VLOOKUP($A39,FB_7,P$5,0))=16,\"\",VLOOKUP($A39,FB_7,P$5,0))&IF(TYPE(VLOOKUP($A39,FB_8,P$5,0))=16,\"\",VLOOKUP($A39,FB_8,P$5,0))&IF(TYPE(VLOOKUP($A39,FB_9,P$5,0))=16,\"\",VLOOKUP($A39,FB_9,P$5,0))&IF(TYPE(VLOOKUP($A39,FB_10,P$5,0))=16,\"\",VLOOKUP($A39,FB_10,P$5,0))&IF(TYPE(VLOOKUP($A39,FB_11,P$5,0))=16,\"\",VLOOKUP($A39,FB_11,P$5,0))&IF(TYPE(VLOOKUP($A39,FB_12,P$5,0))=16,\"\",VLOOKUP($A39,FB_12,P$5,0))&IF(TYPE(VLOOKUP($A39,FB_13,P$5,0))=16,\"\",VLOOKUP($A39,FB_13,P$5,0))&IF(TYPE(VLOOKUP($A39,FB_14,P$5,0))=16,\"\",VLOOKUP($A39,FB_14,P$5,0))&IF(TYPE(VLOOKUP($A39,FB_15,P$5,0))=16,\"\",VLOOKUP($A39,FB_15,P$5,0))&IF(TYPE(VLOOKUP($A39,FB_16,P$5,0))=16,\"\",VLOOKUP($A39,FB_16,P$5,0))&IF(TYPE(VLOOKUP($A39,FB_17,P$5,0))=16,\"\",VLOOKUP($A39,FB_17,P$5,0))&IF(TYPE(VLOOKUP($A39,FB_18,P$5,0))=16,\"\",VLOOKUP($A39,FB_18,P$5,0))&IF(TYPE(VLOOKUP($A39,FB_19,P$5,0))=16,\"\",VLOOKUP($A39,FB_19,P$5,0))&IF(TYPE(VLOOKUP($A39,FB_20,P$5,0))=16,\"\",VLOOKUP($A39,FB_20,P$5,0))&IF(TYPE(VLOOKUP($A39,FB_21,P$5,0))=16,\"\",VLOOKUP($A39,FB_21,P$5,0))&IF(TYPE(VLOOKUP($A39,FB_22,P$5,0))=16,\"\",VLOOKUP($A39,FB_22,P$5,0))&IF(TYPE(VLOOKUP($A39,FB_23,P$5,0))=16,\"\",VLOOKUP($A39,FB_23,P$5,0))&IF(TYPE(VLOOKUP($A39,FB_24,P$5,0))=16,\"\",VLOOKUP($A39,FB_24,P$5,0))&IF(TYPE(VLOOKUP($A39,FB_25,P$5,0))=16,\"\",VLOOKUP($A39,FB_25,P$5,0))&IF(TYPE(VLOOKUP($A39,FB_26,P$5,0))=16,\"\",VLOOKUP($A39,FB_26,P$5,0))&IF(TYPE(VLOOKUP($A39,FB_27,P$5,0))=16,\"\",VLOOKUP($A39,FB_27,P$5,0))&IF(TYPE(VLOOKUP($A39,FB_28,P$5,0))=16,\"\",VLOOKUP($A39,FB_28,P$5,0))&IF(TYPE(VLOOKUP($A39,FB_29,P$5,0))=16,\"\",VLOOKUP($A39,FB_29,P$5,0))&IF(TYPE(VLOOKUP($A39,FB_30,P$5,0))=16,\"\",VLOOKUP($A39,FB_30,P$5,0))))","v":""},"",{"$f":"IF($B39=\"\",\"\",_xlfn.NUMBERVALUE(IF(TYPE(VLOOKUP($A39,FB_1,R$5,0))=16,\"\",VLOOKUP($A39,FB_1,R$5,0))&IF(TYPE(VLOOKUP($A39,FB_2,R$5,0))=16,\"\",VLOOKUP($A39,FB_2,R$5,0))&IF(TYPE(VLOOKUP($A39,FB_3,R$5,0))=16,\"\",VLOOKUP($A39,FB_3,R$5,0))&IF(TYPE(VLOOKUP($A39,FB_4,R$5,0))=16,\"\",VLOOKUP($A39,FB_4,R$5,0))&IF(TYPE(VLOOKUP($A39,FB_5,R$5,0))=16,\"\",VLOOKUP($A39,FB_5,R$5,0))&IF(TYPE(VLOOKUP($A39,FB_6,R$5,0))=16,\"\",VLOOKUP($A39,FB_6,R$5,0))&IF(TYPE(VLOOKUP($A39,FB_7,R$5,0))=16,\"\",VLOOKUP($A39,FB_7,R$5,0))&IF(TYPE(VLOOKUP($A39,FB_8,R$5,0))=16,\"\",VLOOKUP($A39,FB_8,R$5,0))&IF(TYPE(VLOOKUP($A39,FB_9,R$5,0))=16,\"\",VLOOKUP($A39,FB_9,R$5,0))&IF(TYPE(VLOOKUP($A39,FB_10,R$5,0))=16,\"\",VLOOKUP($A39,FB_10,R$5,0))&IF(TYPE(VLOOKUP($A39,FB_11,R$5,0))=16,\"\",VLOOKUP($A39,FB_11,R$5,0))&IF(TYPE(VLOOKUP($A39,FB_12,R$5,0))=16,\"\",VLOOKUP($A39,FB_12,R$5,0))&IF(TYPE(VLOOKUP($A39,FB_13,R$5,0))=16,\"\",VLOOKUP($A39,FB_13,R$5,0))&IF(TYPE(VLOOKUP($A39,FB_14,R$5,0))=16,\"\",VLOOKUP($A39,FB_14,R$5,0))&IF(TYPE(VLOOKUP($A39,FB_15,R$5,0))=16,\"\",VLOOKUP($A39,FB_15,R$5,0))&IF(TYPE(VLOOKUP($A39,FB_16,R$5,0))=16,\"\",VLOOKUP($A39,FB_16,R$5,0))&IF(TYPE(VLOOKUP($A39,FB_17,R$5,0))=16,\"\",VLOOKUP($A39,FB_17,R$5,0))&IF(TYPE(VLOOKUP($A39,FB_18,R$5,0))=16,\"\",VLOOKUP($A39,FB_18,R$5,0))&IF(TYPE(VLOOKUP($A39,FB_19,R$5,0))=16,\"\",VLOOKUP($A39,FB_19,R$5,0))&IF(TYPE(VLOOKUP($A39,FB_20,R$5,0))=16,\"\",VLOOKUP($A39,FB_20,R$5,0))&IF(TYPE(VLOOKUP($A39,FB_21,R$5,0))=16,\"\",VLOOKUP($A39,FB_21,R$5,0))&IF(TYPE(VLOOKUP($A39,FB_22,R$5,0))=16,\"\",VLOOKUP($A39,FB_22,R$5,0))&IF(TYPE(VLOOKUP($A39,FB_23,R$5,0))=16,\"\",VLOOKUP($A39,FB_23,R$5,0))&IF(TYPE(VLOOKUP($A39,FB_24,R$5,0))=16,\"\",VLOOKUP($A39,FB_24,R$5,0))&IF(TYPE(VLOOKUP($A39,FB_25,R$5,0))=16,\"\",VLOOKUP($A39,FB_25,R$5,0))&IF(TYPE(VLOOKUP($A39,FB_26,R$5,0))=16,\"\",VLOOKUP($A39,FB_26,R$5,0))&IF(TYPE(VLOOKUP($A39,FB_27,R$5,0))=16,\"\",VLOOKUP($A39,FB_27,R$5,0))&IF(TYPE(VLOOKUP($A39,FB_28,R$5,0))=16,\"\",VLOOKUP($A39,FB_28,R$5,0))&IF(TYPE(VLOOKUP($A39,FB_29,R$5,0))=16,\"\",VLOOKUP($A39,FB_29,R$5,0))&IF(TYPE(VLOOKUP($A39,FB_30,R$5,0))=16,\"\",VLOOKUP($A39,FB_30,R$5,0))))","v":""},{"$f":"IF($B39=\"\",\"\",IF(TYPE(VLOOKUP($A39,FB_1,S$5,0))=16,\"\",VLOOKUP($A39,FB_1,S$5,0))&IF(TYPE(VLOOKUP($A39,FB_2,S$5,0))=16,\"\",VLOOKUP($A39,FB_2,S$5,0))&IF(TYPE(VLOOKUP($A39,FB_3,S$5,0))=16,\"\",VLOOKUP($A39,FB_3,S$5,0))&IF(TYPE(VLOOKUP($A39,FB_4,S$5,0))=16,\"\",VLOOKUP($A39,FB_4,S$5,0))&IF(TYPE(VLOOKUP($A39,FB_5,S$5,0))=16,\"\",VLOOKUP($A39,FB_5,S$5,0))&IF(TYPE(VLOOKUP($A39,FB_6,S$5,0))=16,\"\",VLOOKUP($A39,FB_6,S$5,0))&IF(TYPE(VLOOKUP($A39,FB_7,S$5,0))=16,\"\",VLOOKUP($A39,FB_7,S$5,0))&IF(TYPE(VLOOKUP($A39,FB_8,S$5,0))=16,\"\",VLOOKUP($A39,FB_8,S$5,0))&IF(TYPE(VLOOKUP($A39,FB_9,S$5,0))=16,\"\",VLOOKUP($A39,FB_9,S$5,0))&IF(TYPE(VLOOKUP($A39,FB_10,S$5,0))=16,\"\",VLOOKUP($A39,FB_10,S$5,0))&IF(TYPE(VLOOKUP($A39,FB_11,S$5,0))=16,\"\",VLOOKUP($A39,FB_11,S$5,0))&IF(TYPE(VLOOKUP($A39,FB_12,S$5,0))=16,\"\",VLOOKUP($A39,FB_12,S$5,0))&IF(TYPE(VLOOKUP($A39,FB_13,S$5,0))=16,\"\",VLOOKUP($A39,FB_13,S$5,0))&IF(TYPE(VLOOKUP($A39,FB_14,S$5,0))=16,\"\",VLOOKUP($A39,FB_14,S$5,0))&IF(TYPE(VLOOKUP($A39,FB_15,S$5,0))=16,\"\",VLOOKUP($A39,FB_15,S$5,0))&IF(TYPE(VLOOKUP($A39,FB_16,S$5,0))=16,\"\",VLOOKUP($A39,FB_16,S$5,0))&IF(TYPE(VLOOKUP($A39,FB_17,S$5,0))=16,\"\",VLOOKUP($A39,FB_17,S$5,0))&IF(TYPE(VLOOKUP($A39,FB_18,S$5,0))=16,\"\",VLOOKUP($A39,FB_18,S$5,0))&IF(TYPE(VLOOKUP($A39,FB_19,S$5,0))=16,\"\",VLOOKUP($A39,FB_19,S$5,0))&IF(TYPE(VLOOKUP($A39,FB_20,S$5,0))=16,\"\",VLOOKUP($A39,FB_20,S$5,0))&IF(TYPE(VLOOKUP($A39,FB_21,S$5,0))=16,\"\",VLOOKUP($A39,FB_21,S$5,0))&IF(TYPE(VLOOKUP($A39,FB_22,S$5,0))=16,\"\",VLOOKUP($A39,FB_22,S$5,0))&IF(TYPE(VLOOKUP($A39,FB_23,S$5,0))=16,\"\",VLOOKUP($A39,FB_23,S$5,0))&IF(TYPE(VLOOKUP($A39,FB_24,S$5,0))=16,\"\",VLOOKUP($A39,FB_24,S$5,0))&IF(TYPE(VLOOKUP($A39,FB_25,S$5,0))=16,\"\",VLOOKUP($A39,FB_25,S$5,0))&IF(TYPE(VLOOKUP($A39,FB_26,S$5,0))=16,\"\",VLOOKUP($A39,FB_26,S$5,0))&IF(TYPE(VLOOKUP($A39,FB_27,S$5,0))=16,\"\",VLOOKUP($A39,FB_27,S$5,0))&IF(TYPE(VLOOKUP($A39,FB_28,S$5,0))=16,\"\",VLOOKUP($A39,FB_28,S$5,0))&IF(TYPE(VLOOKUP($A39,FB_29,S$5,0))=16,\"\",VLOOKUP($A39,FB_29,S$5,0))&IF(TYPE(VLOOKUP($A39,FB_30,S$5,0))=16,\"\",VLOOKUP($A39,FB_30,S$5,0)))","v":""},null,null,null,null,null,null,null,null,null,null,null,null,null,null,null,null,"",":","","",""]
["11.",{"$f":"IF(TYPE(VLOOKUP($A40,FB_1,2,0))=16,\"\",VLOOKUP($A40,FB_1,2,0))&IF(TYPE(VLOOKUP($A40,FB_2,2,0))=16,\"\",VLOOKUP($A40,FB_2,2,0))&IF(TYPE(VLOOKUP($A40,FB_3,2,0))=16,\"\",VLOOKUP($A40,FB_3,2,0))&IF(TYPE(VLOOKUP($A40,FB_4,2,0))=16,\"\",VLOOKUP($A40,FB_4,2,0))&IF(TYPE(VLOOKUP($A40,FB_5,2,0))=16,\"\",VLOOKUP($A40,FB_5,2,0))&IF(TYPE(VLOOKUP($A40,FB_6,2,0))=16,\"\",VLOOKUP($A40,FB_6,2,0))&IF(TYPE(VLOOKUP($A40,FB_7,2,0))=16,\"\",VLOOKUP($A40,FB_7,2,0))&IF(TYPE(VLOOKUP($A40,FB_8,2,0))=16,\"\",VLOOKUP($A40,FB_8,2,0))&IF(TYPE(VLOOKUP($A40,FB_9,2,0))=16,\"\",VLOOKUP($A40,FB_9,2,0))&IF(TYPE(VLOOKUP($A40,FB_10,2,0))=16,\"\",VLOOKUP($A40,FB_10,2,0))&IF(TYPE(VLOOKUP($A40,FB_11,2,0))=16,\"\",VLOOKUP($A40,FB_11,2,0))&IF(TYPE(VLOOKUP($A40,FB_12,2,0))=16,\"\",VLOOKUP($A40,FB_12,2,0))&IF(TYPE(VLOOKUP($A40,FB_13,2,0))=16,\"\",VLOOKUP($A40,FB_13,2,0))&IF(TYPE(VLOOKUP($A40,FB_14,2,0))=16,\"\",VLOOKUP($A40,FB_14,2,0))&IF(TYPE(VLOOKUP($A40,FB_15,2,0))=16,\"\",VLOOKUP($A40,FB_15,2,0))&IF(TYPE(VLOOKUP($A40,FB_16,2,0))=16,\"\",VLOOKUP($A40,FB_16,2,0))&IF(TYPE(VLOOKUP($A40,FB_17,2,0))=16,\"\",VLOOKUP($A40,FB_17,2,0))&IF(TYPE(VLOOKUP($A40,FB_18,2,0))=16,\"\",VLOOKUP($A40,FB_18,2,0))&IF(TYPE(VLOOKUP($A40,FB_19,2,0))=16,\"\",VLOOKUP($A40,FB_19,2,0))&IF(TYPE(VLOOKUP($A40,FB_20,2,0))=16,\"\",VLOOKUP($A40,FB_20,2,0))&IF(TYPE(VLOOKUP($A40,FB_21,2,0))=16,\"\",VLOOKUP($A40,FB_21,2,0))&IF(TYPE(VLOOKUP($A40,FB_22,2,0))=16,\"\",VLOOKUP($A40,FB_22,2,0))&IF(TYPE(VLOOKUP($A40,FB_23,2,0))=16,\"\",VLOOKUP($A40,FB_23,2,0))&IF(TYPE(VLOOKUP($A40,FB_24,2,0))=16,\"\",VLOOKUP($A40,FB_24,2,0))&IF(TYPE(VLOOKUP($A40,FB_25,2,0))=16,\"\",VLOOKUP($A40,FB_25,2,0))&IF(TYPE(VLOOKUP($A40,FB_26,2,0))=16,\"\",VLOOKUP($A40,FB_26,2,0))&IF(TYPE(VLOOKUP($A40,FB_27,2,0))=16,\"\",VLOOKUP($A40,FB_27,2,0))&IF(TYPE(VLOOKUP($A40,FB_28,2,0))=16,\"\",VLOOKUP($A40,FB_28,2,0))&IF(TYPE(VLOOKUP($A40,FB_29,2,0))=16,\"\",VLOOKUP($A40,FB_29,2,0))&IF(TYPE(VLOOKUP($A40,FB_30,2,0))=16,\"\",VLOOKUP($A40,FB_30,2,0))","v":""},null,{"$f":"IF($B40=\"\",\"\",_xlfn.NUMBERVALUE(IF(TYPE(VLOOKUP($A40,FB_1,P$5,0))=16,\"\",VLOOKUP($A40,FB_1,P$5,0))&IF(TYPE(VLOOKUP($A40,FB_2,P$5,0))=16,\"\",VLOOKUP($A40,FB_2,P$5,0))&IF(TYPE(VLOOKUP($A40,FB_3,P$5,0))=16,\"\",VLOOKUP($A40,FB_3,P$5,0))&IF(TYPE(VLOOKUP($A40,FB_4,P$5,0))=16,\"\",VLOOKUP($A40,FB_4,P$5,0))&IF(TYPE(VLOOKUP($A40,FB_5,P$5,0))=16,\"\",VLOOKUP($A40,FB_5,P$5,0))&IF(TYPE(VLOOKUP($A40,FB_6,P$5,0))=16,\"\",VLOOKUP($A40,FB_6,P$5,0))&IF(TYPE(VLOOKUP($A40,FB_7,P$5,0))=16,\"\",VLOOKUP($A40,FB_7,P$5,0))&IF(TYPE(VLOOKUP($A40,FB_8,P$5,0))=16,\"\",VLOOKUP($A40,FB_8,P$5,0))&IF(TYPE(VLOOKUP($A40,FB_9,P$5,0))=16,\"\",VLOOKUP($A40,FB_9,P$5,0))&IF(TYPE(VLOOKUP($A40,FB_10,P$5,0))=16,\"\",VLOOKUP($A40,FB_10,P$5,0))&IF(TYPE(VLOOKUP($A40,FB_11,P$5,0))=16,\"\",VLOOKUP($A40,FB_11,P$5,0))&IF(TYPE(VLOOKUP($A40,FB_12,P$5,0))=16,\"\",VLOOKUP($A40,FB_12,P$5,0))&IF(TYPE(VLOOKUP($A40,FB_13,P$5,0))=16,\"\",VLOOKUP($A40,FB_13,P$5,0))&IF(TYPE(VLOOKUP($A40,FB_14,P$5,0))=16,\"\",VLOOKUP($A40,FB_14,P$5,0))&IF(TYPE(VLOOKUP($A40,FB_15,P$5,0))=16,\"\",VLOOKUP($A40,FB_15,P$5,0))&IF(TYPE(VLOOKUP($A40,FB_16,P$5,0))=16,\"\",VLOOKUP($A40,FB_16,P$5,0))&IF(TYPE(VLOOKUP($A40,FB_17,P$5,0))=16,\"\",VLOOKUP($A40,FB_17,P$5,0))&IF(TYPE(VLOOKUP($A40,FB_18,P$5,0))=16,\"\",VLOOKUP($A40,FB_18,P$5,0))&IF(TYPE(VLOOKUP($A40,FB_19,P$5,0))=16,\"\",VLOOKUP($A40,FB_19,P$5,0))&IF(TYPE(VLOOKUP($A40,FB_20,P$5,0))=16,\"\",VLOOKUP($A40,FB_20,P$5,0))&IF(TYPE(VLOOKUP($A40,FB_21,P$5,0))=16,\"\",VLOOKUP($A40,FB_21,P$5,0))&IF(TYPE(VLOOKUP($A40,FB_22,P$5,0))=16,\"\",VLOOKUP($A40,FB_22,P$5,0))&IF(TYPE(VLOOKUP($A40,FB_23,P$5,0))=16,\"\",VLOOKUP($A40,FB_23,P$5,0))&IF(TYPE(VLOOKUP($A40,FB_24,P$5,0))=16,\"\",VLOOKUP($A40,FB_24,P$5,0))&IF(TYPE(VLOOKUP($A40,FB_25,P$5,0))=16,\"\",VLOOKUP($A40,FB_25,P$5,0))&IF(TYPE(VLOOKUP($A40,FB_26,P$5,0))=16,\"\",VLOOKUP($A40,FB_26,P$5,0))&IF(TYPE(VLOOKUP($A40,FB_27,P$5,0))=16,\"\",VLOOKUP($A40,FB_27,P$5,0))&IF(TYPE(VLOOKUP($A40,FB_28,P$5,0))=16,\"\",VLOOKUP($A40,FB_28,P$5,0))&IF(TYPE(VLOOKUP($A40,FB_29,P$5,0))=16,\"\",VLOOKUP($A40,FB_29,P$5,0))&IF(TYPE(VLOOKUP($A40,FB_30,P$5,0))=16,\"\",VLOOKUP($A40,FB_30,P$5,0))))","v":""},"",{"$f":"IF($B40=\"\",\"\",_xlfn.NUMBERVALUE(IF(TYPE(VLOOKUP($A40,FB_1,R$5,0))=16,\"\",VLOOKUP($A40,FB_1,R$5,0))&IF(TYPE(VLOOKUP($A40,FB_2,R$5,0))=16,\"\",VLOOKUP($A40,FB_2,R$5,0))&IF(TYPE(VLOOKUP($A40,FB_3,R$5,0))=16,\"\",VLOOKUP($A40,FB_3,R$5,0))&IF(TYPE(VLOOKUP($A40,FB_4,R$5,0))=16,\"\",VLOOKUP($A40,FB_4,R$5,0))&IF(TYPE(VLOOKUP($A40,FB_5,R$5,0))=16,\"\",VLOOKUP($A40,FB_5,R$5,0))&IF(TYPE(VLOOKUP($A40,FB_6,R$5,0))=16,\"\",VLOOKUP($A40,FB_6,R$5,0))&IF(TYPE(VLOOKUP($A40,FB_7,R$5,0))=16,\"\",VLOOKUP($A40,FB_7,R$5,0))&IF(TYPE(VLOOKUP($A40,FB_8,R$5,0))=16,\"\",VLOOKUP($A40,FB_8,R$5,0))&IF(TYPE(VLOOKUP($A40,FB_9,R$5,0))=16,\"\",VLOOKUP($A40,FB_9,R$5,0))&IF(TYPE(VLOOKUP($A40,FB_10,R$5,0))=16,\"\",VLOOKUP($A40,FB_10,R$5,0))&IF(TYPE(VLOOKUP($A40,FB_11,R$5,0))=16,\"\",VLOOKUP($A40,FB_11,R$5,0))&IF(TYPE(VLOOKUP($A40,FB_12,R$5,0))=16,\"\",VLOOKUP($A40,FB_12,R$5,0))&IF(TYPE(VLOOKUP($A40,FB_13,R$5,0))=16,\"\",VLOOKUP($A40,FB_13,R$5,0))&IF(TYPE(VLOOKUP($A40,FB_14,R$5,0))=16,\"\",VLOOKUP($A40,FB_14,R$5,0))&IF(TYPE(VLOOKUP($A40,FB_15,R$5,0))=16,\"\",VLOOKUP($A40,FB_15,R$5,0))&IF(TYPE(VLOOKUP($A40,FB_16,R$5,0))=16,\"\",VLOOKUP($A40,FB_16,R$5,0))&IF(TYPE(VLOOKUP($A40,FB_17,R$5,0))=16,\"\",VLOOKUP($A40,FB_17,R$5,0))&IF(TYPE(VLOOKUP($A40,FB_18,R$5,0))=16,\"\",VLOOKUP($A40,FB_18,R$5,0))&IF(TYPE(VLOOKUP($A40,FB_19,R$5,0))=16,\"\",VLOOKUP($A40,FB_19,R$5,0))&IF(TYPE(VLOOKUP($A40,FB_20,R$5,0))=16,\"\",VLOOKUP($A40,FB_20,R$5,0))&IF(TYPE(VLOOKUP($A40,FB_21,R$5,0))=16,\"\",VLOOKUP($A40,FB_21,R$5,0))&IF(TYPE(VLOOKUP($A40,FB_22,R$5,0))=16,\"\",VLOOKUP($A40,FB_22,R$5,0))&IF(TYPE(VLOOKUP($A40,FB_23,R$5,0))=16,\"\",VLOOKUP($A40,FB_23,R$5,0))&IF(TYPE(VLOOKUP($A40,FB_24,R$5,0))=16,\"\",VLOOKUP($A40,FB_24,R$5,0))&IF(TYPE(VLOOKUP($A40,FB_25,R$5,0))=16,\"\",VLOOKUP($A40,FB_25,R$5,0))&IF(TYPE(VLOOKUP($A40,FB_26,R$5,0))=16,\"\",VLOOKUP($A40,FB_26,R$5,0))&IF(TYPE(VLOOKUP($A40,FB_27,R$5,0))=16,\"\",VLOOKUP($A40,FB_27,R$5,0))&IF(TYPE(VLOOKUP($A40,FB_28,R$5,0))=16,\"\",VLOOKUP($A40,FB_28,R$5,0))&IF(TYPE(VLOOKUP($A40,FB_29,R$5,0))=16,\"\",VLOOKUP($A40,FB_29,R$5,0))&IF(TYPE(VLOOKUP($A40,FB_30,R$5,0))=16,\"\",VLOOKUP($A40,FB_30,R$5,0))))","v":""},{"$f":"IF($B40=\"\",\"\",IF(TYPE(VLOOKUP($A40,FB_1,S$5,0))=16,\"\",VLOOKUP($A40,FB_1,S$5,0))&IF(TYPE(VLOOKUP($A40,FB_2,S$5,0))=16,\"\",VLOOKUP($A40,FB_2,S$5,0))&IF(TYPE(VLOOKUP($A40,FB_3,S$5,0))=16,\"\",VLOOKUP($A40,FB_3,S$5,0))&IF(TYPE(VLOOKUP($A40,FB_4,S$5,0))=16,\"\",VLOOKUP($A40,FB_4,S$5,0))&IF(TYPE(VLOOKUP($A40,FB_5,S$5,0))=16,\"\",VLOOKUP($A40,FB_5,S$5,0))&IF(TYPE(VLOOKUP($A40,FB_6,S$5,0))=16,\"\",VLOOKUP($A40,FB_6,S$5,0))&IF(TYPE(VLOOKUP($A40,FB_7,S$5,0))=16,\"\",VLOOKUP($A40,FB_7,S$5,0))&IF(TYPE(VLOOKUP($A40,FB_8,S$5,0))=16,\"\",VLOOKUP($A40,FB_8,S$5,0))&IF(TYPE(VLOOKUP($A40,FB_9,S$5,0))=16,\"\",VLOOKUP($A40,FB_9,S$5,0))&IF(TYPE(VLOOKUP($A40,FB_10,S$5,0))=16,\"\",VLOOKUP($A40,FB_10,S$5,0))&IF(TYPE(VLOOKUP($A40,FB_11,S$5,0))=16,\"\",VLOOKUP($A40,FB_11,S$5,0))&IF(TYPE(VLOOKUP($A40,FB_12,S$5,0))=16,\"\",VLOOKUP($A40,FB_12,S$5,0))&IF(TYPE(VLOOKUP($A40,FB_13,S$5,0))=16,\"\",VLOOKUP($A40,FB_13,S$5,0))&IF(TYPE(VLOOKUP($A40,FB_14,S$5,0))=16,\"\",VLOOKUP($A40,FB_14,S$5,0))&IF(TYPE(VLOOKUP($A40,FB_15,S$5,0))=16,\"\",VLOOKUP($A40,FB_15,S$5,0))&IF(TYPE(VLOOKUP($A40,FB_16,S$5,0))=16,\"\",VLOOKUP($A40,FB_16,S$5,0))&IF(TYPE(VLOOKUP($A40,FB_17,S$5,0))=16,\"\",VLOOKUP($A40,FB_17,S$5,0))&IF(TYPE(VLOOKUP($A40,FB_18,S$5,0))=16,\"\",VLOOKUP($A40,FB_18,S$5,0))&IF(TYPE(VLOOKUP($A40,FB_19,S$5,0))=16,\"\",VLOOKUP($A40,FB_19,S$5,0))&IF(TYPE(VLOOKUP($A40,FB_20,S$5,0))=16,\"\",VLOOKUP($A40,FB_20,S$5,0))&IF(TYPE(VLOOKUP($A40,FB_21,S$5,0))=16,\"\",VLOOKUP($A40,FB_21,S$5,0))&IF(TYPE(VLOOKUP($A40,FB_22,S$5,0))=16,\"\",VLOOKUP($A40,FB_22,S$5,0))&IF(TYPE(VLOOKUP($A40,FB_23,S$5,0))=16,\"\",VLOOKUP($A40,FB_23,S$5,0))&IF(TYPE(VLOOKUP($A40,FB_24,S$5,0))=16,\"\",VLOOKUP($A40,FB_24,S$5,0))&IF(TYPE(VLOOKUP($A40,FB_25,S$5,0))=16,\"\",VLOOKUP($A40,FB_25,S$5,0))&IF(TYPE(VLOOKUP($A40,FB_26,S$5,0))=16,\"\",VLOOKUP($A40,FB_26,S$5,0))&IF(TYPE(VLOOKUP($A40,FB_27,S$5,0))=16,\"\",VLOOKUP($A40,FB_27,S$5,0))&IF(TYPE(VLOOKUP($A40,FB_28,S$5,0))=16,\"\",VLOOKUP($A40,FB_28,S$5,0))&IF(TYPE(VLOOKUP($A40,FB_29,S$5,0))=16,\"\",VLOOKUP($A40,FB_29,S$5,0))&IF(TYPE(VLOOKUP($A40,FB_30,S$5,0))=16,\"\",VLOOKUP($A40,FB_30,S$5,0)))","v":""},null,null,null,null,null,null,null,null,null,null,null,null,null,null,null,null,"",":","","",""]
["12.",{"$f":"IF(TYPE(VLOOKUP($A41,FB_1,2,0))=16,\"\",VLOOKUP($A41,FB_1,2,0))&IF(TYPE(VLOOKUP($A41,FB_2,2,0))=16,\"\",VLOOKUP($A41,FB_2,2,0))&IF(TYPE(VLOOKUP($A41,FB_3,2,0))=16,\"\",VLOOKUP($A41,FB_3,2,0))&IF(TYPE(VLOOKUP($A41,FB_4,2,0))=16,\"\",VLOOKUP($A41,FB_4,2,0))&IF(TYPE(VLOOKUP($A41,FB_5,2,0))=16,\"\",VLOOKUP($A41,FB_5,2,0))&IF(TYPE(VLOOKUP($A41,FB_6,2,0))=16,\"\",VLOOKUP($A41,FB_6,2,0))&IF(TYPE(VLOOKUP($A41,FB_7,2,0))=16,\"\",VLOOKUP($A41,FB_7,2,0))&IF(TYPE(VLOOKUP($A41,FB_8,2,0))=16,\"\",VLOOKUP($A41,FB_8,2,0))&IF(TYPE(VLOOKUP($A41,FB_9,2,0))=16,\"\",VLOOKUP($A41,FB_9,2,0))&IF(TYPE(VLOOKUP($A41,FB_10,2,0))=16,\"\",VLOOKUP($A41,FB_10,2,0))&IF(TYPE(VLOOKUP($A41,FB_11,2,0))=16,\"\",VLOOKUP($A41,FB_11,2,0))&IF(TYPE(VLOOKUP($A41,FB_12,2,0))=16,\"\",VLOOKUP($A41,FB_12,2,0))&IF(TYPE(VLOOKUP($A41,FB_13,2,0))=16,\"\",VLOOKUP($A41,FB_13,2,0))&IF(TYPE(VLOOKUP($A41,FB_14,2,0))=16,\"\",VLOOKUP($A41,FB_14,2,0))&IF(TYPE(VLOOKUP($A41,FB_15,2,0))=16,\"\",VLOOKUP($A41,FB_15,2,0))&IF(TYPE(VLOOKUP($A41,FB_16,2,0))=16,\"\",VLOOKUP($A41,FB_16,2,0))&IF(TYPE(VLOOKUP($A41,FB_17,2,0))=16,\"\",VLOOKUP($A41,FB_17,2,0))&IF(TYPE(VLOOKUP($A41,FB_18,2,0))=16,\"\",VLOOKUP($A41,FB_18,2,0))&IF(TYPE(VLOOKUP($A41,FB_19,2,0))=16,\"\",VLOOKUP($A41,FB_19,2,0))&IF(TYPE(VLOOKUP($A41,FB_20,2,0))=16,\"\",VLOOKUP($A41,FB_20,2,0))&IF(TYPE(VLOOKUP($A41,FB_21,2,0))=16,\"\",VLOOKUP($A41,FB_21,2,0))&IF(TYPE(VLOOKUP($A41,FB_22,2,0))=16,\"\",VLOOKUP($A41,FB_22,2,0))&IF(TYPE(VLOOKUP($A41,FB_23,2,0))=16,\"\",VLOOKUP($A41,FB_23,2,0))&IF(TYPE(VLOOKUP($A41,FB_24,2,0))=16,\"\",VLOOKUP($A41,FB_24,2,0))&IF(TYPE(VLOOKUP($A41,FB_25,2,0))=16,\"\",VLOOKUP($A41,FB_25,2,0))&IF(TYPE(VLOOKUP($A41,FB_26,2,0))=16,\"\",VLOOKUP($A41,FB_26,2,0))&IF(TYPE(VLOOKUP($A41,FB_27,2,0))=16,\"\",VLOOKUP($A41,FB_27,2,0))&IF(TYPE(VLOOKUP($A41,FB_28,2,0))=16,\"\",VLOOKUP($A41,FB_28,2,0))&IF(TYPE(VLOOKUP($A41,FB_29,2,0))=16,\"\",VLOOKUP($A41,FB_29,2,0))&IF(TYPE(VLOOKUP($A41,FB_30,2,0))=16,\"\",VLOOKUP($A41,FB_30,2,0))","v":""},null,{"$f":"IF($B41=\"\",\"\",_xlfn.NUMBERVALUE(IF(TYPE(VLOOKUP($A41,FB_1,P$5,0))=16,\"\",VLOOKUP($A41,FB_1,P$5,0))&IF(TYPE(VLOOKUP($A41,FB_2,P$5,0))=16,\"\",VLOOKUP($A41,FB_2,P$5,0))&IF(TYPE(VLOOKUP($A41,FB_3,P$5,0))=16,\"\",VLOOKUP($A41,FB_3,P$5,0))&IF(TYPE(VLOOKUP($A41,FB_4,P$5,0))=16,\"\",VLOOKUP($A41,FB_4,P$5,0))&IF(TYPE(VLOOKUP($A41,FB_5,P$5,0))=16,\"\",VLOOKUP($A41,FB_5,P$5,0))&IF(TYPE(VLOOKUP($A41,FB_6,P$5,0))=16,\"\",VLOOKUP($A41,FB_6,P$5,0))&IF(TYPE(VLOOKUP($A41,FB_7,P$5,0))=16,\"\",VLOOKUP($A41,FB_7,P$5,0))&IF(TYPE(VLOOKUP($A41,FB_8,P$5,0))=16,\"\",VLOOKUP($A41,FB_8,P$5,0))&IF(TYPE(VLOOKUP($A41,FB_9,P$5,0))=16,\"\",VLOOKUP($A41,FB_9,P$5,0))&IF(TYPE(VLOOKUP($A41,FB_10,P$5,0))=16,\"\",VLOOKUP($A41,FB_10,P$5,0))&IF(TYPE(VLOOKUP($A41,FB_11,P$5,0))=16,\"\",VLOOKUP($A41,FB_11,P$5,0))&IF(TYPE(VLOOKUP($A41,FB_12,P$5,0))=16,\"\",VLOOKUP($A41,FB_12,P$5,0))&IF(TYPE(VLOOKUP($A41,FB_13,P$5,0))=16,\"\",VLOOKUP($A41,FB_13,P$5,0))&IF(TYPE(VLOOKUP($A41,FB_14,P$5,0))=16,\"\",VLOOKUP($A41,FB_14,P$5,0))&IF(TYPE(VLOOKUP($A41,FB_15,P$5,0))=16,\"\",VLOOKUP($A41,FB_15,P$5,0))&IF(TYPE(VLOOKUP($A41,FB_16,P$5,0))=16,\"\",VLOOKUP($A41,FB_16,P$5,0))&IF(TYPE(VLOOKUP($A41,FB_17,P$5,0))=16,\"\",VLOOKUP($A41,FB_17,P$5,0))&IF(TYPE(VLOOKUP($A41,FB_18,P$5,0))=16,\"\",VLOOKUP($A41,FB_18,P$5,0))&IF(TYPE(VLOOKUP($A41,FB_19,P$5,0))=16,\"\",VLOOKUP($A41,FB_19,P$5,0))&IF(TYPE(VLOOKUP($A41,FB_20,P$5,0))=16,\"\",VLOOKUP($A41,FB_20,P$5,0))&IF(TYPE(VLOOKUP($A41,FB_21,P$5,0))=16,\"\",VLOOKUP($A41,FB_21,P$5,0))&IF(TYPE(VLOOKUP($A41,FB_22,P$5,0))=16,\"\",VLOOKUP($A41,FB_22,P$5,0))&IF(TYPE(VLOOKUP($A41,FB_23,P$5,0))=16,\"\",VLOOKUP($A41,FB_23,P$5,0))&IF(TYPE(VLOOKUP($A41,FB_24,P$5,0))=16,\"\",VLOOKUP($A41,FB_24,P$5,0))&IF(TYPE(VLOOKUP($A41,FB_25,P$5,0))=16,\"\",VLOOKUP($A41,FB_25,P$5,0))&IF(TYPE(VLOOKUP($A41,FB_26,P$5,0))=16,\"\",VLOOKUP($A41,FB_26,P$5,0))&IF(TYPE(VLOOKUP($A41,FB_27,P$5,0))=16,\"\",VLOOKUP($A41,FB_27,P$5,0))&IF(TYPE(VLOOKUP($A41,FB_28,P$5,0))=16,\"\",VLOOKUP($A41,FB_28,P$5,0))&IF(TYPE(VLOOKUP($A41,FB_29,P$5,0))=16,\"\",VLOOKUP($A41,FB_29,P$5,0))&IF(TYPE(VLOOKUP($A41,FB_30,P$5,0))=16,\"\",VLOOKUP($A41,FB_30,P$5,0))))","v":""},"",{"$f":"IF($B41=\"\",\"\",_xlfn.NUMBERVALUE(IF(TYPE(VLOOKUP($A41,FB_1,R$5,0))=16,\"\",VLOOKUP($A41,FB_1,R$5,0))&IF(TYPE(VLOOKUP($A41,FB_2,R$5,0))=16,\"\",VLOOKUP($A41,FB_2,R$5,0))&IF(TYPE(VLOOKUP($A41,FB_3,R$5,0))=16,\"\",VLOOKUP($A41,FB_3,R$5,0))&IF(TYPE(VLOOKUP($A41,FB_4,R$5,0))=16,\"\",VLOOKUP($A41,FB_4,R$5,0))&IF(TYPE(VLOOKUP($A41,FB_5,R$5,0))=16,\"\",VLOOKUP($A41,FB_5,R$5,0))&IF(TYPE(VLOOKUP($A41,FB_6,R$5,0))=16,\"\",VLOOKUP($A41,FB_6,R$5,0))&IF(TYPE(VLOOKUP($A41,FB_7,R$5,0))=16,\"\",VLOOKUP($A41,FB_7,R$5,0))&IF(TYPE(VLOOKUP($A41,FB_8,R$5,0))=16,\"\",VLOOKUP($A41,FB_8,R$5,0))&IF(TYPE(VLOOKUP($A41,FB_9,R$5,0))=16,\"\",VLOOKUP($A41,FB_9,R$5,0))&IF(TYPE(VLOOKUP($A41,FB_10,R$5,0))=16,\"\",VLOOKUP($A41,FB_10,R$5,0))&IF(TYPE(VLOOKUP($A41,FB_11,R$5,0))=16,\"\",VLOOKUP($A41,FB_11,R$5,0))&IF(TYPE(VLOOKUP($A41,FB_12,R$5,0))=16,\"\",VLOOKUP($A41,FB_12,R$5,0))&IF(TYPE(VLOOKUP($A41,FB_13,R$5,0))=16,\"\",VLOOKUP($A41,FB_13,R$5,0))&IF(TYPE(VLOOKUP($A41,FB_14,R$5,0))=16,\"\",VLOOKUP($A41,FB_14,R$5,0))&IF(TYPE(VLOOKUP($A41,FB_15,R$5,0))=16,\"\",VLOOKUP($A41,FB_15,R$5,0))&IF(TYPE(VLOOKUP($A41,FB_16,R$5,0))=16,\"\",VLOOKUP($A41,FB_16,R$5,0))&IF(TYPE(VLOOKUP($A41,FB_17,R$5,0))=16,\"\",VLOOKUP($A41,FB_17,R$5,0))&IF(TYPE(VLOOKUP($A41,FB_18,R$5,0))=16,\"\",VLOOKUP($A41,FB_18,R$5,0))&IF(TYPE(VLOOKUP($A41,FB_19,R$5,0))=16,\"\",VLOOKUP($A41,FB_19,R$5,0))&IF(TYPE(VLOOKUP($A41,FB_20,R$5,0))=16,\"\",VLOOKUP($A41,FB_20,R$5,0))&IF(TYPE(VLOOKUP($A41,FB_21,R$5,0))=16,\"\",VLOOKUP($A41,FB_21,R$5,0))&IF(TYPE(VLOOKUP($A41,FB_22,R$5,0))=16,\"\",VLOOKUP($A41,FB_22,R$5,0))&IF(TYPE(VLOOKUP($A41,FB_23,R$5,0))=16,\"\",VLOOKUP($A41,FB_23,R$5,0))&IF(TYPE(VLOOKUP($A41,FB_24,R$5,0))=16,\"\",VLOOKUP($A41,FB_24,R$5,0))&IF(TYPE(VLOOKUP($A41,FB_25,R$5,0))=16,\"\",VLOOKUP($A41,FB_25,R$5,0))&IF(TYPE(VLOOKUP($A41,FB_26,R$5,0))=16,\"\",VLOOKUP($A41,FB_26,R$5,0))&IF(TYPE(VLOOKUP($A41,FB_27,R$5,0))=16,\"\",VLOOKUP($A41,FB_27,R$5,0))&IF(TYPE(VLOOKUP($A41,FB_28,R$5,0))=16,\"\",VLOOKUP($A41,FB_28,R$5,0))&IF(TYPE(VLOOKUP($A41,FB_29,R$5,0))=16,\"\",VLOOKUP($A41,FB_29,R$5,0))&IF(TYPE(VLOOKUP($A41,FB_30,R$5,0))=16,\"\",VLOOKUP($A41,FB_30,R$5,0))))","v":""},{"$f":"IF($B41=\"\",\"\",IF(TYPE(VLOOKUP($A41,FB_1,S$5,0))=16,\"\",VLOOKUP($A41,FB_1,S$5,0))&IF(TYPE(VLOOKUP($A41,FB_2,S$5,0))=16,\"\",VLOOKUP($A41,FB_2,S$5,0))&IF(TYPE(VLOOKUP($A41,FB_3,S$5,0))=16,\"\",VLOOKUP($A41,FB_3,S$5,0))&IF(TYPE(VLOOKUP($A41,FB_4,S$5,0))=16,\"\",VLOOKUP($A41,FB_4,S$5,0))&IF(TYPE(VLOOKUP($A41,FB_5,S$5,0))=16,\"\",VLOOKUP($A41,FB_5,S$5,0))&IF(TYPE(VLOOKUP($A41,FB_6,S$5,0))=16,\"\",VLOOKUP($A41,FB_6,S$5,0))&IF(TYPE(VLOOKUP($A41,FB_7,S$5,0))=16,\"\",VLOOKUP($A41,FB_7,S$5,0))&IF(TYPE(VLOOKUP($A41,FB_8,S$5,0))=16,\"\",VLOOKUP($A41,FB_8,S$5,0))&IF(TYPE(VLOOKUP($A41,FB_9,S$5,0))=16,\"\",VLOOKUP($A41,FB_9,S$5,0))&IF(TYPE(VLOOKUP($A41,FB_10,S$5,0))=16,\"\",VLOOKUP($A41,FB_10,S$5,0))&IF(TYPE(VLOOKUP($A41,FB_11,S$5,0))=16,\"\",VLOOKUP($A41,FB_11,S$5,0))&IF(TYPE(VLOOKUP($A41,FB_12,S$5,0))=16,\"\",VLOOKUP($A41,FB_12,S$5,0))&IF(TYPE(VLOOKUP($A41,FB_13,S$5,0))=16,\"\",VLOOKUP($A41,FB_13,S$5,0))&IF(TYPE(VLOOKUP($A41,FB_14,S$5,0))=16,\"\",VLOOKUP($A41,FB_14,S$5,0))&IF(TYPE(VLOOKUP($A41,FB_15,S$5,0))=16,\"\",VLOOKUP($A41,FB_15,S$5,0))&IF(TYPE(VLOOKUP($A41,FB_16,S$5,0))=16,\"\",VLOOKUP($A41,FB_16,S$5,0))&IF(TYPE(VLOOKUP($A41,FB_17,S$5,0))=16,\"\",VLOOKUP($A41,FB_17,S$5,0))&IF(TYPE(VLOOKUP($A41,FB_18,S$5,0))=16,\"\",VLOOKUP($A41,FB_18,S$5,0))&IF(TYPE(VLOOKUP($A41,FB_19,S$5,0))=16,\"\",VLOOKUP($A41,FB_19,S$5,0))&IF(TYPE(VLOOKUP($A41,FB_20,S$5,0))=16,\"\",VLOOKUP($A41,FB_20,S$5,0))&IF(TYPE(VLOOKUP($A41,FB_21,S$5,0))=16,\"\",VLOOKUP($A41,FB_21,S$5,0))&IF(TYPE(VLOOKUP($A41,FB_22,S$5,0))=16,\"\",VLOOKUP($A41,FB_22,S$5,0))&IF(TYPE(VLOOKUP($A41,FB_23,S$5,0))=16,\"\",VLOOKUP($A41,FB_23,S$5,0))&IF(TYPE(VLOOKUP($A41,FB_24,S$5,0))=16,\"\",VLOOKUP($A41,FB_24,S$5,0))&IF(TYPE(VLOOKUP($A41,FB_25,S$5,0))=16,\"\",VLOOKUP($A41,FB_25,S$5,0))&IF(TYPE(VLOOKUP($A41,FB_26,S$5,0))=16,\"\",VLOOKUP($A41,FB_26,S$5,0))&IF(TYPE(VLOOKUP($A41,FB_27,S$5,0))=16,\"\",VLOOKUP($A41,FB_27,S$5,0))&IF(TYPE(VLOOKUP($A41,FB_28,S$5,0))=16,\"\",VLOOKUP($A41,FB_28,S$5,0))&IF(TYPE(VLOOKUP($A41,FB_29,S$5,0))=16,\"\",VLOOKUP($A41,FB_29,S$5,0))&IF(TYPE(VLOOKUP($A41,FB_30,S$5,0))=16,\"\",VLOOKUP($A41,FB_30,S$5,0)))","v":""},null,null,null,null,null,null,null,null,null,null,null,null,null,null,null,null,"",":","","",""]
["13.",{"$f":"IF(TYPE(VLOOKUP($A42,FB_1,2,0))=16,\"\",VLOOKUP($A42,FB_1,2,0))&IF(TYPE(VLOOKUP($A42,FB_2,2,0))=16,\"\",VLOOKUP($A42,FB_2,2,0))&IF(TYPE(VLOOKUP($A42,FB_3,2,0))=16,\"\",VLOOKUP($A42,FB_3,2,0))&IF(TYPE(VLOOKUP($A42,FB_4,2,0))=16,\"\",VLOOKUP($A42,FB_4,2,0))&IF(TYPE(VLOOKUP($A42,FB_5,2,0))=16,\"\",VLOOKUP($A42,FB_5,2,0))&IF(TYPE(VLOOKUP($A42,FB_6,2,0))=16,\"\",VLOOKUP($A42,FB_6,2,0))&IF(TYPE(VLOOKUP($A42,FB_7,2,0))=16,\"\",VLOOKUP($A42,FB_7,2,0))&IF(TYPE(VLOOKUP($A42,FB_8,2,0))=16,\"\",VLOOKUP($A42,FB_8,2,0))&IF(TYPE(VLOOKUP($A42,FB_9,2,0))=16,\"\",VLOOKUP($A42,FB_9,2,0))&IF(TYPE(VLOOKUP($A42,FB_10,2,0))=16,\"\",VLOOKUP($A42,FB_10,2,0))&IF(TYPE(VLOOKUP($A42,FB_11,2,0))=16,\"\",VLOOKUP($A42,FB_11,2,0))&IF(TYPE(VLOOKUP($A42,FB_12,2,0))=16,\"\",VLOOKUP($A42,FB_12,2,0))&IF(TYPE(VLOOKUP($A42,FB_13,2,0))=16,\"\",VLOOKUP($A42,FB_13,2,0))&IF(TYPE(VLOOKUP($A42,FB_14,2,0))=16,\"\",VLOOKUP($A42,FB_14,2,0))&IF(TYPE(VLOOKUP($A42,FB_15,2,0))=16,\"\",VLOOKUP($A42,FB_15,2,0))&IF(TYPE(VLOOKUP($A42,FB_16,2,0))=16,\"\",VLOOKUP($A42,FB_16,2,0))&IF(TYPE(VLOOKUP($A42,FB_17,2,0))=16,\"\",VLOOKUP($A42,FB_17,2,0))&IF(TYPE(VLOOKUP($A42,FB_18,2,0))=16,\"\",VLOOKUP($A42,FB_18,2,0))&IF(TYPE(VLOOKUP($A42,FB_19,2,0))=16,\"\",VLOOKUP($A42,FB_19,2,0))&IF(TYPE(VLOOKUP($A42,FB_20,2,0))=16,\"\",VLOOKUP($A42,FB_20,2,0))&IF(TYPE(VLOOKUP($A42,FB_21,2,0))=16,\"\",VLOOKUP($A42,FB_21,2,0))&IF(TYPE(VLOOKUP($A42,FB_22,2,0))=16,\"\",VLOOKUP($A42,FB_22,2,0))&IF(TYPE(VLOOKUP($A42,FB_23,2,0))=16,\"\",VLOOKUP($A42,FB_23,2,0))&IF(TYPE(VLOOKUP($A42,FB_24,2,0))=16,\"\",VLOOKUP($A42,FB_24,2,0))&IF(TYPE(VLOOKUP($A42,FB_25,2,0))=16,\"\",VLOOKUP($A42,FB_25,2,0))&IF(TYPE(VLOOKUP($A42,FB_26,2,0))=16,\"\",VLOOKUP($A42,FB_26,2,0))&IF(TYPE(VLOOKUP($A42,FB_27,2,0))=16,\"\",VLOOKUP($A42,FB_27,2,0))&IF(TYPE(VLOOKUP($A42,FB_28,2,0))=16,\"\",VLOOKUP($A42,FB_28,2,0))&IF(TYPE(VLOOKUP($A42,FB_29,2,0))=16,\"\",VLOOKUP($A42,FB_29,2,0))&IF(TYPE(VLOOKUP($A42,FB_30,2,0))=16,\"\",VLOOKUP($A42,FB_30,2,0))","v":""},null,{"$f":"IF($B42=\"\",\"\",_xlfn.NUMBERVALUE(IF(TYPE(VLOOKUP($A42,FB_1,P$5,0))=16,\"\",VLOOKUP($A42,FB_1,P$5,0))&IF(TYPE(VLOOKUP($A42,FB_2,P$5,0))=16,\"\",VLOOKUP($A42,FB_2,P$5,0))&IF(TYPE(VLOOKUP($A42,FB_3,P$5,0))=16,\"\",VLOOKUP($A42,FB_3,P$5,0))&IF(TYPE(VLOOKUP($A42,FB_4,P$5,0))=16,\"\",VLOOKUP($A42,FB_4,P$5,0))&IF(TYPE(VLOOKUP($A42,FB_5,P$5,0))=16,\"\",VLOOKUP($A42,FB_5,P$5,0))&IF(TYPE(VLOOKUP($A42,FB_6,P$5,0))=16,\"\",VLOOKUP($A42,FB_6,P$5,0))&IF(TYPE(VLOOKUP($A42,FB_7,P$5,0))=16,\"\",VLOOKUP($A42,FB_7,P$5,0))&IF(TYPE(VLOOKUP($A42,FB_8,P$5,0))=16,\"\",VLOOKUP($A42,FB_8,P$5,0))&IF(TYPE(VLOOKUP($A42,FB_9,P$5,0))=16,\"\",VLOOKUP($A42,FB_9,P$5,0))&IF(TYPE(VLOOKUP($A42,FB_10,P$5,0))=16,\"\",VLOOKUP($A42,FB_10,P$5,0))&IF(TYPE(VLOOKUP($A42,FB_11,P$5,0))=16,\"\",VLOOKUP($A42,FB_11,P$5,0))&IF(TYPE(VLOOKUP($A42,FB_12,P$5,0))=16,\"\",VLOOKUP($A42,FB_12,P$5,0))&IF(TYPE(VLOOKUP($A42,FB_13,P$5,0))=16,\"\",VLOOKUP($A42,FB_13,P$5,0))&IF(TYPE(VLOOKUP($A42,FB_14,P$5,0))=16,\"\",VLOOKUP($A42,FB_14,P$5,0))&IF(TYPE(VLOOKUP($A42,FB_15,P$5,0))=16,\"\",VLOOKUP($A42,FB_15,P$5,0))&IF(TYPE(VLOOKUP($A42,FB_16,P$5,0))=16,\"\",VLOOKUP($A42,FB_16,P$5,0))&IF(TYPE(VLOOKUP($A42,FB_17,P$5,0))=16,\"\",VLOOKUP($A42,FB_17,P$5,0))&IF(TYPE(VLOOKUP($A42,FB_18,P$5,0))=16,\"\",VLOOKUP($A42,FB_18,P$5,0))&IF(TYPE(VLOOKUP($A42,FB_19,P$5,0))=16,\"\",VLOOKUP($A42,FB_19,P$5,0))&IF(TYPE(VLOOKUP($A42,FB_20,P$5,0))=16,\"\",VLOOKUP($A42,FB_20,P$5,0))&IF(TYPE(VLOOKUP($A42,FB_21,P$5,0))=16,\"\",VLOOKUP($A42,FB_21,P$5,0))&IF(TYPE(VLOOKUP($A42,FB_22,P$5,0))=16,\"\",VLOOKUP($A42,FB_22,P$5,0))&IF(TYPE(VLOOKUP($A42,FB_23,P$5,0))=16,\"\",VLOOKUP($A42,FB_23,P$5,0))&IF(TYPE(VLOOKUP($A42,FB_24,P$5,0))=16,\"\",VLOOKUP($A42,FB_24,P$5,0))&IF(TYPE(VLOOKUP($A42,FB_25,P$5,0))=16,\"\",VLOOKUP($A42,FB_25,P$5,0))&IF(TYPE(VLOOKUP($A42,FB_26,P$5,0))=16,\"\",VLOOKUP($A42,FB_26,P$5,0))&IF(TYPE(VLOOKUP($A42,FB_27,P$5,0))=16,\"\",VLOOKUP($A42,FB_27,P$5,0))&IF(TYPE(VLOOKUP($A42,FB_28,P$5,0))=16,\"\",VLOOKUP($A42,FB_28,P$5,0))&IF(TYPE(VLOOKUP($A42,FB_29,P$5,0))=16,\"\",VLOOKUP($A42,FB_29,P$5,0))&IF(TYPE(VLOOKUP($A42,FB_30,P$5,0))=16,\"\",VLOOKUP($A42,FB_30,P$5,0))))","v":""},"",{"$f":"IF($B42=\"\",\"\",_xlfn.NUMBERVALUE(IF(TYPE(VLOOKUP($A42,FB_1,R$5,0))=16,\"\",VLOOKUP($A42,FB_1,R$5,0))&IF(TYPE(VLOOKUP($A42,FB_2,R$5,0))=16,\"\",VLOOKUP($A42,FB_2,R$5,0))&IF(TYPE(VLOOKUP($A42,FB_3,R$5,0))=16,\"\",VLOOKUP($A42,FB_3,R$5,0))&IF(TYPE(VLOOKUP($A42,FB_4,R$5,0))=16,\"\",VLOOKUP($A42,FB_4,R$5,0))&IF(TYPE(VLOOKUP($A42,FB_5,R$5,0))=16,\"\",VLOOKUP($A42,FB_5,R$5,0))&IF(TYPE(VLOOKUP($A42,FB_6,R$5,0))=16,\"\",VLOOKUP($A42,FB_6,R$5,0))&IF(TYPE(VLOOKUP($A42,FB_7,R$5,0))=16,\"\",VLOOKUP($A42,FB_7,R$5,0))&IF(TYPE(VLOOKUP($A42,FB_8,R$5,0))=16,\"\",VLOOKUP($A42,FB_8,R$5,0))&IF(TYPE(VLOOKUP($A42,FB_9,R$5,0))=16,\"\",VLOOKUP($A42,FB_9,R$5,0))&IF(TYPE(VLOOKUP($A42,FB_10,R$5,0))=16,\"\",VLOOKUP($A42,FB_10,R$5,0))&IF(TYPE(VLOOKUP($A42,FB_11,R$5,0))=16,\"\",VLOOKUP($A42,FB_11,R$5,0))&IF(TYPE(VLOOKUP($A42,FB_12,R$5,0))=16,\"\",VLOOKUP($A42,FB_12,R$5,0))&IF(TYPE(VLOOKUP($A42,FB_13,R$5,0))=16,\"\",VLOOKUP($A42,FB_13,R$5,0))&IF(TYPE(VLOOKUP($A42,FB_14,R$5,0))=16,\"\",VLOOKUP($A42,FB_14,R$5,0))&IF(TYPE(VLOOKUP($A42,FB_15,R$5,0))=16,\"\",VLOOKUP($A42,FB_15,R$5,0))&IF(TYPE(VLOOKUP($A42,FB_16,R$5,0))=16,\"\",VLOOKUP($A42,FB_16,R$5,0))&IF(TYPE(VLOOKUP($A42,FB_17,R$5,0))=16,\"\",VLOOKUP($A42,FB_17,R$5,0))&IF(TYPE(VLOOKUP($A42,FB_18,R$5,0))=16,\"\",VLOOKUP($A42,FB_18,R$5,0))&IF(TYPE(VLOOKUP($A42,FB_19,R$5,0))=16,\"\",VLOOKUP($A42,FB_19,R$5,0))&IF(TYPE(VLOOKUP($A42,FB_20,R$5,0))=16,\"\",VLOOKUP($A42,FB_20,R$5,0))&IF(TYPE(VLOOKUP($A42,FB_21,R$5,0))=16,\"\",VLOOKUP($A42,FB_21,R$5,0))&IF(TYPE(VLOOKUP($A42,FB_22,R$5,0))=16,\"\",VLOOKUP($A42,FB_22,R$5,0))&IF(TYPE(VLOOKUP($A42,FB_23,R$5,0))=16,\"\",VLOOKUP($A42,FB_23,R$5,0))&IF(TYPE(VLOOKUP($A42,FB_24,R$5,0))=16,\"\",VLOOKUP($A42,FB_24,R$5,0))&IF(TYPE(VLOOKUP($A42,FB_25,R$5,0))=16,\"\",VLOOKUP($A42,FB_25,R$5,0))&IF(TYPE(VLOOKUP($A42,FB_26,R$5,0))=16,\"\",VLOOKUP($A42,FB_26,R$5,0))&IF(TYPE(VLOOKUP($A42,FB_27,R$5,0))=16,\"\",VLOOKUP($A42,FB_27,R$5,0))&IF(TYPE(VLOOKUP($A42,FB_28,R$5,0))=16,\"\",VLOOKUP($A42,FB_28,R$5,0))&IF(TYPE(VLOOKUP($A42,FB_29,R$5,0))=16,\"\",VLOOKUP($A42,FB_29,R$5,0))&IF(TYPE(VLOOKUP($A42,FB_30,R$5,0))=16,\"\",VLOOKUP($A42,FB_30,R$5,0))))","v":""},{"$f":"IF($B42=\"\",\"\",IF(TYPE(VLOOKUP($A42,FB_1,S$5,0))=16,\"\",VLOOKUP($A42,FB_1,S$5,0))&IF(TYPE(VLOOKUP($A42,FB_2,S$5,0))=16,\"\",VLOOKUP($A42,FB_2,S$5,0))&IF(TYPE(VLOOKUP($A42,FB_3,S$5,0))=16,\"\",VLOOKUP($A42,FB_3,S$5,0))&IF(TYPE(VLOOKUP($A42,FB_4,S$5,0))=16,\"\",VLOOKUP($A42,FB_4,S$5,0))&IF(TYPE(VLOOKUP($A42,FB_5,S$5,0))=16,\"\",VLOOKUP($A42,FB_5,S$5,0))&IF(TYPE(VLOOKUP($A42,FB_6,S$5,0))=16,\"\",VLOOKUP($A42,FB_6,S$5,0))&IF(TYPE(VLOOKUP($A42,FB_7,S$5,0))=16,\"\",VLOOKUP($A42,FB_7,S$5,0))&IF(TYPE(VLOOKUP($A42,FB_8,S$5,0))=16,\"\",VLOOKUP($A42,FB_8,S$5,0))&IF(TYPE(VLOOKUP($A42,FB_9,S$5,0))=16,\"\",VLOOKUP($A42,FB_9,S$5,0))&IF(TYPE(VLOOKUP($A42,FB_10,S$5,0))=16,\"\",VLOOKUP($A42,FB_10,S$5,0))&IF(TYPE(VLOOKUP($A42,FB_11,S$5,0))=16,\"\",VLOOKUP($A42,FB_11,S$5,0))&IF(TYPE(VLOOKUP($A42,FB_12,S$5,0))=16,\"\",VLOOKUP($A42,FB_12,S$5,0))&IF(TYPE(VLOOKUP($A42,FB_13,S$5,0))=16,\"\",VLOOKUP($A42,FB_13,S$5,0))&IF(TYPE(VLOOKUP($A42,FB_14,S$5,0))=16,\"\",VLOOKUP($A42,FB_14,S$5,0))&IF(TYPE(VLOOKUP($A42,FB_15,S$5,0))=16,\"\",VLOOKUP($A42,FB_15,S$5,0))&IF(TYPE(VLOOKUP($A42,FB_16,S$5,0))=16,\"\",VLOOKUP($A42,FB_16,S$5,0))&IF(TYPE(VLOOKUP($A42,FB_17,S$5,0))=16,\"\",VLOOKUP($A42,FB_17,S$5,0))&IF(TYPE(VLOOKUP($A42,FB_18,S$5,0))=16,\"\",VLOOKUP($A42,FB_18,S$5,0))&IF(TYPE(VLOOKUP($A42,FB_19,S$5,0))=16,\"\",VLOOKUP($A42,FB_19,S$5,0))&IF(TYPE(VLOOKUP($A42,FB_20,S$5,0))=16,\"\",VLOOKUP($A42,FB_20,S$5,0))&IF(TYPE(VLOOKUP($A42,FB_21,S$5,0))=16,\"\",VLOOKUP($A42,FB_21,S$5,0))&IF(TYPE(VLOOKUP($A42,FB_22,S$5,0))=16,\"\",VLOOKUP($A42,FB_22,S$5,0))&IF(TYPE(VLOOKUP($A42,FB_23,S$5,0))=16,\"\",VLOOKUP($A42,FB_23,S$5,0))&IF(TYPE(VLOOKUP($A42,FB_24,S$5,0))=16,\"\",VLOOKUP($A42,FB_24,S$5,0))&IF(TYPE(VLOOKUP($A42,FB_25,S$5,0))=16,\"\",VLOOKUP($A42,FB_25,S$5,0))&IF(TYPE(VLOOKUP($A42,FB_26,S$5,0))=16,\"\",VLOOKUP($A42,FB_26,S$5,0))&IF(TYPE(VLOOKUP($A42,FB_27,S$5,0))=16,\"\",VLOOKUP($A42,FB_27,S$5,0))&IF(TYPE(VLOOKUP($A42,FB_28,S$5,0))=16,\"\",VLOOKUP($A42,FB_28,S$5,0))&IF(TYPE(VLOOKUP($A42,FB_29,S$5,0))=16,\"\",VLOOKUP($A42,FB_29,S$5,0))&IF(TYPE(VLOOKUP($A42,FB_30,S$5,0))=16,\"\",VLOOKUP($A42,FB_30,S$5,0)))","v":""},null,null,null,null,null,null,null,null,null,null,null,null,null,null,null,null,"",":","","",""]
["14.",{"$f":"IF(TYPE(VLOOKUP($A43,FB_1,2,0))=16,\"\",VLOOKUP($A43,FB_1,2,0))&IF(TYPE(VLOOKUP($A43,FB_2,2,0))=16,\"\",VLOOKUP($A43,FB_2,2,0))&IF(TYPE(VLOOKUP($A43,FB_3,2,0))=16,\"\",VLOOKUP($A43,FB_3,2,0))&IF(TYPE(VLOOKUP($A43,FB_4,2,0))=16,\"\",VLOOKUP($A43,FB_4,2,0))&IF(TYPE(VLOOKUP($A43,FB_5,2,0))=16,\"\",VLOOKUP($A43,FB_5,2,0))&IF(TYPE(VLOOKUP($A43,FB_6,2,0))=16,\"\",VLOOKUP($A43,FB_6,2,0))&IF(TYPE(VLOOKUP($A43,FB_7,2,0))=16,\"\",VLOOKUP($A43,FB_7,2,0))&IF(TYPE(VLOOKUP($A43,FB_8,2,0))=16,\"\",VLOOKUP($A43,FB_8,2,0))&IF(TYPE(VLOOKUP($A43,FB_9,2,0))=16,\"\",VLOOKUP($A43,FB_9,2,0))&IF(TYPE(VLOOKUP($A43,FB_10,2,0))=16,\"\",VLOOKUP($A43,FB_10,2,0))&IF(TYPE(VLOOKUP($A43,FB_11,2,0))=16,\"\",VLOOKUP($A43,FB_11,2,0))&IF(TYPE(VLOOKUP($A43,FB_12,2,0))=16,\"\",VLOOKUP($A43,FB_12,2,0))&IF(TYPE(VLOOKUP($A43,FB_13,2,0))=16,\"\",VLOOKUP($A43,FB_13,2,0))&IF(TYPE(VLOOKUP($A43,FB_14,2,0))=16,\"\",VLOOKUP($A43,FB_14,2,0))&IF(TYPE(VLOOKUP($A43,FB_15,2,0))=16,\"\",VLOOKUP($A43,FB_15,2,0))&IF(TYPE(VLOOKUP($A43,FB_16,2,0))=16,\"\",VLOOKUP($A43,FB_16,2,0))&IF(TYPE(VLOOKUP($A43,FB_17,2,0))=16,\"\",VLOOKUP($A43,FB_17,2,0))&IF(TYPE(VLOOKUP($A43,FB_18,2,0))=16,\"\",VLOOKUP($A43,FB_18,2,0))&IF(TYPE(VLOOKUP($A43,FB_19,2,0))=16,\"\",VLOOKUP($A43,FB_19,2,0))&IF(TYPE(VLOOKUP($A43,FB_20,2,0))=16,\"\",VLOOKUP($A43,FB_20,2,0))&IF(TYPE(VLOOKUP($A43,FB_21,2,0))=16,\"\",VLOOKUP($A43,FB_21,2,0))&IF(TYPE(VLOOKUP($A43,FB_22,2,0))=16,\"\",VLOOKUP($A43,FB_22,2,0))&IF(TYPE(VLOOKUP($A43,FB_23,2,0))=16,\"\",VLOOKUP($A43,FB_23,2,0))&IF(TYPE(VLOOKUP($A43,FB_24,2,0))=16,\"\",VLOOKUP($A43,FB_24,2,0))&IF(TYPE(VLOOKUP($A43,FB_25,2,0))=16,\"\",VLOOKUP($A43,FB_25,2,0))&IF(TYPE(VLOOKUP($A43,FB_26,2,0))=16,\"\",VLOOKUP($A43,FB_26,2,0))&IF(TYPE(VLOOKUP($A43,FB_27,2,0))=16,\"\",VLOOKUP($A43,FB_27,2,0))&IF(TYPE(VLOOKUP($A43,FB_28,2,0))=16,\"\",VLOOKUP($A43,FB_28,2,0))&IF(TYPE(VLOOKUP($A43,FB_29,2,0))=16,\"\",VLOOKUP($A43,FB_29,2,0))&IF(TYPE(VLOOKUP($A43,FB_30,2,0))=16,\"\",VLOOKUP($A43,FB_30,2,0))","v":""},null,{"$f":"IF($B43=\"\",\"\",_xlfn.NUMBERVALUE(IF(TYPE(VLOOKUP($A43,FB_1,P$5,0))=16,\"\",VLOOKUP($A43,FB_1,P$5,0))&IF(TYPE(VLOOKUP($A43,FB_2,P$5,0))=16,\"\",VLOOKUP($A43,FB_2,P$5,0))&IF(TYPE(VLOOKUP($A43,FB_3,P$5,0))=16,\"\",VLOOKUP($A43,FB_3,P$5,0))&IF(TYPE(VLOOKUP($A43,FB_4,P$5,0))=16,\"\",VLOOKUP($A43,FB_4,P$5,0))&IF(TYPE(VLOOKUP($A43,FB_5,P$5,0))=16,\"\",VLOOKUP($A43,FB_5,P$5,0))&IF(TYPE(VLOOKUP($A43,FB_6,P$5,0))=16,\"\",VLOOKUP($A43,FB_6,P$5,0))&IF(TYPE(VLOOKUP($A43,FB_7,P$5,0))=16,\"\",VLOOKUP($A43,FB_7,P$5,0))&IF(TYPE(VLOOKUP($A43,FB_8,P$5,0))=16,\"\",VLOOKUP($A43,FB_8,P$5,0))&IF(TYPE(VLOOKUP($A43,FB_9,P$5,0))=16,\"\",VLOOKUP($A43,FB_9,P$5,0))&IF(TYPE(VLOOKUP($A43,FB_10,P$5,0))=16,\"\",VLOOKUP($A43,FB_10,P$5,0))&IF(TYPE(VLOOKUP($A43,FB_11,P$5,0))=16,\"\",VLOOKUP($A43,FB_11,P$5,0))&IF(TYPE(VLOOKUP($A43,FB_12,P$5,0))=16,\"\",VLOOKUP($A43,FB_12,P$5,0))&IF(TYPE(VLOOKUP($A43,FB_13,P$5,0))=16,\"\",VLOOKUP($A43,FB_13,P$5,0))&IF(TYPE(VLOOKUP($A43,FB_14,P$5,0))=16,\"\",VLOOKUP($A43,FB_14,P$5,0))&IF(TYPE(VLOOKUP($A43,FB_15,P$5,0))=16,\"\",VLOOKUP($A43,FB_15,P$5,0))&IF(TYPE(VLOOKUP($A43,FB_16,P$5,0))=16,\"\",VLOOKUP($A43,FB_16,P$5,0))&IF(TYPE(VLOOKUP($A43,FB_17,P$5,0))=16,\"\",VLOOKUP($A43,FB_17,P$5,0))&IF(TYPE(VLOOKUP($A43,FB_18,P$5,0))=16,\"\",VLOOKUP($A43,FB_18,P$5,0))&IF(TYPE(VLOOKUP($A43,FB_19,P$5,0))=16,\"\",VLOOKUP($A43,FB_19,P$5,0))&IF(TYPE(VLOOKUP($A43,FB_20,P$5,0))=16,\"\",VLOOKUP($A43,FB_20,P$5,0))&IF(TYPE(VLOOKUP($A43,FB_21,P$5,0))=16,\"\",VLOOKUP($A43,FB_21,P$5,0))&IF(TYPE(VLOOKUP($A43,FB_22,P$5,0))=16,\"\",VLOOKUP($A43,FB_22,P$5,0))&IF(TYPE(VLOOKUP($A43,FB_23,P$5,0))=16,\"\",VLOOKUP($A43,FB_23,P$5,0))&IF(TYPE(VLOOKUP($A43,FB_24,P$5,0))=16,\"\",VLOOKUP($A43,FB_24,P$5,0))&IF(TYPE(VLOOKUP($A43,FB_25,P$5,0))=16,\"\",VLOOKUP($A43,FB_25,P$5,0))&IF(TYPE(VLOOKUP($A43,FB_26,P$5,0))=16,\"\",VLOOKUP($A43,FB_26,P$5,0))&IF(TYPE(VLOOKUP($A43,FB_27,P$5,0))=16,\"\",VLOOKUP($A43,FB_27,P$5,0))&IF(TYPE(VLOOKUP($A43,FB_28,P$5,0))=16,\"\",VLOOKUP($A43,FB_28,P$5,0))&IF(TYPE(VLOOKUP($A43,FB_29,P$5,0))=16,\"\",VLOOKUP($A43,FB_29,P$5,0))&IF(TYPE(VLOOKUP($A43,FB_30,P$5,0))=16,\"\",VLOOKUP($A43,FB_30,P$5,0))))","v":""},"",{"$f":"IF($B43=\"\",\"\",_xlfn.NUMBERVALUE(IF(TYPE(VLOOKUP($A43,FB_1,R$5,0))=16,\"\",VLOOKUP($A43,FB_1,R$5,0))&IF(TYPE(VLOOKUP($A43,FB_2,R$5,0))=16,\"\",VLOOKUP($A43,FB_2,R$5,0))&IF(TYPE(VLOOKUP($A43,FB_3,R$5,0))=16,\"\",VLOOKUP($A43,FB_3,R$5,0))&IF(TYPE(VLOOKUP($A43,FB_4,R$5,0))=16,\"\",VLOOKUP($A43,FB_4,R$5,0))&IF(TYPE(VLOOKUP($A43,FB_5,R$5,0))=16,\"\",VLOOKUP($A43,FB_5,R$5,0))&IF(TYPE(VLOOKUP($A43,FB_6,R$5,0))=16,\"\",VLOOKUP($A43,FB_6,R$5,0))&IF(TYPE(VLOOKUP($A43,FB_7,R$5,0))=16,\"\",VLOOKUP($A43,FB_7,R$5,0))&IF(TYPE(VLOOKUP($A43,FB_8,R$5,0))=16,\"\",VLOOKUP($A43,FB_8,R$5,0))&IF(TYPE(VLOOKUP($A43,FB_9,R$5,0))=16,\"\",VLOOKUP($A43,FB_9,R$5,0))&IF(TYPE(VLOOKUP($A43,FB_10,R$5,0))=16,\"\",VLOOKUP($A43,FB_10,R$5,0))&IF(TYPE(VLOOKUP($A43,FB_11,R$5,0))=16,\"\",VLOOKUP($A43,FB_11,R$5,0))&IF(TYPE(VLOOKUP($A43,FB_12,R$5,0))=16,\"\",VLOOKUP($A43,FB_12,R$5,0))&IF(TYPE(VLOOKUP($A43,FB_13,R$5,0))=16,\"\",VLOOKUP($A43,FB_13,R$5,0))&IF(TYPE(VLOOKUP($A43,FB_14,R$5,0))=16,\"\",VLOOKUP($A43,FB_14,R$5,0))&IF(TYPE(VLOOKUP($A43,FB_15,R$5,0))=16,\"\",VLOOKUP($A43,FB_15,R$5,0))&IF(TYPE(VLOOKUP($A43,FB_16,R$5,0))=16,\"\",VLOOKUP($A43,FB_16,R$5,0))&IF(TYPE(VLOOKUP($A43,FB_17,R$5,0))=16,\"\",VLOOKUP($A43,FB_17,R$5,0))&IF(TYPE(VLOOKUP($A43,FB_18,R$5,0))=16,\"\",VLOOKUP($A43,FB_18,R$5,0))&IF(TYPE(VLOOKUP($A43,FB_19,R$5,0))=16,\"\",VLOOKUP($A43,FB_19,R$5,0))&IF(TYPE(VLOOKUP($A43,FB_20,R$5,0))=16,\"\",VLOOKUP($A43,FB_20,R$5,0))&IF(TYPE(VLOOKUP($A43,FB_21,R$5,0))=16,\"\",VLOOKUP($A43,FB_21,R$5,0))&IF(TYPE(VLOOKUP($A43,FB_22,R$5,0))=16,\"\",VLOOKUP($A43,FB_22,R$5,0))&IF(TYPE(VLOOKUP($A43,FB_23,R$5,0))=16,\"\",VLOOKUP($A43,FB_23,R$5,0))&IF(TYPE(VLOOKUP($A43,FB_24,R$5,0))=16,\"\",VLOOKUP($A43,FB_24,R$5,0))&IF(TYPE(VLOOKUP($A43,FB_25,R$5,0))=16,\"\",VLOOKUP($A43,FB_25,R$5,0))&IF(TYPE(VLOOKUP($A43,FB_26,R$5,0))=16,\"\",VLOOKUP($A43,FB_26,R$5,0))&IF(TYPE(VLOOKUP($A43,FB_27,R$5,0))=16,\"\",VLOOKUP($A43,FB_27,R$5,0))&IF(TYPE(VLOOKUP($A43,FB_28,R$5,0))=16,\"\",VLOOKUP($A43,FB_28,R$5,0))&IF(TYPE(VLOOKUP($A43,FB_29,R$5,0))=16,\"\",VLOOKUP($A43,FB_29,R$5,0))&IF(TYPE(VLOOKUP($A43,FB_30,R$5,0))=16,\"\",VLOOKUP($A43,FB_30,R$5,0))))","v":""},{"$f":"IF($B43=\"\",\"\",IF(TYPE(VLOOKUP($A43,FB_1,S$5,0))=16,\"\",VLOOKUP($A43,FB_1,S$5,0))&IF(TYPE(VLOOKUP($A43,FB_2,S$5,0))=16,\"\",VLOOKUP($A43,FB_2,S$5,0))&IF(TYPE(VLOOKUP($A43,FB_3,S$5,0))=16,\"\",VLOOKUP($A43,FB_3,S$5,0))&IF(TYPE(VLOOKUP($A43,FB_4,S$5,0))=16,\"\",VLOOKUP($A43,FB_4,S$5,0))&IF(TYPE(VLOOKUP($A43,FB_5,S$5,0))=16,\"\",VLOOKUP($A43,FB_5,S$5,0))&IF(TYPE(VLOOKUP($A43,FB_6,S$5,0))=16,\"\",VLOOKUP($A43,FB_6,S$5,0))&IF(TYPE(VLOOKUP($A43,FB_7,S$5,0))=16,\"\",VLOOKUP($A43,FB_7,S$5,0))&IF(TYPE(VLOOKUP($A43,FB_8,S$5,0))=16,\"\",VLOOKUP($A43,FB_8,S$5,0))&IF(TYPE(VLOOKUP($A43,FB_9,S$5,0))=16,\"\",VLOOKUP($A43,FB_9,S$5,0))&IF(TYPE(VLOOKUP($A43,FB_10,S$5,0))=16,\"\",VLOOKUP($A43,FB_10,S$5,0))&IF(TYPE(VLOOKUP($A43,FB_11,S$5,0))=16,\"\",VLOOKUP($A43,FB_11,S$5,0))&IF(TYPE(VLOOKUP($A43,FB_12,S$5,0))=16,\"\",VLOOKUP($A43,FB_12,S$5,0))&IF(TYPE(VLOOKUP($A43,FB_13,S$5,0))=16,\"\",VLOOKUP($A43,FB_13,S$5,0))&IF(TYPE(VLOOKUP($A43,FB_14,S$5,0))=16,\"\",VLOOKUP($A43,FB_14,S$5,0))&IF(TYPE(VLOOKUP($A43,FB_15,S$5,0))=16,\"\",VLOOKUP($A43,FB_15,S$5,0))&IF(TYPE(VLOOKUP($A43,FB_16,S$5,0))=16,\"\",VLOOKUP($A43,FB_16,S$5,0))&IF(TYPE(VLOOKUP($A43,FB_17,S$5,0))=16,\"\",VLOOKUP($A43,FB_17,S$5,0))&IF(TYPE(VLOOKUP($A43,FB_18,S$5,0))=16,\"\",VLOOKUP($A43,FB_18,S$5,0))&IF(TYPE(VLOOKUP($A43,FB_19,S$5,0))=16,\"\",VLOOKUP($A43,FB_19,S$5,0))&IF(TYPE(VLOOKUP($A43,FB_20,S$5,0))=16,\"\",VLOOKUP($A43,FB_20,S$5,0))&IF(TYPE(VLOOKUP($A43,FB_21,S$5,0))=16,\"\",VLOOKUP($A43,FB_21,S$5,0))&IF(TYPE(VLOOKUP($A43,FB_22,S$5,0))=16,\"\",VLOOKUP($A43,FB_22,S$5,0))&IF(TYPE(VLOOKUP($A43,FB_23,S$5,0))=16,\"\",VLOOKUP($A43,FB_23,S$5,0))&IF(TYPE(VLOOKUP($A43,FB_24,S$5,0))=16,\"\",VLOOKUP($A43,FB_24,S$5,0))&IF(TYPE(VLOOKUP($A43,FB_25,S$5,0))=16,\"\",VLOOKUP($A43,FB_25,S$5,0))&IF(TYPE(VLOOKUP($A43,FB_26,S$5,0))=16,\"\",VLOOKUP($A43,FB_26,S$5,0))&IF(TYPE(VLOOKUP($A43,FB_27,S$5,0))=16,\"\",VLOOKUP($A43,FB_27,S$5,0))&IF(TYPE(VLOOKUP($A43,FB_28,S$5,0))=16,\"\",VLOOKUP($A43,FB_28,S$5,0))&IF(TYPE(VLOOKUP($A43,FB_29,S$5,0))=16,\"\",VLOOKUP($A43,FB_29,S$5,0))&IF(TYPE(VLOOKUP($A43,FB_30,S$5,0))=16,\"\",VLOOKUP($A43,FB_30,S$5,0)))","v":""},null,null,null,null,null,null,null,null,null,null,null,null,null,null,null,null,"",":","","",""]
["15.",{"$f":"IF(TYPE(VLOOKUP($A44,FB_1,2,0))=16,\"\",VLOOKUP($A44,FB_1,2,0))&IF(TYPE(VLOOKUP($A44,FB_2,2,0))=16,\"\",VLOOKUP($A44,FB_2,2,0))&IF(TYPE(VLOOKUP($A44,FB_3,2,0))=16,\"\",VLOOKUP($A44,FB_3,2,0))&IF(TYPE(VLOOKUP($A44,FB_4,2,0))=16,\"\",VLOOKUP($A44,FB_4,2,0))&IF(TYPE(VLOOKUP($A44,FB_5,2,0))=16,\"\",VLOOKUP($A44,FB_5,2,0))&IF(TYPE(VLOOKUP($A44,FB_6,2,0))=16,\"\",VLOOKUP($A44,FB_6,2,0))&IF(TYPE(VLOOKUP($A44,FB_7,2,0))=16,\"\",VLOOKUP($A44,FB_7,2,0))&IF(TYPE(VLOOKUP($A44,FB_8,2,0))=16,\"\",VLOOKUP($A44,FB_8,2,0))&IF(TYPE(VLOOKUP($A44,FB_9,2,0))=16,\"\",VLOOKUP($A44,FB_9,2,0))&IF(TYPE(VLOOKUP($A44,FB_10,2,0))=16,\"\",VLOOKUP($A44,FB_10,2,0))&IF(TYPE(VLOOKUP($A44,FB_11,2,0))=16,\"\",VLOOKUP($A44,FB_11,2,0))&IF(TYPE(VLOOKUP($A44,FB_12,2,0))=16,\"\",VLOOKUP($A44,FB_12,2,0))&IF(TYPE(VLOOKUP($A44,FB_13,2,0))=16,\"\",VLOOKUP($A44,FB_13,2,0))&IF(TYPE(VLOOKUP($A44,FB_14,2,0))=16,\"\",VLOOKUP($A44,FB_14,2,0))&IF(TYPE(VLOOKUP($A44,FB_15,2,0))=16,\"\",VLOOKUP($A44,FB_15,2,0))&IF(TYPE(VLOOKUP($A44,FB_16,2,0))=16,\"\",VLOOKUP($A44,FB_16,2,0))&IF(TYPE(VLOOKUP($A44,FB_17,2,0))=16,\"\",VLOOKUP($A44,FB_17,2,0))&IF(TYPE(VLOOKUP($A44,FB_18,2,0))=16,\"\",VLOOKUP($A44,FB_18,2,0))&IF(TYPE(VLOOKUP($A44,FB_19,2,0))=16,\"\",VLOOKUP($A44,FB_19,2,0))&IF(TYPE(VLOOKUP($A44,FB_20,2,0))=16,\"\",VLOOKUP($A44,FB_20,2,0))&IF(TYPE(VLOOKUP($A44,FB_21,2,0))=16,\"\",VLOOKUP($A44,FB_21,2,0))&IF(TYPE(VLOOKUP($A44,FB_22,2,0))=16,\"\",VLOOKUP($A44,FB_22,2,0))&IF(TYPE(VLOOKUP($A44,FB_23,2,0))=16,\"\",VLOOKUP($A44,FB_23,2,0))&IF(TYPE(VLOOKUP($A44,FB_24,2,0))=16,\"\",VLOOKUP($A44,FB_24,2,0))&IF(TYPE(VLOOKUP($A44,FB_25,2,0))=16,\"\",VLOOKUP($A44,FB_25,2,0))&IF(TYPE(VLOOKUP($A44,FB_26,2,0))=16,\"\",VLOOKUP($A44,FB_26,2,0))&IF(TYPE(VLOOKUP($A44,FB_27,2,0))=16,\"\",VLOOKUP($A44,FB_27,2,0))&IF(TYPE(VLOOKUP($A44,FB_28,2,0))=16,\"\",VLOOKUP($A44,FB_28,2,0))&IF(TYPE(VLOOKUP($A44,FB_29,2,0))=16,\"\",VLOOKUP($A44,FB_29,2,0))&IF(TYPE(VLOOKUP($A44,FB_30,2,0))=16,\"\",VLOOKUP($A44,FB_30,2,0))","v":""},null,{"$f":"IF($B44=\"\",\"\",_xlfn.NUMBERVALUE(IF(TYPE(VLOOKUP($A44,FB_1,P$5,0))=16,\"\",VLOOKUP($A44,FB_1,P$5,0))&IF(TYPE(VLOOKUP($A44,FB_2,P$5,0))=16,\"\",VLOOKUP($A44,FB_2,P$5,0))&IF(TYPE(VLOOKUP($A44,FB_3,P$5,0))=16,\"\",VLOOKUP($A44,FB_3,P$5,0))&IF(TYPE(VLOOKUP($A44,FB_4,P$5,0))=16,\"\",VLOOKUP($A44,FB_4,P$5,0))&IF(TYPE(VLOOKUP($A44,FB_5,P$5,0))=16,\"\",VLOOKUP($A44,FB_5,P$5,0))&IF(TYPE(VLOOKUP($A44,FB_6,P$5,0))=16,\"\",VLOOKUP($A44,FB_6,P$5,0))&IF(TYPE(VLOOKUP($A44,FB_7,P$5,0))=16,\"\",VLOOKUP($A44,FB_7,P$5,0))&IF(TYPE(VLOOKUP($A44,FB_8,P$5,0))=16,\"\",VLOOKUP($A44,FB_8,P$5,0))&IF(TYPE(VLOOKUP($A44,FB_9,P$5,0))=16,\"\",VLOOKUP($A44,FB_9,P$5,0))&IF(TYPE(VLOOKUP($A44,FB_10,P$5,0))=16,\"\",VLOOKUP($A44,FB_10,P$5,0))&IF(TYPE(VLOOKUP($A44,FB_11,P$5,0))=16,\"\",VLOOKUP($A44,FB_11,P$5,0))&IF(TYPE(VLOOKUP($A44,FB_12,P$5,0))=16,\"\",VLOOKUP($A44,FB_12,P$5,0))&IF(TYPE(VLOOKUP($A44,FB_13,P$5,0))=16,\"\",VLOOKUP($A44,FB_13,P$5,0))&IF(TYPE(VLOOKUP($A44,FB_14,P$5,0))=16,\"\",VLOOKUP($A44,FB_14,P$5,0))&IF(TYPE(VLOOKUP($A44,FB_15,P$5,0))=16,\"\",VLOOKUP($A44,FB_15,P$5,0))&IF(TYPE(VLOOKUP($A44,FB_16,P$5,0))=16,\"\",VLOOKUP($A44,FB_16,P$5,0))&IF(TYPE(VLOOKUP($A44,FB_17,P$5,0))=16,\"\",VLOOKUP($A44,FB_17,P$5,0))&IF(TYPE(VLOOKUP($A44,FB_18,P$5,0))=16,\"\",VLOOKUP($A44,FB_18,P$5,0))&IF(TYPE(VLOOKUP($A44,FB_19,P$5,0))=16,\"\",VLOOKUP($A44,FB_19,P$5,0))&IF(TYPE(VLOOKUP($A44,FB_20,P$5,0))=16,\"\",VLOOKUP($A44,FB_20,P$5,0))&IF(TYPE(VLOOKUP($A44,FB_21,P$5,0))=16,\"\",VLOOKUP($A44,FB_21,P$5,0))&IF(TYPE(VLOOKUP($A44,FB_22,P$5,0))=16,\"\",VLOOKUP($A44,FB_22,P$5,0))&IF(TYPE(VLOOKUP($A44,FB_23,P$5,0))=16,\"\",VLOOKUP($A44,FB_23,P$5,0))&IF(TYPE(VLOOKUP($A44,FB_24,P$5,0))=16,\"\",VLOOKUP($A44,FB_24,P$5,0))&IF(TYPE(VLOOKUP($A44,FB_25,P$5,0))=16,\"\",VLOOKUP($A44,FB_25,P$5,0))&IF(TYPE(VLOOKUP($A44,FB_26,P$5,0))=16,\"\",VLOOKUP($A44,FB_26,P$5,0))&IF(TYPE(VLOOKUP($A44,FB_27,P$5,0))=16,\"\",VLOOKUP($A44,FB_27,P$5,0))&IF(TYPE(VLOOKUP($A44,FB_28,P$5,0))=16,\"\",VLOOKUP($A44,FB_28,P$5,0))&IF(TYPE(VLOOKUP($A44,FB_29,P$5,0))=16,\"\",VLOOKUP($A44,FB_29,P$5,0))&IF(TYPE(VLOOKUP($A44,FB_30,P$5,0))=16,\"\",VLOOKUP($A44,FB_30,P$5,0))))","v":""},"",{"$f":"IF($B44=\"\",\"\",_xlfn.NUMBERVALUE(IF(TYPE(VLOOKUP($A44,FB_1,R$5,0))=16,\"\",VLOOKUP($A44,FB_1,R$5,0))&IF(TYPE(VLOOKUP($A44,FB_2,R$5,0))=16,\"\",VLOOKUP($A44,FB_2,R$5,0))&IF(TYPE(VLOOKUP($A44,FB_3,R$5,0))=16,\"\",VLOOKUP($A44,FB_3,R$5,0))&IF(TYPE(VLOOKUP($A44,FB_4,R$5,0))=16,\"\",VLOOKUP($A44,FB_4,R$5,0))&IF(TYPE(VLOOKUP($A44,FB_5,R$5,0))=16,\"\",VLOOKUP($A44,FB_5,R$5,0))&IF(TYPE(VLOOKUP($A44,FB_6,R$5,0))=16,\"\",VLOOKUP($A44,FB_6,R$5,0))&IF(TYPE(VLOOKUP($A44,FB_7,R$5,0))=16,\"\",VLOOKUP($A44,FB_7,R$5,0))&IF(TYPE(VLOOKUP($A44,FB_8,R$5,0))=16,\"\",VLOOKUP($A44,FB_8,R$5,0))&IF(TYPE(VLOOKUP($A44,FB_9,R$5,0))=16,\"\",VLOOKUP($A44,FB_9,R$5,0))&IF(TYPE(VLOOKUP($A44,FB_10,R$5,0))=16,\"\",VLOOKUP($A44,FB_10,R$5,0))&IF(TYPE(VLOOKUP($A44,FB_11,R$5,0))=16,\"\",VLOOKUP($A44,FB_11,R$5,0))&IF(TYPE(VLOOKUP($A44,FB_12,R$5,0))=16,\"\",VLOOKUP($A44,FB_12,R$5,0))&IF(TYPE(VLOOKUP($A44,FB_13,R$5,0))=16,\"\",VLOOKUP($A44,FB_13,R$5,0))&IF(TYPE(VLOOKUP($A44,FB_14,R$5,0))=16,\"\",VLOOKUP($A44,FB_14,R$5,0))&IF(TYPE(VLOOKUP($A44,FB_15,R$5,0))=16,\"\",VLOOKUP($A44,FB_15,R$5,0))&IF(TYPE(VLOOKUP($A44,FB_16,R$5,0))=16,\"\",VLOOKUP($A44,FB_16,R$5,0))&IF(TYPE(VLOOKUP($A44,FB_17,R$5,0))=16,\"\",VLOOKUP($A44,FB_17,R$5,0))&IF(TYPE(VLOOKUP($A44,FB_18,R$5,0))=16,\"\",VLOOKUP($A44,FB_18,R$5,0))&IF(TYPE(VLOOKUP($A44,FB_19,R$5,0))=16,\"\",VLOOKUP($A44,FB_19,R$5,0))&IF(TYPE(VLOOKUP($A44,FB_20,R$5,0))=16,\"\",VLOOKUP($A44,FB_20,R$5,0))&IF(TYPE(VLOOKUP($A44,FB_21,R$5,0))=16,\"\",VLOOKUP($A44,FB_21,R$5,0))&IF(TYPE(VLOOKUP($A44,FB_22,R$5,0))=16,\"\",VLOOKUP($A44,FB_22,R$5,0))&IF(TYPE(VLOOKUP($A44,FB_23,R$5,0))=16,\"\",VLOOKUP($A44,FB_23,R$5,0))&IF(TYPE(VLOOKUP($A44,FB_24,R$5,0))=16,\"\",VLOOKUP($A44,FB_24,R$5,0))&IF(TYPE(VLOOKUP($A44,FB_25,R$5,0))=16,\"\",VLOOKUP($A44,FB_25,R$5,0))&IF(TYPE(VLOOKUP($A44,FB_26,R$5,0))=16,\"\",VLOOKUP($A44,FB_26,R$5,0))&IF(TYPE(VLOOKUP($A44,FB_27,R$5,0))=16,\"\",VLOOKUP($A44,FB_27,R$5,0))&IF(TYPE(VLOOKUP($A44,FB_28,R$5,0))=16,\"\",VLOOKUP($A44,FB_28,R$5,0))&IF(TYPE(VLOOKUP($A44,FB_29,R$5,0))=16,\"\",VLOOKUP($A44,FB_29,R$5,0))&IF(TYPE(VLOOKUP($A44,FB_30,R$5,0))=16,\"\",VLOOKUP($A44,FB_30,R$5,0))))","v":""},{"$f":"IF($B44=\"\",\"\",IF(TYPE(VLOOKUP($A44,FB_1,S$5,0))=16,\"\",VLOOKUP($A44,FB_1,S$5,0))&IF(TYPE(VLOOKUP($A44,FB_2,S$5,0))=16,\"\",VLOOKUP($A44,FB_2,S$5,0))&IF(TYPE(VLOOKUP($A44,FB_3,S$5,0))=16,\"\",VLOOKUP($A44,FB_3,S$5,0))&IF(TYPE(VLOOKUP($A44,FB_4,S$5,0))=16,\"\",VLOOKUP($A44,FB_4,S$5,0))&IF(TYPE(VLOOKUP($A44,FB_5,S$5,0))=16,\"\",VLOOKUP($A44,FB_5,S$5,0))&IF(TYPE(VLOOKUP($A44,FB_6,S$5,0))=16,\"\",VLOOKUP($A44,FB_6,S$5,0))&IF(TYPE(VLOOKUP($A44,FB_7,S$5,0))=16,\"\",VLOOKUP($A44,FB_7,S$5,0))&IF(TYPE(VLOOKUP($A44,FB_8,S$5,0))=16,\"\",VLOOKUP($A44,FB_8,S$5,0))&IF(TYPE(VLOOKUP($A44,FB_9,S$5,0))=16,\"\",VLOOKUP($A44,FB_9,S$5,0))&IF(TYPE(VLOOKUP($A44,FB_10,S$5,0))=16,\"\",VLOOKUP($A44,FB_10,S$5,0))&IF(TYPE(VLOOKUP($A44,FB_11,S$5,0))=16,\"\",VLOOKUP($A44,FB_11,S$5,0))&IF(TYPE(VLOOKUP($A44,FB_12,S$5,0))=16,\"\",VLOOKUP($A44,FB_12,S$5,0))&IF(TYPE(VLOOKUP($A44,FB_13,S$5,0))=16,\"\",VLOOKUP($A44,FB_13,S$5,0))&IF(TYPE(VLOOKUP($A44,FB_14,S$5,0))=16,\"\",VLOOKUP($A44,FB_14,S$5,0))&IF(TYPE(VLOOKUP($A44,FB_15,S$5,0))=16,\"\",VLOOKUP($A44,FB_15,S$5,0))&IF(TYPE(VLOOKUP($A44,FB_16,S$5,0))=16,\"\",VLOOKUP($A44,FB_16,S$5,0))&IF(TYPE(VLOOKUP($A44,FB_17,S$5,0))=16,\"\",VLOOKUP($A44,FB_17,S$5,0))&IF(TYPE(VLOOKUP($A44,FB_18,S$5,0))=16,\"\",VLOOKUP($A44,FB_18,S$5,0))&IF(TYPE(VLOOKUP($A44,FB_19,S$5,0))=16,\"\",VLOOKUP($A44,FB_19,S$5,0))&IF(TYPE(VLOOKUP($A44,FB_20,S$5,0))=16,\"\",VLOOKUP($A44,FB_20,S$5,0))&IF(TYPE(VLOOKUP($A44,FB_21,S$5,0))=16,\"\",VLOOKUP($A44,FB_21,S$5,0))&IF(TYPE(VLOOKUP($A44,FB_22,S$5,0))=16,\"\",VLOOKUP($A44,FB_22,S$5,0))&IF(TYPE(VLOOKUP($A44,FB_23,S$5,0))=16,\"\",VLOOKUP($A44,FB_23,S$5,0))&IF(TYPE(VLOOKUP($A44,FB_24,S$5,0))=16,\"\",VLOOKUP($A44,FB_24,S$5,0))&IF(TYPE(VLOOKUP($A44,FB_25,S$5,0))=16,\"\",VLOOKUP($A44,FB_25,S$5,0))&IF(TYPE(VLOOKUP($A44,FB_26,S$5,0))=16,\"\",VLOOKUP($A44,FB_26,S$5,0))&IF(TYPE(VLOOKUP($A44,FB_27,S$5,0))=16,\"\",VLOOKUP($A44,FB_27,S$5,0))&IF(TYPE(VLOOKUP($A44,FB_28,S$5,0))=16,\"\",VLOOKUP($A44,FB_28,S$5,0))&IF(TYPE(VLOOKUP($A44,FB_29,S$5,0))=16,\"\",VLOOKUP($A44,FB_29,S$5,0))&IF(TYPE(VLOOKUP($A44,FB_30,S$5,0))=16,\"\",VLOOKUP($A44,FB_30,S$5,0)))","v":""},null,null,null,null,null,null,null,null,null,null,null,null,null,null,null,null,"",":","","",""]
["16.",{"$f":"IF(TYPE(VLOOKUP($A45,FB_1,2,0))=16,\"\",VLOOKUP($A45,FB_1,2,0))&IF(TYPE(VLOOKUP($A45,FB_2,2,0))=16,\"\",VLOOKUP($A45,FB_2,2,0))&IF(TYPE(VLOOKUP($A45,FB_3,2,0))=16,\"\",VLOOKUP($A45,FB_3,2,0))&IF(TYPE(VLOOKUP($A45,FB_4,2,0))=16,\"\",VLOOKUP($A45,FB_4,2,0))&IF(TYPE(VLOOKUP($A45,FB_5,2,0))=16,\"\",VLOOKUP($A45,FB_5,2,0))&IF(TYPE(VLOOKUP($A45,FB_6,2,0))=16,\"\",VLOOKUP($A45,FB_6,2,0))&IF(TYPE(VLOOKUP($A45,FB_7,2,0))=16,\"\",VLOOKUP($A45,FB_7,2,0))&IF(TYPE(VLOOKUP($A45,FB_8,2,0))=16,\"\",VLOOKUP($A45,FB_8,2,0))&IF(TYPE(VLOOKUP($A45,FB_9,2,0))=16,\"\",VLOOKUP($A45,FB_9,2,0))&IF(TYPE(VLOOKUP($A45,FB_10,2,0))=16,\"\",VLOOKUP($A45,FB_10,2,0))&IF(TYPE(VLOOKUP($A45,FB_11,2,0))=16,\"\",VLOOKUP($A45,FB_11,2,0))&IF(TYPE(VLOOKUP($A45,FB_12,2,0))=16,\"\",VLOOKUP($A45,FB_12,2,0))&IF(TYPE(VLOOKUP($A45,FB_13,2,0))=16,\"\",VLOOKUP($A45,FB_13,2,0))&IF(TYPE(VLOOKUP($A45,FB_14,2,0))=16,\"\",VLOOKUP($A45,FB_14,2,0))&IF(TYPE(VLOOKUP($A45,FB_15,2,0))=16,\"\",VLOOKUP($A45,FB_15,2,0))&IF(TYPE(VLOOKUP($A45,FB_16,2,0))=16,\"\",VLOOKUP($A45,FB_16,2,0))&IF(TYPE(VLOOKUP($A45,FB_17,2,0))=16,\"\",VLOOKUP($A45,FB_17,2,0))&IF(TYPE(VLOOKUP($A45,FB_18,2,0))=16,\"\",VLOOKUP($A45,FB_18,2,0))&IF(TYPE(VLOOKUP($A45,FB_19,2,0))=16,\"\",VLOOKUP($A45,FB_19,2,0))&IF(TYPE(VLOOKUP($A45,FB_20,2,0))=16,\"\",VLOOKUP($A45,FB_20,2,0))&IF(TYPE(VLOOKUP($A45,FB_21,2,0))=16,\"\",VLOOKUP($A45,FB_21,2,0))&IF(TYPE(VLOOKUP($A45,FB_22,2,0))=16,\"\",VLOOKUP($A45,FB_22,2,0))&IF(TYPE(VLOOKUP($A45,FB_23,2,0))=16,\"\",VLOOKUP($A45,FB_23,2,0))&IF(TYPE(VLOOKUP($A45,FB_24,2,0))=16,\"\",VLOOKUP($A45,FB_24,2,0))&IF(TYPE(VLOOKUP($A45,FB_25,2,0))=16,\"\",VLOOKUP($A45,FB_25,2,0))&IF(TYPE(VLOOKUP($A45,FB_26,2,0))=16,\"\",VLOOKUP($A45,FB_26,2,0))&IF(TYPE(VLOOKUP($A45,FB_27,2,0))=16,\"\",VLOOKUP($A45,FB_27,2,0))&IF(TYPE(VLOOKUP($A45,FB_28,2,0))=16,\"\",VLOOKUP($A45,FB_28,2,0))&IF(TYPE(VLOOKUP($A45,FB_29,2,0))=16,\"\",VLOOKUP($A45,FB_29,2,0))&IF(TYPE(VLOOKUP($A45,FB_30,2,0))=16,\"\",VLOOKUP($A45,FB_30,2,0))","v":""},null,{"$f":"IF($B45=\"\",\"\",_xlfn.NUMBERVALUE(IF(TYPE(VLOOKUP($A45,FB_1,P$5,0))=16,\"\",VLOOKUP($A45,FB_1,P$5,0))&IF(TYPE(VLOOKUP($A45,FB_2,P$5,0))=16,\"\",VLOOKUP($A45,FB_2,P$5,0))&IF(TYPE(VLOOKUP($A45,FB_3,P$5,0))=16,\"\",VLOOKUP($A45,FB_3,P$5,0))&IF(TYPE(VLOOKUP($A45,FB_4,P$5,0))=16,\"\",VLOOKUP($A45,FB_4,P$5,0))&IF(TYPE(VLOOKUP($A45,FB_5,P$5,0))=16,\"\",VLOOKUP($A45,FB_5,P$5,0))&IF(TYPE(VLOOKUP($A45,FB_6,P$5,0))=16,\"\",VLOOKUP($A45,FB_6,P$5,0))&IF(TYPE(VLOOKUP($A45,FB_7,P$5,0))=16,\"\",VLOOKUP($A45,FB_7,P$5,0))&IF(TYPE(VLOOKUP($A45,FB_8,P$5,0))=16,\"\",VLOOKUP($A45,FB_8,P$5,0))&IF(TYPE(VLOOKUP($A45,FB_9,P$5,0))=16,\"\",VLOOKUP($A45,FB_9,P$5,0))&IF(TYPE(VLOOKUP($A45,FB_10,P$5,0))=16,\"\",VLOOKUP($A45,FB_10,P$5,0))&IF(TYPE(VLOOKUP($A45,FB_11,P$5,0))=16,\"\",VLOOKUP($A45,FB_11,P$5,0))&IF(TYPE(VLOOKUP($A45,FB_12,P$5,0))=16,\"\",VLOOKUP($A45,FB_12,P$5,0))&IF(TYPE(VLOOKUP($A45,FB_13,P$5,0))=16,\"\",VLOOKUP($A45,FB_13,P$5,0))&IF(TYPE(VLOOKUP($A45,FB_14,P$5,0))=16,\"\",VLOOKUP($A45,FB_14,P$5,0))&IF(TYPE(VLOOKUP($A45,FB_15,P$5,0))=16,\"\",VLOOKUP($A45,FB_15,P$5,0))&IF(TYPE(VLOOKUP($A45,FB_16,P$5,0))=16,\"\",VLOOKUP($A45,FB_16,P$5,0))&IF(TYPE(VLOOKUP($A45,FB_17,P$5,0))=16,\"\",VLOOKUP($A45,FB_17,P$5,0))&IF(TYPE(VLOOKUP($A45,FB_18,P$5,0))=16,\"\",VLOOKUP($A45,FB_18,P$5,0))&IF(TYPE(VLOOKUP($A45,FB_19,P$5,0))=16,\"\",VLOOKUP($A45,FB_19,P$5,0))&IF(TYPE(VLOOKUP($A45,FB_20,P$5,0))=16,\"\",VLOOKUP($A45,FB_20,P$5,0))&IF(TYPE(VLOOKUP($A45,FB_21,P$5,0))=16,\"\",VLOOKUP($A45,FB_21,P$5,0))&IF(TYPE(VLOOKUP($A45,FB_22,P$5,0))=16,\"\",VLOOKUP($A45,FB_22,P$5,0))&IF(TYPE(VLOOKUP($A45,FB_23,P$5,0))=16,\"\",VLOOKUP($A45,FB_23,P$5,0))&IF(TYPE(VLOOKUP($A45,FB_24,P$5,0))=16,\"\",VLOOKUP($A45,FB_24,P$5,0))&IF(TYPE(VLOOKUP($A45,FB_25,P$5,0))=16,\"\",VLOOKUP($A45,FB_25,P$5,0))&IF(TYPE(VLOOKUP($A45,FB_26,P$5,0))=16,\"\",VLOOKUP($A45,FB_26,P$5,0))&IF(TYPE(VLOOKUP($A45,FB_27,P$5,0))=16,\"\",VLOOKUP($A45,FB_27,P$5,0))&IF(TYPE(VLOOKUP($A45,FB_28,P$5,0))=16,\"\",VLOOKUP($A45,FB_28,P$5,0))&IF(TYPE(VLOOKUP($A45,FB_29,P$5,0))=16,\"\",VLOOKUP($A45,FB_29,P$5,0))&IF(TYPE(VLOOKUP($A45,FB_30,P$5,0))=16,\"\",VLOOKUP($A45,FB_30,P$5,0))))","v":""},"",{"$f":"IF($B45=\"\",\"\",_xlfn.NUMBERVALUE(IF(TYPE(VLOOKUP($A45,FB_1,R$5,0))=16,\"\",VLOOKUP($A45,FB_1,R$5,0))&IF(TYPE(VLOOKUP($A45,FB_2,R$5,0))=16,\"\",VLOOKUP($A45,FB_2,R$5,0))&IF(TYPE(VLOOKUP($A45,FB_3,R$5,0))=16,\"\",VLOOKUP($A45,FB_3,R$5,0))&IF(TYPE(VLOOKUP($A45,FB_4,R$5,0))=16,\"\",VLOOKUP($A45,FB_4,R$5,0))&IF(TYPE(VLOOKUP($A45,FB_5,R$5,0))=16,\"\",VLOOKUP($A45,FB_5,R$5,0))&IF(TYPE(VLOOKUP($A45,FB_6,R$5,0))=16,\"\",VLOOKUP($A45,FB_6,R$5,0))&IF(TYPE(VLOOKUP($A45,FB_7,R$5,0))=16,\"\",VLOOKUP($A45,FB_7,R$5,0))&IF(TYPE(VLOOKUP($A45,FB_8,R$5,0))=16,\"\",VLOOKUP($A45,FB_8,R$5,0))&IF(TYPE(VLOOKUP($A45,FB_9,R$5,0))=16,\"\",VLOOKUP($A45,FB_9,R$5,0))&IF(TYPE(VLOOKUP($A45,FB_10,R$5,0))=16,\"\",VLOOKUP($A45,FB_10,R$5,0))&IF(TYPE(VLOOKUP($A45,FB_11,R$5,0))=16,\"\",VLOOKUP($A45,FB_11,R$5,0))&IF(TYPE(VLOOKUP($A45,FB_12,R$5,0))=16,\"\",VLOOKUP($A45,FB_12,R$5,0))&IF(TYPE(VLOOKUP($A45,FB_13,R$5,0))=16,\"\",VLOOKUP($A45,FB_13,R$5,0))&IF(TYPE(VLOOKUP($A45,FB_14,R$5,0))=16,\"\",VLOOKUP($A45,FB_14,R$5,0))&IF(TYPE(VLOOKUP($A45,FB_15,R$5,0))=16,\"\",VLOOKUP($A45,FB_15,R$5,0))&IF(TYPE(VLOOKUP($A45,FB_16,R$5,0))=16,\"\",VLOOKUP($A45,FB_16,R$5,0))&IF(TYPE(VLOOKUP($A45,FB_17,R$5,0))=16,\"\",VLOOKUP($A45,FB_17,R$5,0))&IF(TYPE(VLOOKUP($A45,FB_18,R$5,0))=16,\"\",VLOOKUP($A45,FB_18,R$5,0))&IF(TYPE(VLOOKUP($A45,FB_19,R$5,0))=16,\"\",VLOOKUP($A45,FB_19,R$5,0))&IF(TYPE(VLOOKUP($A45,FB_20,R$5,0))=16,\"\",VLOOKUP($A45,FB_20,R$5,0))&IF(TYPE(VLOOKUP($A45,FB_21,R$5,0))=16,\"\",VLOOKUP($A45,FB_21,R$5,0))&IF(TYPE(VLOOKUP($A45,FB_22,R$5,0))=16,\"\",VLOOKUP($A45,FB_22,R$5,0))&IF(TYPE(VLOOKUP($A45,FB_23,R$5,0))=16,\"\",VLOOKUP($A45,FB_23,R$5,0))&IF(TYPE(VLOOKUP($A45,FB_24,R$5,0))=16,\"\",VLOOKUP($A45,FB_24,R$5,0))&IF(TYPE(VLOOKUP($A45,FB_25,R$5,0))=16,\"\",VLOOKUP($A45,FB_25,R$5,0))&IF(TYPE(VLOOKUP($A45,FB_26,R$5,0))=16,\"\",VLOOKUP($A45,FB_26,R$5,0))&IF(TYPE(VLOOKUP($A45,FB_27,R$5,0))=16,\"\",VLOOKUP($A45,FB_27,R$5,0))&IF(TYPE(VLOOKUP($A45,FB_28,R$5,0))=16,\"\",VLOOKUP($A45,FB_28,R$5,0))&IF(TYPE(VLOOKUP($A45,FB_29,R$5,0))=16,\"\",VLOOKUP($A45,FB_29,R$5,0))&IF(TYPE(VLOOKUP($A45,FB_30,R$5,0))=16,\"\",VLOOKUP($A45,FB_30,R$5,0))))","v":""},{"$f":"IF($B45=\"\",\"\",IF(TYPE(VLOOKUP($A45,FB_1,S$5,0))=16,\"\",VLOOKUP($A45,FB_1,S$5,0))&IF(TYPE(VLOOKUP($A45,FB_2,S$5,0))=16,\"\",VLOOKUP($A45,FB_2,S$5,0))&IF(TYPE(VLOOKUP($A45,FB_3,S$5,0))=16,\"\",VLOOKUP($A45,FB_3,S$5,0))&IF(TYPE(VLOOKUP($A45,FB_4,S$5,0))=16,\"\",VLOOKUP($A45,FB_4,S$5,0))&IF(TYPE(VLOOKUP($A45,FB_5,S$5,0))=16,\"\",VLOOKUP($A45,FB_5,S$5,0))&IF(TYPE(VLOOKUP($A45,FB_6,S$5,0))=16,\"\",VLOOKUP($A45,FB_6,S$5,0))&IF(TYPE(VLOOKUP($A45,FB_7,S$5,0))=16,\"\",VLOOKUP($A45,FB_7,S$5,0))&IF(TYPE(VLOOKUP($A45,FB_8,S$5,0))=16,\"\",VLOOKUP($A45,FB_8,S$5,0))&IF(TYPE(VLOOKUP($A45,FB_9,S$5,0))=16,\"\",VLOOKUP($A45,FB_9,S$5,0))&IF(TYPE(VLOOKUP($A45,FB_10,S$5,0))=16,\"\",VLOOKUP($A45,FB_10,S$5,0))&IF(TYPE(VLOOKUP($A45,FB_11,S$5,0))=16,\"\",VLOOKUP($A45,FB_11,S$5,0))&IF(TYPE(VLOOKUP($A45,FB_12,S$5,0))=16,\"\",VLOOKUP($A45,FB_12,S$5,0))&IF(TYPE(VLOOKUP($A45,FB_13,S$5,0))=16,\"\",VLOOKUP($A45,FB_13,S$5,0))&IF(TYPE(VLOOKUP($A45,FB_14,S$5,0))=16,\"\",VLOOKUP($A45,FB_14,S$5,0))&IF(TYPE(VLOOKUP($A45,FB_15,S$5,0))=16,\"\",VLOOKUP($A45,FB_15,S$5,0))&IF(TYPE(VLOOKUP($A45,FB_16,S$5,0))=16,\"\",VLOOKUP($A45,FB_16,S$5,0))&IF(TYPE(VLOOKUP($A45,FB_17,S$5,0))=16,\"\",VLOOKUP($A45,FB_17,S$5,0))&IF(TYPE(VLOOKUP($A45,FB_18,S$5,0))=16,\"\",VLOOKUP($A45,FB_18,S$5,0))&IF(TYPE(VLOOKUP($A45,FB_19,S$5,0))=16,\"\",VLOOKUP($A45,FB_19,S$5,0))&IF(TYPE(VLOOKUP($A45,FB_20,S$5,0))=16,\"\",VLOOKUP($A45,FB_20,S$5,0))&IF(TYPE(VLOOKUP($A45,FB_21,S$5,0))=16,\"\",VLOOKUP($A45,FB_21,S$5,0))&IF(TYPE(VLOOKUP($A45,FB_22,S$5,0))=16,\"\",VLOOKUP($A45,FB_22,S$5,0))&IF(TYPE(VLOOKUP($A45,FB_23,S$5,0))=16,\"\",VLOOKUP($A45,FB_23,S$5,0))&IF(TYPE(VLOOKUP($A45,FB_24,S$5,0))=16,\"\",VLOOKUP($A45,FB_24,S$5,0))&IF(TYPE(VLOOKUP($A45,FB_25,S$5,0))=16,\"\",VLOOKUP($A45,FB_25,S$5,0))&IF(TYPE(VLOOKUP($A45,FB_26,S$5,0))=16,\"\",VLOOKUP($A45,FB_26,S$5,0))&IF(TYPE(VLOOKUP($A45,FB_27,S$5,0))=16,\"\",VLOOKUP($A45,FB_27,S$5,0))&IF(TYPE(VLOOKUP($A45,FB_28,S$5,0))=16,\"\",VLOOKUP($A45,FB_28,S$5,0))&IF(TYPE(VLOOKUP($A45,FB_29,S$5,0))=16,\"\",VLOOKUP($A45,FB_29,S$5,0))&IF(TYPE(VLOOKUP($A45,FB_30,S$5,0))=16,\"\",VLOOKUP($A45,FB_30,S$5,0)))","v":""},null,null,null,null,null,null,null,null,null,null,null,null,null,null,null,null,"",":","","",""]
["17.",{"$f":"IF(TYPE(VLOOKUP($A46,FB_1,2,0))=16,\"\",VLOOKUP($A46,FB_1,2,0))&IF(TYPE(VLOOKUP($A46,FB_2,2,0))=16,\"\",VLOOKUP($A46,FB_2,2,0))&IF(TYPE(VLOOKUP($A46,FB_3,2,0))=16,\"\",VLOOKUP($A46,FB_3,2,0))&IF(TYPE(VLOOKUP($A46,FB_4,2,0))=16,\"\",VLOOKUP($A46,FB_4,2,0))&IF(TYPE(VLOOKUP($A46,FB_5,2,0))=16,\"\",VLOOKUP($A46,FB_5,2,0))&IF(TYPE(VLOOKUP($A46,FB_6,2,0))=16,\"\",VLOOKUP($A46,FB_6,2,0))&IF(TYPE(VLOOKUP($A46,FB_7,2,0))=16,\"\",VLOOKUP($A46,FB_7,2,0))&IF(TYPE(VLOOKUP($A46,FB_8,2,0))=16,\"\",VLOOKUP($A46,FB_8,2,0))&IF(TYPE(VLOOKUP($A46,FB_9,2,0))=16,\"\",VLOOKUP($A46,FB_9,2,0))&IF(TYPE(VLOOKUP($A46,FB_10,2,0))=16,\"\",VLOOKUP($A46,FB_10,2,0))&IF(TYPE(VLOOKUP($A46,FB_11,2,0))=16,\"\",VLOOKUP($A46,FB_11,2,0))&IF(TYPE(VLOOKUP($A46,FB_12,2,0))=16,\"\",VLOOKUP($A46,FB_12,2,0))&IF(TYPE(VLOOKUP($A46,FB_13,2,0))=16,\"\",VLOOKUP($A46,FB_13,2,0))&IF(TYPE(VLOOKUP($A46,FB_14,2,0))=16,\"\",VLOOKUP($A46,FB_14,2,0))&IF(TYPE(VLOOKUP($A46,FB_15,2,0))=16,\"\",VLOOKUP($A46,FB_15,2,0))&IF(TYPE(VLOOKUP($A46,FB_16,2,0))=16,\"\",VLOOKUP($A46,FB_16,2,0))&IF(TYPE(VLOOKUP($A46,FB_17,2,0))=16,\"\",VLOOKUP($A46,FB_17,2,0))&IF(TYPE(VLOOKUP($A46,FB_18,2,0))=16,\"\",VLOOKUP($A46,FB_18,2,0))&IF(TYPE(VLOOKUP($A46,FB_19,2,0))=16,\"\",VLOOKUP($A46,FB_19,2,0))&IF(TYPE(VLOOKUP($A46,FB_20,2,0))=16,\"\",VLOOKUP($A46,FB_20,2,0))&IF(TYPE(VLOOKUP($A46,FB_21,2,0))=16,\"\",VLOOKUP($A46,FB_21,2,0))&IF(TYPE(VLOOKUP($A46,FB_22,2,0))=16,\"\",VLOOKUP($A46,FB_22,2,0))&IF(TYPE(VLOOKUP($A46,FB_23,2,0))=16,\"\",VLOOKUP($A46,FB_23,2,0))&IF(TYPE(VLOOKUP($A46,FB_24,2,0))=16,\"\",VLOOKUP($A46,FB_24,2,0))&IF(TYPE(VLOOKUP($A46,FB_25,2,0))=16,\"\",VLOOKUP($A46,FB_25,2,0))&IF(TYPE(VLOOKUP($A46,FB_26,2,0))=16,\"\",VLOOKUP($A46,FB_26,2,0))&IF(TYPE(VLOOKUP($A46,FB_27,2,0))=16,\"\",VLOOKUP($A46,FB_27,2,0))&IF(TYPE(VLOOKUP($A46,FB_28,2,0))=16,\"\",VLOOKUP($A46,FB_28,2,0))&IF(TYPE(VLOOKUP($A46,FB_29,2,0))=16,\"\",VLOOKUP($A46,FB_29,2,0))&IF(TYPE(VLOOKUP($A46,FB_30,2,0))=16,\"\",VLOOKUP($A46,FB_30,2,0))","v":""},null,{"$f":"IF($B46=\"\",\"\",_xlfn.NUMBERVALUE(IF(TYPE(VLOOKUP($A46,FB_1,P$5,0))=16,\"\",VLOOKUP($A46,FB_1,P$5,0))&IF(TYPE(VLOOKUP($A46,FB_2,P$5,0))=16,\"\",VLOOKUP($A46,FB_2,P$5,0))&IF(TYPE(VLOOKUP($A46,FB_3,P$5,0))=16,\"\",VLOOKUP($A46,FB_3,P$5,0))&IF(TYPE(VLOOKUP($A46,FB_4,P$5,0))=16,\"\",VLOOKUP($A46,FB_4,P$5,0))&IF(TYPE(VLOOKUP($A46,FB_5,P$5,0))=16,\"\",VLOOKUP($A46,FB_5,P$5,0))&IF(TYPE(VLOOKUP($A46,FB_6,P$5,0))=16,\"\",VLOOKUP($A46,FB_6,P$5,0))&IF(TYPE(VLOOKUP($A46,FB_7,P$5,0))=16,\"\",VLOOKUP($A46,FB_7,P$5,0))&IF(TYPE(VLOOKUP($A46,FB_8,P$5,0))=16,\"\",VLOOKUP($A46,FB_8,P$5,0))&IF(TYPE(VLOOKUP($A46,FB_9,P$5,0))=16,\"\",VLOOKUP($A46,FB_9,P$5,0))&IF(TYPE(VLOOKUP($A46,FB_10,P$5,0))=16,\"\",VLOOKUP($A46,FB_10,P$5,0))&IF(TYPE(VLOOKUP($A46,FB_11,P$5,0))=16,\"\",VLOOKUP($A46,FB_11,P$5,0))&IF(TYPE(VLOOKUP($A46,FB_12,P$5,0))=16,\"\",VLOOKUP($A46,FB_12,P$5,0))&IF(TYPE(VLOOKUP($A46,FB_13,P$5,0))=16,\"\",VLOOKUP($A46,FB_13,P$5,0))&IF(TYPE(VLOOKUP($A46,FB_14,P$5,0))=16,\"\",VLOOKUP($A46,FB_14,P$5,0))&IF(TYPE(VLOOKUP($A46,FB_15,P$5,0))=16,\"\",VLOOKUP($A46,FB_15,P$5,0))&IF(TYPE(VLOOKUP($A46,FB_16,P$5,0))=16,\"\",VLOOKUP($A46,FB_16,P$5,0))&IF(TYPE(VLOOKUP($A46,FB_17,P$5,0))=16,\"\",VLOOKUP($A46,FB_17,P$5,0))&IF(TYPE(VLOOKUP($A46,FB_18,P$5,0))=16,\"\",VLOOKUP($A46,FB_18,P$5,0))&IF(TYPE(VLOOKUP($A46,FB_19,P$5,0))=16,\"\",VLOOKUP($A46,FB_19,P$5,0))&IF(TYPE(VLOOKUP($A46,FB_20,P$5,0))=16,\"\",VLOOKUP($A46,FB_20,P$5,0))&IF(TYPE(VLOOKUP($A46,FB_21,P$5,0))=16,\"\",VLOOKUP($A46,FB_21,P$5,0))&IF(TYPE(VLOOKUP($A46,FB_22,P$5,0))=16,\"\",VLOOKUP($A46,FB_22,P$5,0))&IF(TYPE(VLOOKUP($A46,FB_23,P$5,0))=16,\"\",VLOOKUP($A46,FB_23,P$5,0))&IF(TYPE(VLOOKUP($A46,FB_24,P$5,0))=16,\"\",VLOOKUP($A46,FB_24,P$5,0))&IF(TYPE(VLOOKUP($A46,FB_25,P$5,0))=16,\"\",VLOOKUP($A46,FB_25,P$5,0))&IF(TYPE(VLOOKUP($A46,FB_26,P$5,0))=16,\"\",VLOOKUP($A46,FB_26,P$5,0))&IF(TYPE(VLOOKUP($A46,FB_27,P$5,0))=16,\"\",VLOOKUP($A46,FB_27,P$5,0))&IF(TYPE(VLOOKUP($A46,FB_28,P$5,0))=16,\"\",VLOOKUP($A46,FB_28,P$5,0))&IF(TYPE(VLOOKUP($A46,FB_29,P$5,0))=16,\"\",VLOOKUP($A46,FB_29,P$5,0))&IF(TYPE(VLOOKUP($A46,FB_30,P$5,0))=16,\"\",VLOOKUP($A46,FB_30,P$5,0))))","v":""},"",{"$f":"IF($B46=\"\",\"\",_xlfn.NUMBERVALUE(IF(TYPE(VLOOKUP($A46,FB_1,R$5,0))=16,\"\",VLOOKUP($A46,FB_1,R$5,0))&IF(TYPE(VLOOKUP($A46,FB_2,R$5,0))=16,\"\",VLOOKUP($A46,FB_2,R$5,0))&IF(TYPE(VLOOKUP($A46,FB_3,R$5,0))=16,\"\",VLOOKUP($A46,FB_3,R$5,0))&IF(TYPE(VLOOKUP($A46,FB_4,R$5,0))=16,\"\",VLOOKUP($A46,FB_4,R$5,0))&IF(TYPE(VLOOKUP($A46,FB_5,R$5,0))=16,\"\",VLOOKUP($A46,FB_5,R$5,0))&IF(TYPE(VLOOKUP($A46,FB_6,R$5,0))=16,\"\",VLOOKUP($A46,FB_6,R$5,0))&IF(TYPE(VLOOKUP($A46,FB_7,R$5,0))=16,\"\",VLOOKUP($A46,FB_7,R$5,0))&IF(TYPE(VLOOKUP($A46,FB_8,R$5,0))=16,\"\",VLOOKUP($A46,FB_8,R$5,0))&IF(TYPE(VLOOKUP($A46,FB_9,R$5,0))=16,\"\",VLOOKUP($A46,FB_9,R$5,0))&IF(TYPE(VLOOKUP($A46,FB_10,R$5,0))=16,\"\",VLOOKUP($A46,FB_10,R$5,0))&IF(TYPE(VLOOKUP($A46,FB_11,R$5,0))=16,\"\",VLOOKUP($A46,FB_11,R$5,0))&IF(TYPE(VLOOKUP($A46,FB_12,R$5,0))=16,\"\",VLOOKUP($A46,FB_12,R$5,0))&IF(TYPE(VLOOKUP($A46,FB_13,R$5,0))=16,\"\",VLOOKUP($A46,FB_13,R$5,0))&IF(TYPE(VLOOKUP($A46,FB_14,R$5,0))=16,\"\",VLOOKUP($A46,FB_14,R$5,0))&IF(TYPE(VLOOKUP($A46,FB_15,R$5,0))=16,\"\",VLOOKUP($A46,FB_15,R$5,0))&IF(TYPE(VLOOKUP($A46,FB_16,R$5,0))=16,\"\",VLOOKUP($A46,FB_16,R$5,0))&IF(TYPE(VLOOKUP($A46,FB_17,R$5,0))=16,\"\",VLOOKUP($A46,FB_17,R$5,0))&IF(TYPE(VLOOKUP($A46,FB_18,R$5,0))=16,\"\",VLOOKUP($A46,FB_18,R$5,0))&IF(TYPE(VLOOKUP($A46,FB_19,R$5,0))=16,\"\",VLOOKUP($A46,FB_19,R$5,0))&IF(TYPE(VLOOKUP($A46,FB_20,R$5,0))=16,\"\",VLOOKUP($A46,FB_20,R$5,0))&IF(TYPE(VLOOKUP($A46,FB_21,R$5,0))=16,\"\",VLOOKUP($A46,FB_21,R$5,0))&IF(TYPE(VLOOKUP($A46,FB_22,R$5,0))=16,\"\",VLOOKUP($A46,FB_22,R$5,0))&IF(TYPE(VLOOKUP($A46,FB_23,R$5,0))=16,\"\",VLOOKUP($A46,FB_23,R$5,0))&IF(TYPE(VLOOKUP($A46,FB_24,R$5,0))=16,\"\",VLOOKUP($A46,FB_24,R$5,0))&IF(TYPE(VLOOKUP($A46,FB_25,R$5,0))=16,\"\",VLOOKUP($A46,FB_25,R$5,0))&IF(TYPE(VLOOKUP($A46,FB_26,R$5,0))=16,\"\",VLOOKUP($A46,FB_26,R$5,0))&IF(TYPE(VLOOKUP($A46,FB_27,R$5,0))=16,\"\",VLOOKUP($A46,FB_27,R$5,0))&IF(TYPE(VLOOKUP($A46,FB_28,R$5,0))=16,\"\",VLOOKUP($A46,FB_28,R$5,0))&IF(TYPE(VLOOKUP($A46,FB_29,R$5,0))=16,\"\",VLOOKUP($A46,FB_29,R$5,0))&IF(TYPE(VLOOKUP($A46,FB_30,R$5,0))=16,\"\",VLOOKUP($A46,FB_30,R$5,0))))","v":""},{"$f":"IF($B46=\"\",\"\",IF(TYPE(VLOOKUP($A46,FB_1,S$5,0))=16,\"\",VLOOKUP($A46,FB_1,S$5,0))&IF(TYPE(VLOOKUP($A46,FB_2,S$5,0))=16,\"\",VLOOKUP($A46,FB_2,S$5,0))&IF(TYPE(VLOOKUP($A46,FB_3,S$5,0))=16,\"\",VLOOKUP($A46,FB_3,S$5,0))&IF(TYPE(VLOOKUP($A46,FB_4,S$5,0))=16,\"\",VLOOKUP($A46,FB_4,S$5,0))&IF(TYPE(VLOOKUP($A46,FB_5,S$5,0))=16,\"\",VLOOKUP($A46,FB_5,S$5,0))&IF(TYPE(VLOOKUP($A46,FB_6,S$5,0))=16,\"\",VLOOKUP($A46,FB_6,S$5,0))&IF(TYPE(VLOOKUP($A46,FB_7,S$5,0))=16,\"\",VLOOKUP($A46,FB_7,S$5,0))&IF(TYPE(VLOOKUP($A46,FB_8,S$5,0))=16,\"\",VLOOKUP($A46,FB_8,S$5,0))&IF(TYPE(VLOOKUP($A46,FB_9,S$5,0))=16,\"\",VLOOKUP($A46,FB_9,S$5,0))&IF(TYPE(VLOOKUP($A46,FB_10,S$5,0))=16,\"\",VLOOKUP($A46,FB_10,S$5,0))&IF(TYPE(VLOOKUP($A46,FB_11,S$5,0))=16,\"\",VLOOKUP($A46,FB_11,S$5,0))&IF(TYPE(VLOOKUP($A46,FB_12,S$5,0))=16,\"\",VLOOKUP($A46,FB_12,S$5,0))&IF(TYPE(VLOOKUP($A46,FB_13,S$5,0))=16,\"\",VLOOKUP($A46,FB_13,S$5,0))&IF(TYPE(VLOOKUP($A46,FB_14,S$5,0))=16,\"\",VLOOKUP($A46,FB_14,S$5,0))&IF(TYPE(VLOOKUP($A46,FB_15,S$5,0))=16,\"\",VLOOKUP($A46,FB_15,S$5,0))&IF(TYPE(VLOOKUP($A46,FB_16,S$5,0))=16,\"\",VLOOKUP($A46,FB_16,S$5,0))&IF(TYPE(VLOOKUP($A46,FB_17,S$5,0))=16,\"\",VLOOKUP($A46,FB_17,S$5,0))&IF(TYPE(VLOOKUP($A46,FB_18,S$5,0))=16,\"\",VLOOKUP($A46,FB_18,S$5,0))&IF(TYPE(VLOOKUP($A46,FB_19,S$5,0))=16,\"\",VLOOKUP($A46,FB_19,S$5,0))&IF(TYPE(VLOOKUP($A46,FB_20,S$5,0))=16,\"\",VLOOKUP($A46,FB_20,S$5,0))&IF(TYPE(VLOOKUP($A46,FB_21,S$5,0))=16,\"\",VLOOKUP($A46,FB_21,S$5,0))&IF(TYPE(VLOOKUP($A46,FB_22,S$5,0))=16,\"\",VLOOKUP($A46,FB_22,S$5,0))&IF(TYPE(VLOOKUP($A46,FB_23,S$5,0))=16,\"\",VLOOKUP($A46,FB_23,S$5,0))&IF(TYPE(VLOOKUP($A46,FB_24,S$5,0))=16,\"\",VLOOKUP($A46,FB_24,S$5,0))&IF(TYPE(VLOOKUP($A46,FB_25,S$5,0))=16,\"\",VLOOKUP($A46,FB_25,S$5,0))&IF(TYPE(VLOOKUP($A46,FB_26,S$5,0))=16,\"\",VLOOKUP($A46,FB_26,S$5,0))&IF(TYPE(VLOOKUP($A46,FB_27,S$5,0))=16,\"\",VLOOKUP($A46,FB_27,S$5,0))&IF(TYPE(VLOOKUP($A46,FB_28,S$5,0))=16,\"\",VLOOKUP($A46,FB_28,S$5,0))&IF(TYPE(VLOOKUP($A46,FB_29,S$5,0))=16,\"\",VLOOKUP($A46,FB_29,S$5,0))&IF(TYPE(VLOOKUP($A46,FB_30,S$5,0))=16,\"\",VLOOKUP($A46,FB_30,S$5,0)))","v":""},null,null,null,null,null,null,null,null,null,null,null,null,null,null,null,null,"",":","","",""]
["18.",{"$f":"IF(TYPE(VLOOKUP($A47,FB_1,2,0))=16,\"\",VLOOKUP($A47,FB_1,2,0))&IF(TYPE(VLOOKUP($A47,FB_2,2,0))=16,\"\",VLOOKUP($A47,FB_2,2,0))&IF(TYPE(VLOOKUP($A47,FB_3,2,0))=16,\"\",VLOOKUP($A47,FB_3,2,0))&IF(TYPE(VLOOKUP($A47,FB_4,2,0))=16,\"\",VLOOKUP($A47,FB_4,2,0))&IF(TYPE(VLOOKUP($A47,FB_5,2,0))=16,\"\",VLOOKUP($A47,FB_5,2,0))&IF(TYPE(VLOOKUP($A47,FB_6,2,0))=16,\"\",VLOOKUP($A47,FB_6,2,0))&IF(TYPE(VLOOKUP($A47,FB_7,2,0))=16,\"\",VLOOKUP($A47,FB_7,2,0))&IF(TYPE(VLOOKUP($A47,FB_8,2,0))=16,\"\",VLOOKUP($A47,FB_8,2,0))&IF(TYPE(VLOOKUP($A47,FB_9,2,0))=16,\"\",VLOOKUP($A47,FB_9,2,0))&IF(TYPE(VLOOKUP($A47,FB_10,2,0))=16,\"\",VLOOKUP($A47,FB_10,2,0))&IF(TYPE(VLOOKUP($A47,FB_11,2,0))=16,\"\",VLOOKUP($A47,FB_11,2,0))&IF(TYPE(VLOOKUP($A47,FB_12,2,0))=16,\"\",VLOOKUP($A47,FB_12,2,0))&IF(TYPE(VLOOKUP($A47,FB_13,2,0))=16,\"\",VLOOKUP($A47,FB_13,2,0))&IF(TYPE(VLOOKUP($A47,FB_14,2,0))=16,\"\",VLOOKUP($A47,FB_14,2,0))&IF(TYPE(VLOOKUP($A47,FB_15,2,0))=16,\"\",VLOOKUP($A47,FB_15,2,0))&IF(TYPE(VLOOKUP($A47,FB_16,2,0))=16,\"\",VLOOKUP($A47,FB_16,2,0))&IF(TYPE(VLOOKUP($A47,FB_17,2,0))=16,\"\",VLOOKUP($A47,FB_17,2,0))&IF(TYPE(VLOOKUP($A47,FB_18,2,0))=16,\"\",VLOOKUP($A47,FB_18,2,0))&IF(TYPE(VLOOKUP($A47,FB_19,2,0))=16,\"\",VLOOKUP($A47,FB_19,2,0))&IF(TYPE(VLOOKUP($A47,FB_20,2,0))=16,\"\",VLOOKUP($A47,FB_20,2,0))&IF(TYPE(VLOOKUP($A47,FB_21,2,0))=16,\"\",VLOOKUP($A47,FB_21,2,0))&IF(TYPE(VLOOKUP($A47,FB_22,2,0))=16,\"\",VLOOKUP($A47,FB_22,2,0))&IF(TYPE(VLOOKUP($A47,FB_23,2,0))=16,\"\",VLOOKUP($A47,FB_23,2,0))&IF(TYPE(VLOOKUP($A47,FB_24,2,0))=16,\"\",VLOOKUP($A47,FB_24,2,0))&IF(TYPE(VLOOKUP($A47,FB_25,2,0))=16,\"\",VLOOKUP($A47,FB_25,2,0))&IF(TYPE(VLOOKUP($A47,FB_26,2,0))=16,\"\",VLOOKUP($A47,FB_26,2,0))&IF(TYPE(VLOOKUP($A47,FB_27,2,0))=16,\"\",VLOOKUP($A47,FB_27,2,0))&IF(TYPE(VLOOKUP($A47,FB_28,2,0))=16,\"\",VLOOKUP($A47,FB_28,2,0))&IF(TYPE(VLOOKUP($A47,FB_29,2,0))=16,\"\",VLOOKUP($A47,FB_29,2,0))&IF(TYPE(VLOOKUP($A47,FB_30,2,0))=16,\"\",VLOOKUP($A47,FB_30,2,0))","v":""},null,{"$f":"IF($B47=\"\",\"\",_xlfn.NUMBERVALUE(IF(TYPE(VLOOKUP($A47,FB_1,P$5,0))=16,\"\",VLOOKUP($A47,FB_1,P$5,0))&IF(TYPE(VLOOKUP($A47,FB_2,P$5,0))=16,\"\",VLOOKUP($A47,FB_2,P$5,0))&IF(TYPE(VLOOKUP($A47,FB_3,P$5,0))=16,\"\",VLOOKUP($A47,FB_3,P$5,0))&IF(TYPE(VLOOKUP($A47,FB_4,P$5,0))=16,\"\",VLOOKUP($A47,FB_4,P$5,0))&IF(TYPE(VLOOKUP($A47,FB_5,P$5,0))=16,\"\",VLOOKUP($A47,FB_5,P$5,0))&IF(TYPE(VLOOKUP($A47,FB_6,P$5,0))=16,\"\",VLOOKUP($A47,FB_6,P$5,0))&IF(TYPE(VLOOKUP($A47,FB_7,P$5,0))=16,\"\",VLOOKUP($A47,FB_7,P$5,0))&IF(TYPE(VLOOKUP($A47,FB_8,P$5,0))=16,\"\",VLOOKUP($A47,FB_8,P$5,0))&IF(TYPE(VLOOKUP($A47,FB_9,P$5,0))=16,\"\",VLOOKUP($A47,FB_9,P$5,0))&IF(TYPE(VLOOKUP($A47,FB_10,P$5,0))=16,\"\",VLOOKUP($A47,FB_10,P$5,0))&IF(TYPE(VLOOKUP($A47,FB_11,P$5,0))=16,\"\",VLOOKUP($A47,FB_11,P$5,0))&IF(TYPE(VLOOKUP($A47,FB_12,P$5,0))=16,\"\",VLOOKUP($A47,FB_12,P$5,0))&IF(TYPE(VLOOKUP($A47,FB_13,P$5,0))=16,\"\",VLOOKUP($A47,FB_13,P$5,0))&IF(TYPE(VLOOKUP($A47,FB_14,P$5,0))=16,\"\",VLOOKUP($A47,FB_14,P$5,0))&IF(TYPE(VLOOKUP($A47,FB_15,P$5,0))=16,\"\",VLOOKUP($A47,FB_15,P$5,0))&IF(TYPE(VLOOKUP($A47,FB_16,P$5,0))=16,\"\",VLOOKUP($A47,FB_16,P$5,0))&IF(TYPE(VLOOKUP($A47,FB_17,P$5,0))=16,\"\",VLOOKUP($A47,FB_17,P$5,0))&IF(TYPE(VLOOKUP($A47,FB_18,P$5,0))=16,\"\",VLOOKUP($A47,FB_18,P$5,0))&IF(TYPE(VLOOKUP($A47,FB_19,P$5,0))=16,\"\",VLOOKUP($A47,FB_19,P$5,0))&IF(TYPE(VLOOKUP($A47,FB_20,P$5,0))=16,\"\",VLOOKUP($A47,FB_20,P$5,0))&IF(TYPE(VLOOKUP($A47,FB_21,P$5,0))=16,\"\",VLOOKUP($A47,FB_21,P$5,0))&IF(TYPE(VLOOKUP($A47,FB_22,P$5,0))=16,\"\",VLOOKUP($A47,FB_22,P$5,0))&IF(TYPE(VLOOKUP($A47,FB_23,P$5,0))=16,\"\",VLOOKUP($A47,FB_23,P$5,0))&IF(TYPE(VLOOKUP($A47,FB_24,P$5,0))=16,\"\",VLOOKUP($A47,FB_24,P$5,0))&IF(TYPE(VLOOKUP($A47,FB_25,P$5,0))=16,\"\",VLOOKUP($A47,FB_25,P$5,0))&IF(TYPE(VLOOKUP($A47,FB_26,P$5,0))=16,\"\",VLOOKUP($A47,FB_26,P$5,0))&IF(TYPE(VLOOKUP($A47,FB_27,P$5,0))=16,\"\",VLOOKUP($A47,FB_27,P$5,0))&IF(TYPE(VLOOKUP($A47,FB_28,P$5,0))=16,\"\",VLOOKUP($A47,FB_28,P$5,0))&IF(TYPE(VLOOKUP($A47,FB_29,P$5,0))=16,\"\",VLOOKUP($A47,FB_29,P$5,0))&IF(TYPE(VLOOKUP($A47,FB_30,P$5,0))=16,\"\",VLOOKUP($A47,FB_30,P$5,0))))","v":""},"",{"$f":"IF($B47=\"\",\"\",_xlfn.NUMBERVALUE(IF(TYPE(VLOOKUP($A47,FB_1,R$5,0))=16,\"\",VLOOKUP($A47,FB_1,R$5,0))&IF(TYPE(VLOOKUP($A47,FB_2,R$5,0))=16,\"\",VLOOKUP($A47,FB_2,R$5,0))&IF(TYPE(VLOOKUP($A47,FB_3,R$5,0))=16,\"\",VLOOKUP($A47,FB_3,R$5,0))&IF(TYPE(VLOOKUP($A47,FB_4,R$5,0))=16,\"\",VLOOKUP($A47,FB_4,R$5,0))&IF(TYPE(VLOOKUP($A47,FB_5,R$5,0))=16,\"\",VLOOKUP($A47,FB_5,R$5,0))&IF(TYPE(VLOOKUP($A47,FB_6,R$5,0))=16,\"\",VLOOKUP($A47,FB_6,R$5,0))&IF(TYPE(VLOOKUP($A47,FB_7,R$5,0))=16,\"\",VLOOKUP($A47,FB_7,R$5,0))&IF(TYPE(VLOOKUP($A47,FB_8,R$5,0))=16,\"\",VLOOKUP($A47,FB_8,R$5,0))&IF(TYPE(VLOOKUP($A47,FB_9,R$5,0))=16,\"\",VLOOKUP($A47,FB_9,R$5,0))&IF(TYPE(VLOOKUP($A47,FB_10,R$5,0))=16,\"\",VLOOKUP($A47,FB_10,R$5,0))&IF(TYPE(VLOOKUP($A47,FB_11,R$5,0))=16,\"\",VLOOKUP($A47,FB_11,R$5,0))&IF(TYPE(VLOOKUP($A47,FB_12,R$5,0))=16,\"\",VLOOKUP($A47,FB_12,R$5,0))&IF(TYPE(VLOOKUP($A47,FB_13,R$5,0))=16,\"\",VLOOKUP($A47,FB_13,R$5,0))&IF(TYPE(VLOOKUP($A47,FB_14,R$5,0))=16,\"\",VLOOKUP($A47,FB_14,R$5,0))&IF(TYPE(VLOOKUP($A47,FB_15,R$5,0))=16,\"\",VLOOKUP($A47,FB_15,R$5,0))&IF(TYPE(VLOOKUP($A47,FB_16,R$5,0))=16,\"\",VLOOKUP($A47,FB_16,R$5,0))&IF(TYPE(VLOOKUP($A47,FB_17,R$5,0))=16,\"\",VLOOKUP($A47,FB_17,R$5,0))&IF(TYPE(VLOOKUP($A47,FB_18,R$5,0))=16,\"\",VLOOKUP($A47,FB_18,R$5,0))&IF(TYPE(VLOOKUP($A47,FB_19,R$5,0))=16,\"\",VLOOKUP($A47,FB_19,R$5,0))&IF(TYPE(VLOOKUP($A47,FB_20,R$5,0))=16,\"\",VLOOKUP($A47,FB_20,R$5,0))&IF(TYPE(VLOOKUP($A47,FB_21,R$5,0))=16,\"\",VLOOKUP($A47,FB_21,R$5,0))&IF(TYPE(VLOOKUP($A47,FB_22,R$5,0))=16,\"\",VLOOKUP($A47,FB_22,R$5,0))&IF(TYPE(VLOOKUP($A47,FB_23,R$5,0))=16,\"\",VLOOKUP($A47,FB_23,R$5,0))&IF(TYPE(VLOOKUP($A47,FB_24,R$5,0))=16,\"\",VLOOKUP($A47,FB_24,R$5,0))&IF(TYPE(VLOOKUP($A47,FB_25,R$5,0))=16,\"\",VLOOKUP($A47,FB_25,R$5,0))&IF(TYPE(VLOOKUP($A47,FB_26,R$5,0))=16,\"\",VLOOKUP($A47,FB_26,R$5,0))&IF(TYPE(VLOOKUP($A47,FB_27,R$5,0))=16,\"\",VLOOKUP($A47,FB_27,R$5,0))&IF(TYPE(VLOOKUP($A47,FB_28,R$5,0))=16,\"\",VLOOKUP($A47,FB_28,R$5,0))&IF(TYPE(VLOOKUP($A47,FB_29,R$5,0))=16,\"\",VLOOKUP($A47,FB_29,R$5,0))&IF(TYPE(VLOOKUP($A47,FB_30,R$5,0))=16,\"\",VLOOKUP($A47,FB_30,R$5,0))))","v":""},{"$f":"IF($B47=\"\",\"\",IF(TYPE(VLOOKUP($A47,FB_1,S$5,0))=16,\"\",VLOOKUP($A47,FB_1,S$5,0))&IF(TYPE(VLOOKUP($A47,FB_2,S$5,0))=16,\"\",VLOOKUP($A47,FB_2,S$5,0))&IF(TYPE(VLOOKUP($A47,FB_3,S$5,0))=16,\"\",VLOOKUP($A47,FB_3,S$5,0))&IF(TYPE(VLOOKUP($A47,FB_4,S$5,0))=16,\"\",VLOOKUP($A47,FB_4,S$5,0))&IF(TYPE(VLOOKUP($A47,FB_5,S$5,0))=16,\"\",VLOOKUP($A47,FB_5,S$5,0))&IF(TYPE(VLOOKUP($A47,FB_6,S$5,0))=16,\"\",VLOOKUP($A47,FB_6,S$5,0))&IF(TYPE(VLOOKUP($A47,FB_7,S$5,0))=16,\"\",VLOOKUP($A47,FB_7,S$5,0))&IF(TYPE(VLOOKUP($A47,FB_8,S$5,0))=16,\"\",VLOOKUP($A47,FB_8,S$5,0))&IF(TYPE(VLOOKUP($A47,FB_9,S$5,0))=16,\"\",VLOOKUP($A47,FB_9,S$5,0))&IF(TYPE(VLOOKUP($A47,FB_10,S$5,0))=16,\"\",VLOOKUP($A47,FB_10,S$5,0))&IF(TYPE(VLOOKUP($A47,FB_11,S$5,0))=16,\"\",VLOOKUP($A47,FB_11,S$5,0))&IF(TYPE(VLOOKUP($A47,FB_12,S$5,0))=16,\"\",VLOOKUP($A47,FB_12,S$5,0))&IF(TYPE(VLOOKUP($A47,FB_13,S$5,0))=16,\"\",VLOOKUP($A47,FB_13,S$5,0))&IF(TYPE(VLOOKUP($A47,FB_14,S$5,0))=16,\"\",VLOOKUP($A47,FB_14,S$5,0))&IF(TYPE(VLOOKUP($A47,FB_15,S$5,0))=16,\"\",VLOOKUP($A47,FB_15,S$5,0))&IF(TYPE(VLOOKUP($A47,FB_16,S$5,0))=16,\"\",VLOOKUP($A47,FB_16,S$5,0))&IF(TYPE(VLOOKUP($A47,FB_17,S$5,0))=16,\"\",VLOOKUP($A47,FB_17,S$5,0))&IF(TYPE(VLOOKUP($A47,FB_18,S$5,0))=16,\"\",VLOOKUP($A47,FB_18,S$5,0))&IF(TYPE(VLOOKUP($A47,FB_19,S$5,0))=16,\"\",VLOOKUP($A47,FB_19,S$5,0))&IF(TYPE(VLOOKUP($A47,FB_20,S$5,0))=16,\"\",VLOOKUP($A47,FB_20,S$5,0))&IF(TYPE(VLOOKUP($A47,FB_21,S$5,0))=16,\"\",VLOOKUP($A47,FB_21,S$5,0))&IF(TYPE(VLOOKUP($A47,FB_22,S$5,0))=16,\"\",VLOOKUP($A47,FB_22,S$5,0))&IF(TYPE(VLOOKUP($A47,FB_23,S$5,0))=16,\"\",VLOOKUP($A47,FB_23,S$5,0))&IF(TYPE(VLOOKUP($A47,FB_24,S$5,0))=16,\"\",VLOOKUP($A47,FB_24,S$5,0))&IF(TYPE(VLOOKUP($A47,FB_25,S$5,0))=16,\"\",VLOOKUP($A47,FB_25,S$5,0))&IF(TYPE(VLOOKUP($A47,FB_26,S$5,0))=16,\"\",VLOOKUP($A47,FB_26,S$5,0))&IF(TYPE(VLOOKUP($A47,FB_27,S$5,0))=16,\"\",VLOOKUP($A47,FB_27,S$5,0))&IF(TYPE(VLOOKUP($A47,FB_28,S$5,0))=16,\"\",VLOOKUP($A47,FB_28,S$5,0))&IF(TYPE(VLOOKUP($A47,FB_29,S$5,0))=16,\"\",VLOOKUP($A47,FB_29,S$5,0))&IF(TYPE(VLOOKUP($A47,FB_30,S$5,0))=16,\"\",VLOOKUP($A47,FB_30,S$5,0)))","v":""},null,null,null,null,null,null,null,null,null,null,null,null,null,null,null,null,"",":","","",""]
["19.",{"$f":"IF(TYPE(VLOOKUP($A48,FB_1,2,0))=16,\"\",VLOOKUP($A48,FB_1,2,0))&IF(TYPE(VLOOKUP($A48,FB_2,2,0))=16,\"\",VLOOKUP($A48,FB_2,2,0))&IF(TYPE(VLOOKUP($A48,FB_3,2,0))=16,\"\",VLOOKUP($A48,FB_3,2,0))&IF(TYPE(VLOOKUP($A48,FB_4,2,0))=16,\"\",VLOOKUP($A48,FB_4,2,0))&IF(TYPE(VLOOKUP($A48,FB_5,2,0))=16,\"\",VLOOKUP($A48,FB_5,2,0))&IF(TYPE(VLOOKUP($A48,FB_6,2,0))=16,\"\",VLOOKUP($A48,FB_6,2,0))&IF(TYPE(VLOOKUP($A48,FB_7,2,0))=16,\"\",VLOOKUP($A48,FB_7,2,0))&IF(TYPE(VLOOKUP($A48,FB_8,2,0))=16,\"\",VLOOKUP($A48,FB_8,2,0))&IF(TYPE(VLOOKUP($A48,FB_9,2,0))=16,\"\",VLOOKUP($A48,FB_9,2,0))&IF(TYPE(VLOOKUP($A48,FB_10,2,0))=16,\"\",VLOOKUP($A48,FB_10,2,0))&IF(TYPE(VLOOKUP($A48,FB_11,2,0))=16,\"\",VLOOKUP($A48,FB_11,2,0))&IF(TYPE(VLOOKUP($A48,FB_12,2,0))=16,\"\",VLOOKUP($A48,FB_12,2,0))&IF(TYPE(VLOOKUP($A48,FB_13,2,0))=16,\"\",VLOOKUP($A48,FB_13,2,0))&IF(TYPE(VLOOKUP($A48,FB_14,2,0))=16,\"\",VLOOKUP($A48,FB_14,2,0))&IF(TYPE(VLOOKUP($A48,FB_15,2,0))=16,\"\",VLOOKUP($A48,FB_15,2,0))&IF(TYPE(VLOOKUP($A48,FB_16,2,0))=16,\"\",VLOOKUP($A48,FB_16,2,0))&IF(TYPE(VLOOKUP($A48,FB_17,2,0))=16,\"\",VLOOKUP($A48,FB_17,2,0))&IF(TYPE(VLOOKUP($A48,FB_18,2,0))=16,\"\",VLOOKUP($A48,FB_18,2,0))&IF(TYPE(VLOOKUP($A48,FB_19,2,0))=16,\"\",VLOOKUP($A48,FB_19,2,0))&IF(TYPE(VLOOKUP($A48,FB_20,2,0))=16,\"\",VLOOKUP($A48,FB_20,2,0))&IF(TYPE(VLOOKUP($A48,FB_21,2,0))=16,\"\",VLOOKUP($A48,FB_21,2,0))&IF(TYPE(VLOOKUP($A48,FB_22,2,0))=16,\"\",VLOOKUP($A48,FB_22,2,0))&IF(TYPE(VLOOKUP($A48,FB_23,2,0))=16,\"\",VLOOKUP($A48,FB_23,2,0))&IF(TYPE(VLOOKUP($A48,FB_24,2,0))=16,\"\",VLOOKUP($A48,FB_24,2,0))&IF(TYPE(VLOOKUP($A48,FB_25,2,0))=16,\"\",VLOOKUP($A48,FB_25,2,0))&IF(TYPE(VLOOKUP($A48,FB_26,2,0))=16,\"\",VLOOKUP($A48,FB_26,2,0))&IF(TYPE(VLOOKUP($A48,FB_27,2,0))=16,\"\",VLOOKUP($A48,FB_27,2,0))&IF(TYPE(VLOOKUP($A48,FB_28,2,0))=16,\"\",VLOOKUP($A48,FB_28,2,0))&IF(TYPE(VLOOKUP($A48,FB_29,2,0))=16,\"\",VLOOKUP($A48,FB_29,2,0))&IF(TYPE(VLOOKUP($A48,FB_30,2,0))=16,\"\",VLOOKUP($A48,FB_30,2,0))","v":""},null,{"$f":"IF($B48=\"\",\"\",_xlfn.NUMBERVALUE(IF(TYPE(VLOOKUP($A48,FB_1,P$5,0))=16,\"\",VLOOKUP($A48,FB_1,P$5,0))&IF(TYPE(VLOOKUP($A48,FB_2,P$5,0))=16,\"\",VLOOKUP($A48,FB_2,P$5,0))&IF(TYPE(VLOOKUP($A48,FB_3,P$5,0))=16,\"\",VLOOKUP($A48,FB_3,P$5,0))&IF(TYPE(VLOOKUP($A48,FB_4,P$5,0))=16,\"\",VLOOKUP($A48,FB_4,P$5,0))&IF(TYPE(VLOOKUP($A48,FB_5,P$5,0))=16,\"\",VLOOKUP($A48,FB_5,P$5,0))&IF(TYPE(VLOOKUP($A48,FB_6,P$5,0))=16,\"\",VLOOKUP($A48,FB_6,P$5,0))&IF(TYPE(VLOOKUP($A48,FB_7,P$5,0))=16,\"\",VLOOKUP($A48,FB_7,P$5,0))&IF(TYPE(VLOOKUP($A48,FB_8,P$5,0))=16,\"\",VLOOKUP($A48,FB_8,P$5,0))&IF(TYPE(VLOOKUP($A48,FB_9,P$5,0))=16,\"\",VLOOKUP($A48,FB_9,P$5,0))&IF(TYPE(VLOOKUP($A48,FB_10,P$5,0))=16,\"\",VLOOKUP($A48,FB_10,P$5,0))&IF(TYPE(VLOOKUP($A48,FB_11,P$5,0))=16,\"\",VLOOKUP($A48,FB_11,P$5,0))&IF(TYPE(VLOOKUP($A48,FB_12,P$5,0))=16,\"\",VLOOKUP($A48,FB_12,P$5,0))&IF(TYPE(VLOOKUP($A48,FB_13,P$5,0))=16,\"\",VLOOKUP($A48,FB_13,P$5,0))&IF(TYPE(VLOOKUP($A48,FB_14,P$5,0))=16,\"\",VLOOKUP($A48,FB_14,P$5,0))&IF(TYPE(VLOOKUP($A48,FB_15,P$5,0))=16,\"\",VLOOKUP($A48,FB_15,P$5,0))&IF(TYPE(VLOOKUP($A48,FB_16,P$5,0))=16,\"\",VLOOKUP($A48,FB_16,P$5,0))&IF(TYPE(VLOOKUP($A48,FB_17,P$5,0))=16,\"\",VLOOKUP($A48,FB_17,P$5,0))&IF(TYPE(VLOOKUP($A48,FB_18,P$5,0))=16,\"\",VLOOKUP($A48,FB_18,P$5,0))&IF(TYPE(VLOOKUP($A48,FB_19,P$5,0))=16,\"\",VLOOKUP($A48,FB_19,P$5,0))&IF(TYPE(VLOOKUP($A48,FB_20,P$5,0))=16,\"\",VLOOKUP($A48,FB_20,P$5,0))&IF(TYPE(VLOOKUP($A48,FB_21,P$5,0))=16,\"\",VLOOKUP($A48,FB_21,P$5,0))&IF(TYPE(VLOOKUP($A48,FB_22,P$5,0))=16,\"\",VLOOKUP($A48,FB_22,P$5,0))&IF(TYPE(VLOOKUP($A48,FB_23,P$5,0))=16,\"\",VLOOKUP($A48,FB_23,P$5,0))&IF(TYPE(VLOOKUP($A48,FB_24,P$5,0))=16,\"\",VLOOKUP($A48,FB_24,P$5,0))&IF(TYPE(VLOOKUP($A48,FB_25,P$5,0))=16,\"\",VLOOKUP($A48,FB_25,P$5,0))&IF(TYPE(VLOOKUP($A48,FB_26,P$5,0))=16,\"\",VLOOKUP($A48,FB_26,P$5,0))&IF(TYPE(VLOOKUP($A48,FB_27,P$5,0))=16,\"\",VLOOKUP($A48,FB_27,P$5,0))&IF(TYPE(VLOOKUP($A48,FB_28,P$5,0))=16,\"\",VLOOKUP($A48,FB_28,P$5,0))&IF(TYPE(VLOOKUP($A48,FB_29,P$5,0))=16,\"\",VLOOKUP($A48,FB_29,P$5,0))&IF(TYPE(VLOOKUP($A48,FB_30,P$5,0))=16,\"\",VLOOKUP($A48,FB_30,P$5,0))))","v":""},"",{"$f":"IF($B48=\"\",\"\",_xlfn.NUMBERVALUE(IF(TYPE(VLOOKUP($A48,FB_1,R$5,0))=16,\"\",VLOOKUP($A48,FB_1,R$5,0))&IF(TYPE(VLOOKUP($A48,FB_2,R$5,0))=16,\"\",VLOOKUP($A48,FB_2,R$5,0))&IF(TYPE(VLOOKUP($A48,FB_3,R$5,0))=16,\"\",VLOOKUP($A48,FB_3,R$5,0))&IF(TYPE(VLOOKUP($A48,FB_4,R$5,0))=16,\"\",VLOOKUP($A48,FB_4,R$5,0))&IF(TYPE(VLOOKUP($A48,FB_5,R$5,0))=16,\"\",VLOOKUP($A48,FB_5,R$5,0))&IF(TYPE(VLOOKUP($A48,FB_6,R$5,0))=16,\"\",VLOOKUP($A48,FB_6,R$5,0))&IF(TYPE(VLOOKUP($A48,FB_7,R$5,0))=16,\"\",VLOOKUP($A48,FB_7,R$5,0))&IF(TYPE(VLOOKUP($A48,FB_8,R$5,0))=16,\"\",VLOOKUP($A48,FB_8,R$5,0))&IF(TYPE(VLOOKUP($A48,FB_9,R$5,0))=16,\"\",VLOOKUP($A48,FB_9,R$5,0))&IF(TYPE(VLOOKUP($A48,FB_10,R$5,0))=16,\"\",VLOOKUP($A48,FB_10,R$5,0))&IF(TYPE(VLOOKUP($A48,FB_11,R$5,0))=16,\"\",VLOOKUP($A48,FB_11,R$5,0))&IF(TYPE(VLOOKUP($A48,FB_12,R$5,0))=16,\"\",VLOOKUP($A48,FB_12,R$5,0))&IF(TYPE(VLOOKUP($A48,FB_13,R$5,0))=16,\"\",VLOOKUP($A48,FB_13,R$5,0))&IF(TYPE(VLOOKUP($A48,FB_14,R$5,0))=16,\"\",VLOOKUP($A48,FB_14,R$5,0))&IF(TYPE(VLOOKUP($A48,FB_15,R$5,0))=16,\"\",VLOOKUP($A48,FB_15,R$5,0))&IF(TYPE(VLOOKUP($A48,FB_16,R$5,0))=16,\"\",VLOOKUP($A48,FB_16,R$5,0))&IF(TYPE(VLOOKUP($A48,FB_17,R$5,0))=16,\"\",VLOOKUP($A48,FB_17,R$5,0))&IF(TYPE(VLOOKUP($A48,FB_18,R$5,0))=16,\"\",VLOOKUP($A48,FB_18,R$5,0))&IF(TYPE(VLOOKUP($A48,FB_19,R$5,0))=16,\"\",VLOOKUP($A48,FB_19,R$5,0))&IF(TYPE(VLOOKUP($A48,FB_20,R$5,0))=16,\"\",VLOOKUP($A48,FB_20,R$5,0))&IF(TYPE(VLOOKUP($A48,FB_21,R$5,0))=16,\"\",VLOOKUP($A48,FB_21,R$5,0))&IF(TYPE(VLOOKUP($A48,FB_22,R$5,0))=16,\"\",VLOOKUP($A48,FB_22,R$5,0))&IF(TYPE(VLOOKUP($A48,FB_23,R$5,0))=16,\"\",VLOOKUP($A48,FB_23,R$5,0))&IF(TYPE(VLOOKUP($A48,FB_24,R$5,0))=16,\"\",VLOOKUP($A48,FB_24,R$5,0))&IF(TYPE(VLOOKUP($A48,FB_25,R$5,0))=16,\"\",VLOOKUP($A48,FB_25,R$5,0))&IF(TYPE(VLOOKUP($A48,FB_26,R$5,0))=16,\"\",VLOOKUP($A48,FB_26,R$5,0))&IF(TYPE(VLOOKUP($A48,FB_27,R$5,0))=16,\"\",VLOOKUP($A48,FB_27,R$5,0))&IF(TYPE(VLOOKUP($A48,FB_28,R$5,0))=16,\"\",VLOOKUP($A48,FB_28,R$5,0))&IF(TYPE(VLOOKUP($A48,FB_29,R$5,0))=16,\"\",VLOOKUP($A48,FB_29,R$5,0))&IF(TYPE(VLOOKUP($A48,FB_30,R$5,0))=16,\"\",VLOOKUP($A48,FB_30,R$5,0))))","v":""},{"$f":"IF($B48=\"\",\"\",IF(TYPE(VLOOKUP($A48,FB_1,S$5,0))=16,\"\",VLOOKUP($A48,FB_1,S$5,0))&IF(TYPE(VLOOKUP($A48,FB_2,S$5,0))=16,\"\",VLOOKUP($A48,FB_2,S$5,0))&IF(TYPE(VLOOKUP($A48,FB_3,S$5,0))=16,\"\",VLOOKUP($A48,FB_3,S$5,0))&IF(TYPE(VLOOKUP($A48,FB_4,S$5,0))=16,\"\",VLOOKUP($A48,FB_4,S$5,0))&IF(TYPE(VLOOKUP($A48,FB_5,S$5,0))=16,\"\",VLOOKUP($A48,FB_5,S$5,0))&IF(TYPE(VLOOKUP($A48,FB_6,S$5,0))=16,\"\",VLOOKUP($A48,FB_6,S$5,0))&IF(TYPE(VLOOKUP($A48,FB_7,S$5,0))=16,\"\",VLOOKUP($A48,FB_7,S$5,0))&IF(TYPE(VLOOKUP($A48,FB_8,S$5,0))=16,\"\",VLOOKUP($A48,FB_8,S$5,0))&IF(TYPE(VLOOKUP($A48,FB_9,S$5,0))=16,\"\",VLOOKUP($A48,FB_9,S$5,0))&IF(TYPE(VLOOKUP($A48,FB_10,S$5,0))=16,\"\",VLOOKUP($A48,FB_10,S$5,0))&IF(TYPE(VLOOKUP($A48,FB_11,S$5,0))=16,\"\",VLOOKUP($A48,FB_11,S$5,0))&IF(TYPE(VLOOKUP($A48,FB_12,S$5,0))=16,\"\",VLOOKUP($A48,FB_12,S$5,0))&IF(TYPE(VLOOKUP($A48,FB_13,S$5,0))=16,\"\",VLOOKUP($A48,FB_13,S$5,0))&IF(TYPE(VLOOKUP($A48,FB_14,S$5,0))=16,\"\",VLOOKUP($A48,FB_14,S$5,0))&IF(TYPE(VLOOKUP($A48,FB_15,S$5,0))=16,\"\",VLOOKUP($A48,FB_15,S$5,0))&IF(TYPE(VLOOKUP($A48,FB_16,S$5,0))=16,\"\",VLOOKUP($A48,FB_16,S$5,0))&IF(TYPE(VLOOKUP($A48,FB_17,S$5,0))=16,\"\",VLOOKUP($A48,FB_17,S$5,0))&IF(TYPE(VLOOKUP($A48,FB_18,S$5,0))=16,\"\",VLOOKUP($A48,FB_18,S$5,0))&IF(TYPE(VLOOKUP($A48,FB_19,S$5,0))=16,\"\",VLOOKUP($A48,FB_19,S$5,0))&IF(TYPE(VLOOKUP($A48,FB_20,S$5,0))=16,\"\",VLOOKUP($A48,FB_20,S$5,0))&IF(TYPE(VLOOKUP($A48,FB_21,S$5,0))=16,\"\",VLOOKUP($A48,FB_21,S$5,0))&IF(TYPE(VLOOKUP($A48,FB_22,S$5,0))=16,\"\",VLOOKUP($A48,FB_22,S$5,0))&IF(TYPE(VLOOKUP($A48,FB_23,S$5,0))=16,\"\",VLOOKUP($A48,FB_23,S$5,0))&IF(TYPE(VLOOKUP($A48,FB_24,S$5,0))=16,\"\",VLOOKUP($A48,FB_24,S$5,0))&IF(TYPE(VLOOKUP($A48,FB_25,S$5,0))=16,\"\",VLOOKUP($A48,FB_25,S$5,0))&IF(TYPE(VLOOKUP($A48,FB_26,S$5,0))=16,\"\",VLOOKUP($A48,FB_26,S$5,0))&IF(TYPE(VLOOKUP($A48,FB_27,S$5,0))=16,\"\",VLOOKUP($A48,FB_27,S$5,0))&IF(TYPE(VLOOKUP($A48,FB_28,S$5,0))=16,\"\",VLOOKUP($A48,FB_28,S$5,0))&IF(TYPE(VLOOKUP($A48,FB_29,S$5,0))=16,\"\",VLOOKUP($A48,FB_29,S$5,0))&IF(TYPE(VLOOKUP($A48,FB_30,S$5,0))=16,\"\",VLOOKUP($A48,FB_30,S$5,0)))","v":""},null,null,null,null,null,null,null,null,null,null,null,null,null,null,null,null,"",":","","",""]
["20.",{"$f":"IF(TYPE(VLOOKUP($A49,FB_1,2,0))=16,\"\",VLOOKUP($A49,FB_1,2,0))&IF(TYPE(VLOOKUP($A49,FB_2,2,0))=16,\"\",VLOOKUP($A49,FB_2,2,0))&IF(TYPE(VLOOKUP($A49,FB_3,2,0))=16,\"\",VLOOKUP($A49,FB_3,2,0))&IF(TYPE(VLOOKUP($A49,FB_4,2,0))=16,\"\",VLOOKUP($A49,FB_4,2,0))&IF(TYPE(VLOOKUP($A49,FB_5,2,0))=16,\"\",VLOOKUP($A49,FB_5,2,0))&IF(TYPE(VLOOKUP($A49,FB_6,2,0))=16,\"\",VLOOKUP($A49,FB_6,2,0))&IF(TYPE(VLOOKUP($A49,FB_7,2,0))=16,\"\",VLOOKUP($A49,FB_7,2,0))&IF(TYPE(VLOOKUP($A49,FB_8,2,0))=16,\"\",VLOOKUP($A49,FB_8,2,0))&IF(TYPE(VLOOKUP($A49,FB_9,2,0))=16,\"\",VLOOKUP($A49,FB_9,2,0))&IF(TYPE(VLOOKUP($A49,FB_10,2,0))=16,\"\",VLOOKUP($A49,FB_10,2,0))&IF(TYPE(VLOOKUP($A49,FB_11,2,0))=16,\"\",VLOOKUP($A49,FB_11,2,0))&IF(TYPE(VLOOKUP($A49,FB_12,2,0))=16,\"\",VLOOKUP($A49,FB_12,2,0))&IF(TYPE(VLOOKUP($A49,FB_13,2,0))=16,\"\",VLOOKUP($A49,FB_13,2,0))&IF(TYPE(VLOOKUP($A49,FB_14,2,0))=16,\"\",VLOOKUP($A49,FB_14,2,0))&IF(TYPE(VLOOKUP($A49,FB_15,2,0))=16,\"\",VLOOKUP($A49,FB_15,2,0))&IF(TYPE(VLOOKUP($A49,FB_16,2,0))=16,\"\",VLOOKUP($A49,FB_16,2,0))&IF(TYPE(VLOOKUP($A49,FB_17,2,0))=16,\"\",VLOOKUP($A49,FB_17,2,0))&IF(TYPE(VLOOKUP($A49,FB_18,2,0))=16,\"\",VLOOKUP($A49,FB_18,2,0))&IF(TYPE(VLOOKUP($A49,FB_19,2,0))=16,\"\",VLOOKUP($A49,FB_19,2,0))&IF(TYPE(VLOOKUP($A49,FB_20,2,0))=16,\"\",VLOOKUP($A49,FB_20,2,0))&IF(TYPE(VLOOKUP($A49,FB_21,2,0))=16,\"\",VLOOKUP($A49,FB_21,2,0))&IF(TYPE(VLOOKUP($A49,FB_22,2,0))=16,\"\",VLOOKUP($A49,FB_22,2,0))&IF(TYPE(VLOOKUP($A49,FB_23,2,0))=16,\"\",VLOOKUP($A49,FB_23,2,0))&IF(TYPE(VLOOKUP($A49,FB_24,2,0))=16,\"\",VLOOKUP($A49,FB_24,2,0))&IF(TYPE(VLOOKUP($A49,FB_25,2,0))=16,\"\",VLOOKUP($A49,FB_25,2,0))&IF(TYPE(VLOOKUP($A49,FB_26,2,0))=16,\"\",VLOOKUP($A49,FB_26,2,0))&IF(TYPE(VLOOKUP($A49,FB_27,2,0))=16,\"\",VLOOKUP($A49,FB_27,2,0))&IF(TYPE(VLOOKUP($A49,FB_28,2,0))=16,\"\",VLOOKUP($A49,FB_28,2,0))&IF(TYPE(VLOOKUP($A49,FB_29,2,0))=16,\"\",VLOOKUP($A49,FB_29,2,0))&IF(TYPE(VLOOKUP($A49,FB_30,2,0))=16,\"\",VLOOKUP($A49,FB_30,2,0))","v":""},null,{"$f":"IF($B49=\"\",\"\",_xlfn.NUMBERVALUE(IF(TYPE(VLOOKUP($A49,FB_1,P$5,0))=16,\"\",VLOOKUP($A49,FB_1,P$5,0))&IF(TYPE(VLOOKUP($A49,FB_2,P$5,0))=16,\"\",VLOOKUP($A49,FB_2,P$5,0))&IF(TYPE(VLOOKUP($A49,FB_3,P$5,0))=16,\"\",VLOOKUP($A49,FB_3,P$5,0))&IF(TYPE(VLOOKUP($A49,FB_4,P$5,0))=16,\"\",VLOOKUP($A49,FB_4,P$5,0))&IF(TYPE(VLOOKUP($A49,FB_5,P$5,0))=16,\"\",VLOOKUP($A49,FB_5,P$5,0))&IF(TYPE(VLOOKUP($A49,FB_6,P$5,0))=16,\"\",VLOOKUP($A49,FB_6,P$5,0))&IF(TYPE(VLOOKUP($A49,FB_7,P$5,0))=16,\"\",VLOOKUP($A49,FB_7,P$5,0))&IF(TYPE(VLOOKUP($A49,FB_8,P$5,0))=16,\"\",VLOOKUP($A49,FB_8,P$5,0))&IF(TYPE(VLOOKUP($A49,FB_9,P$5,0))=16,\"\",VLOOKUP($A49,FB_9,P$5,0))&IF(TYPE(VLOOKUP($A49,FB_10,P$5,0))=16,\"\",VLOOKUP($A49,FB_10,P$5,0))&IF(TYPE(VLOOKUP($A49,FB_11,P$5,0))=16,\"\",VLOOKUP($A49,FB_11,P$5,0))&IF(TYPE(VLOOKUP($A49,FB_12,P$5,0))=16,\"\",VLOOKUP($A49,FB_12,P$5,0))&IF(TYPE(VLOOKUP($A49,FB_13,P$5,0))=16,\"\",VLOOKUP($A49,FB_13,P$5,0))&IF(TYPE(VLOOKUP($A49,FB_14,P$5,0))=16,\"\",VLOOKUP($A49,FB_14,P$5,0))&IF(TYPE(VLOOKUP($A49,FB_15,P$5,0))=16,\"\",VLOOKUP($A49,FB_15,P$5,0))&IF(TYPE(VLOOKUP($A49,FB_16,P$5,0))=16,\"\",VLOOKUP($A49,FB_16,P$5,0))&IF(TYPE(VLOOKUP($A49,FB_17,P$5,0))=16,\"\",VLOOKUP($A49,FB_17,P$5,0))&IF(TYPE(VLOOKUP($A49,FB_18,P$5,0))=16,\"\",VLOOKUP($A49,FB_18,P$5,0))&IF(TYPE(VLOOKUP($A49,FB_19,P$5,0))=16,\"\",VLOOKUP($A49,FB_19,P$5,0))&IF(TYPE(VLOOKUP($A49,FB_20,P$5,0))=16,\"\",VLOOKUP($A49,FB_20,P$5,0))&IF(TYPE(VLOOKUP($A49,FB_21,P$5,0))=16,\"\",VLOOKUP($A49,FB_21,P$5,0))&IF(TYPE(VLOOKUP($A49,FB_22,P$5,0))=16,\"\",VLOOKUP($A49,FB_22,P$5,0))&IF(TYPE(VLOOKUP($A49,FB_23,P$5,0))=16,\"\",VLOOKUP($A49,FB_23,P$5,0))&IF(TYPE(VLOOKUP($A49,FB_24,P$5,0))=16,\"\",VLOOKUP($A49,FB_24,P$5,0))&IF(TYPE(VLOOKUP($A49,FB_25,P$5,0))=16,\"\",VLOOKUP($A49,FB_25,P$5,0))&IF(TYPE(VLOOKUP($A49,FB_26,P$5,0))=16,\"\",VLOOKUP($A49,FB_26,P$5,0))&IF(TYPE(VLOOKUP($A49,FB_27,P$5,0))=16,\"\",VLOOKUP($A49,FB_27,P$5,0))&IF(TYPE(VLOOKUP($A49,FB_28,P$5,0))=16,\"\",VLOOKUP($A49,FB_28,P$5,0))&IF(TYPE(VLOOKUP($A49,FB_29,P$5,0))=16,\"\",VLOOKUP($A49,FB_29,P$5,0))&IF(TYPE(VLOOKUP($A49,FB_30,P$5,0))=16,\"\",VLOOKUP($A49,FB_30,P$5,0))))","v":""},"",{"$f":"IF($B49=\"\",\"\",_xlfn.NUMBERVALUE(IF(TYPE(VLOOKUP($A49,FB_1,R$5,0))=16,\"\",VLOOKUP($A49,FB_1,R$5,0))&IF(TYPE(VLOOKUP($A49,FB_2,R$5,0))=16,\"\",VLOOKUP($A49,FB_2,R$5,0))&IF(TYPE(VLOOKUP($A49,FB_3,R$5,0))=16,\"\",VLOOKUP($A49,FB_3,R$5,0))&IF(TYPE(VLOOKUP($A49,FB_4,R$5,0))=16,\"\",VLOOKUP($A49,FB_4,R$5,0))&IF(TYPE(VLOOKUP($A49,FB_5,R$5,0))=16,\"\",VLOOKUP($A49,FB_5,R$5,0))&IF(TYPE(VLOOKUP($A49,FB_6,R$5,0))=16,\"\",VLOOKUP($A49,FB_6,R$5,0))&IF(TYPE(VLOOKUP($A49,FB_7,R$5,0))=16,\"\",VLOOKUP($A49,FB_7,R$5,0))&IF(TYPE(VLOOKUP($A49,FB_8,R$5,0))=16,\"\",VLOOKUP($A49,FB_8,R$5,0))&IF(TYPE(VLOOKUP($A49,FB_9,R$5,0))=16,\"\",VLOOKUP($A49,FB_9,R$5,0))&IF(TYPE(VLOOKUP($A49,FB_10,R$5,0))=16,\"\",VLOOKUP($A49,FB_10,R$5,0))&IF(TYPE(VLOOKUP($A49,FB_11,R$5,0))=16,\"\",VLOOKUP($A49,FB_11,R$5,0))&IF(TYPE(VLOOKUP($A49,FB_12,R$5,0))=16,\"\",VLOOKUP($A49,FB_12,R$5,0))&IF(TYPE(VLOOKUP($A49,FB_13,R$5,0))=16,\"\",VLOOKUP($A49,FB_13,R$5,0))&IF(TYPE(VLOOKUP($A49,FB_14,R$5,0))=16,\"\",VLOOKUP($A49,FB_14,R$5,0))&IF(TYPE(VLOOKUP($A49,FB_15,R$5,0))=16,\"\",VLOOKUP($A49,FB_15,R$5,0))&IF(TYPE(VLOOKUP($A49,FB_16,R$5,0))=16,\"\",VLOOKUP($A49,FB_16,R$5,0))&IF(TYPE(VLOOKUP($A49,FB_17,R$5,0))=16,\"\",VLOOKUP($A49,FB_17,R$5,0))&IF(TYPE(VLOOKUP($A49,FB_18,R$5,0))=16,\"\",VLOOKUP($A49,FB_18,R$5,0))&IF(TYPE(VLOOKUP($A49,FB_19,R$5,0))=16,\"\",VLOOKUP($A49,FB_19,R$5,0))&IF(TYPE(VLOOKUP($A49,FB_20,R$5,0))=16,\"\",VLOOKUP($A49,FB_20,R$5,0))&IF(TYPE(VLOOKUP($A49,FB_21,R$5,0))=16,\"\",VLOOKUP($A49,FB_21,R$5,0))&IF(TYPE(VLOOKUP($A49,FB_22,R$5,0))=16,\"\",VLOOKUP($A49,FB_22,R$5,0))&IF(TYPE(VLOOKUP($A49,FB_23,R$5,0))=16,\"\",VLOOKUP($A49,FB_23,R$5,0))&IF(TYPE(VLOOKUP($A49,FB_24,R$5,0))=16,\"\",VLOOKUP($A49,FB_24,R$5,0))&IF(TYPE(VLOOKUP($A49,FB_25,R$5,0))=16,\"\",VLOOKUP($A49,FB_25,R$5,0))&IF(TYPE(VLOOKUP($A49,FB_26,R$5,0))=16,\"\",VLOOKUP($A49,FB_26,R$5,0))&IF(TYPE(VLOOKUP($A49,FB_27,R$5,0))=16,\"\",VLOOKUP($A49,FB_27,R$5,0))&IF(TYPE(VLOOKUP($A49,FB_28,R$5,0))=16,\"\",VLOOKUP($A49,FB_28,R$5,0))&IF(TYPE(VLOOKUP($A49,FB_29,R$5,0))=16,\"\",VLOOKUP($A49,FB_29,R$5,0))&IF(TYPE(VLOOKUP($A49,FB_30,R$5,0))=16,\"\",VLOOKUP($A49,FB_30,R$5,0))))","v":""},{"$f":"IF($B49=\"\",\"\",IF(TYPE(VLOOKUP($A49,FB_1,S$5,0))=16,\"\",VLOOKUP($A49,FB_1,S$5,0))&IF(TYPE(VLOOKUP($A49,FB_2,S$5,0))=16,\"\",VLOOKUP($A49,FB_2,S$5,0))&IF(TYPE(VLOOKUP($A49,FB_3,S$5,0))=16,\"\",VLOOKUP($A49,FB_3,S$5,0))&IF(TYPE(VLOOKUP($A49,FB_4,S$5,0))=16,\"\",VLOOKUP($A49,FB_4,S$5,0))&IF(TYPE(VLOOKUP($A49,FB_5,S$5,0))=16,\"\",VLOOKUP($A49,FB_5,S$5,0))&IF(TYPE(VLOOKUP($A49,FB_6,S$5,0))=16,\"\",VLOOKUP($A49,FB_6,S$5,0))&IF(TYPE(VLOOKUP($A49,FB_7,S$5,0))=16,\"\",VLOOKUP($A49,FB_7,S$5,0))&IF(TYPE(VLOOKUP($A49,FB_8,S$5,0))=16,\"\",VLOOKUP($A49,FB_8,S$5,0))&IF(TYPE(VLOOKUP($A49,FB_9,S$5,0))=16,\"\",VLOOKUP($A49,FB_9,S$5,0))&IF(TYPE(VLOOKUP($A49,FB_10,S$5,0))=16,\"\",VLOOKUP($A49,FB_10,S$5,0))&IF(TYPE(VLOOKUP($A49,FB_11,S$5,0))=16,\"\",VLOOKUP($A49,FB_11,S$5,0))&IF(TYPE(VLOOKUP($A49,FB_12,S$5,0))=16,\"\",VLOOKUP($A49,FB_12,S$5,0))&IF(TYPE(VLOOKUP($A49,FB_13,S$5,0))=16,\"\",VLOOKUP($A49,FB_13,S$5,0))&IF(TYPE(VLOOKUP($A49,FB_14,S$5,0))=16,\"\",VLOOKUP($A49,FB_14,S$5,0))&IF(TYPE(VLOOKUP($A49,FB_15,S$5,0))=16,\"\",VLOOKUP($A49,FB_15,S$5,0))&IF(TYPE(VLOOKUP($A49,FB_16,S$5,0))=16,\"\",VLOOKUP($A49,FB_16,S$5,0))&IF(TYPE(VLOOKUP($A49,FB_17,S$5,0))=16,\"\",VLOOKUP($A49,FB_17,S$5,0))&IF(TYPE(VLOOKUP($A49,FB_18,S$5,0))=16,\"\",VLOOKUP($A49,FB_18,S$5,0))&IF(TYPE(VLOOKUP($A49,FB_19,S$5,0))=16,\"\",VLOOKUP($A49,FB_19,S$5,0))&IF(TYPE(VLOOKUP($A49,FB_20,S$5,0))=16,\"\",VLOOKUP($A49,FB_20,S$5,0))&IF(TYPE(VLOOKUP($A49,FB_21,S$5,0))=16,\"\",VLOOKUP($A49,FB_21,S$5,0))&IF(TYPE(VLOOKUP($A49,FB_22,S$5,0))=16,\"\",VLOOKUP($A49,FB_22,S$5,0))&IF(TYPE(VLOOKUP($A49,FB_23,S$5,0))=16,\"\",VLOOKUP($A49,FB_23,S$5,0))&IF(TYPE(VLOOKUP($A49,FB_24,S$5,0))=16,\"\",VLOOKUP($A49,FB_24,S$5,0))&IF(TYPE(VLOOKUP($A49,FB_25,S$5,0))=16,\"\",VLOOKUP($A49,FB_25,S$5,0))&IF(TYPE(VLOOKUP($A49,FB_26,S$5,0))=16,\"\",VLOOKUP($A49,FB_26,S$5,0))&IF(TYPE(VLOOKUP($A49,FB_27,S$5,0))=16,\"\",VLOOKUP($A49,FB_27,S$5,0))&IF(TYPE(VLOOKUP($A49,FB_28,S$5,0))=16,\"\",VLOOKUP($A49,FB_28,S$5,0))&IF(TYPE(VLOOKUP($A49,FB_29,S$5,0))=16,\"\",VLOOKUP($A49,FB_29,S$5,0))&IF(TYPE(VLOOKUP($A49,FB_30,S$5,0))=16,\"\",VLOOKUP($A49,FB_30,S$5,0)))","v":""},null,null,null,null,null,null,null,null,null,null,null,null,null,null,null,null,"",":","","",""]
["21.",{"$f":"IF(TYPE(VLOOKUP($A50,FB_1,2,0))=16,\"\",VLOOKUP($A50,FB_1,2,0))&IF(TYPE(VLOOKUP($A50,FB_2,2,0))=16,\"\",VLOOKUP($A50,FB_2,2,0))&IF(TYPE(VLOOKUP($A50,FB_3,2,0))=16,\"\",VLOOKUP($A50,FB_3,2,0))&IF(TYPE(VLOOKUP($A50,FB_4,2,0))=16,\"\",VLOOKUP($A50,FB_4,2,0))&IF(TYPE(VLOOKUP($A50,FB_5,2,0))=16,\"\",VLOOKUP($A50,FB_5,2,0))&IF(TYPE(VLOOKUP($A50,FB_6,2,0))=16,\"\",VLOOKUP($A50,FB_6,2,0))&IF(TYPE(VLOOKUP($A50,FB_7,2,0))=16,\"\",VLOOKUP($A50,FB_7,2,0))&IF(TYPE(VLOOKUP($A50,FB_8,2,0))=16,\"\",VLOOKUP($A50,FB_8,2,0))&IF(TYPE(VLOOKUP($A50,FB_9,2,0))=16,\"\",VLOOKUP($A50,FB_9,2,0))&IF(TYPE(VLOOKUP($A50,FB_10,2,0))=16,\"\",VLOOKUP($A50,FB_10,2,0))&IF(TYPE(VLOOKUP($A50,FB_11,2,0))=16,\"\",VLOOKUP($A50,FB_11,2,0))&IF(TYPE(VLOOKUP($A50,FB_12,2,0))=16,\"\",VLOOKUP($A50,FB_12,2,0))&IF(TYPE(VLOOKUP($A50,FB_13,2,0))=16,\"\",VLOOKUP($A50,FB_13,2,0))&IF(TYPE(VLOOKUP($A50,FB_14,2,0))=16,\"\",VLOOKUP($A50,FB_14,2,0))&IF(TYPE(VLOOKUP($A50,FB_15,2,0))=16,\"\",VLOOKUP($A50,FB_15,2,0))&IF(TYPE(VLOOKUP($A50,FB_16,2,0))=16,\"\",VLOOKUP($A50,FB_16,2,0))&IF(TYPE(VLOOKUP($A50,FB_17,2,0))=16,\"\",VLOOKUP($A50,FB_17,2,0))&IF(TYPE(VLOOKUP($A50,FB_18,2,0))=16,\"\",VLOOKUP($A50,FB_18,2,0))&IF(TYPE(VLOOKUP($A50,FB_19,2,0))=16,\"\",VLOOKUP($A50,FB_19,2,0))&IF(TYPE(VLOOKUP($A50,FB_20,2,0))=16,\"\",VLOOKUP($A50,FB_20,2,0))&IF(TYPE(VLOOKUP($A50,FB_21,2,0))=16,\"\",VLOOKUP($A50,FB_21,2,0))&IF(TYPE(VLOOKUP($A50,FB_22,2,0))=16,\"\",VLOOKUP($A50,FB_22,2,0))&IF(TYPE(VLOOKUP($A50,FB_23,2,0))=16,\"\",VLOOKUP($A50,FB_23,2,0))&IF(TYPE(VLOOKUP($A50,FB_24,2,0))=16,\"\",VLOOKUP($A50,FB_24,2,0))&IF(TYPE(VLOOKUP($A50,FB_25,2,0))=16,\"\",VLOOKUP($A50,FB_25,2,0))&IF(TYPE(VLOOKUP($A50,FB_26,2,0))=16,\"\",VLOOKUP($A50,FB_26,2,0))&IF(TYPE(VLOOKUP($A50,FB_27,2,0))=16,\"\",VLOOKUP($A50,FB_27,2,0))&IF(TYPE(VLOOKUP($A50,FB_28,2,0))=16,\"\",VLOOKUP($A50,FB_28,2,0))&IF(TYPE(VLOOKUP($A50,FB_29,2,0))=16,\"\",VLOOKUP($A50,FB_29,2,0))&IF(TYPE(VLOOKUP($A50,FB_30,2,0))=16,\"\",VLOOKUP($A50,FB_30,2,0))","v":""},null,{"$f":"IF($B50=\"\",\"\",_xlfn.NUMBERVALUE(IF(TYPE(VLOOKUP($A50,FB_1,P$5,0))=16,\"\",VLOOKUP($A50,FB_1,P$5,0))&IF(TYPE(VLOOKUP($A50,FB_2,P$5,0))=16,\"\",VLOOKUP($A50,FB_2,P$5,0))&IF(TYPE(VLOOKUP($A50,FB_3,P$5,0))=16,\"\",VLOOKUP($A50,FB_3,P$5,0))&IF(TYPE(VLOOKUP($A50,FB_4,P$5,0))=16,\"\",VLOOKUP($A50,FB_4,P$5,0))&IF(TYPE(VLOOKUP($A50,FB_5,P$5,0))=16,\"\",VLOOKUP($A50,FB_5,P$5,0))&IF(TYPE(VLOOKUP($A50,FB_6,P$5,0))=16,\"\",VLOOKUP($A50,FB_6,P$5,0))&IF(TYPE(VLOOKUP($A50,FB_7,P$5,0))=16,\"\",VLOOKUP($A50,FB_7,P$5,0))&IF(TYPE(VLOOKUP($A50,FB_8,P$5,0))=16,\"\",VLOOKUP($A50,FB_8,P$5,0))&IF(TYPE(VLOOKUP($A50,FB_9,P$5,0))=16,\"\",VLOOKUP($A50,FB_9,P$5,0))&IF(TYPE(VLOOKUP($A50,FB_10,P$5,0))=16,\"\",VLOOKUP($A50,FB_10,P$5,0))&IF(TYPE(VLOOKUP($A50,FB_11,P$5,0))=16,\"\",VLOOKUP($A50,FB_11,P$5,0))&IF(TYPE(VLOOKUP($A50,FB_12,P$5,0))=16,\"\",VLOOKUP($A50,FB_12,P$5,0))&IF(TYPE(VLOOKUP($A50,FB_13,P$5,0))=16,\"\",VLOOKUP($A50,FB_13,P$5,0))&IF(TYPE(VLOOKUP($A50,FB_14,P$5,0))=16,\"\",VLOOKUP($A50,FB_14,P$5,0))&IF(TYPE(VLOOKUP($A50,FB_15,P$5,0))=16,\"\",VLOOKUP($A50,FB_15,P$5,0))&IF(TYPE(VLOOKUP($A50,FB_16,P$5,0))=16,\"\",VLOOKUP($A50,FB_16,P$5,0))&IF(TYPE(VLOOKUP($A50,FB_17,P$5,0))=16,\"\",VLOOKUP($A50,FB_17,P$5,0))&IF(TYPE(VLOOKUP($A50,FB_18,P$5,0))=16,\"\",VLOOKUP($A50,FB_18,P$5,0))&IF(TYPE(VLOOKUP($A50,FB_19,P$5,0))=16,\"\",VLOOKUP($A50,FB_19,P$5,0))&IF(TYPE(VLOOKUP($A50,FB_20,P$5,0))=16,\"\",VLOOKUP($A50,FB_20,P$5,0))&IF(TYPE(VLOOKUP($A50,FB_21,P$5,0))=16,\"\",VLOOKUP($A50,FB_21,P$5,0))&IF(TYPE(VLOOKUP($A50,FB_22,P$5,0))=16,\"\",VLOOKUP($A50,FB_22,P$5,0))&IF(TYPE(VLOOKUP($A50,FB_23,P$5,0))=16,\"\",VLOOKUP($A50,FB_23,P$5,0))&IF(TYPE(VLOOKUP($A50,FB_24,P$5,0))=16,\"\",VLOOKUP($A50,FB_24,P$5,0))&IF(TYPE(VLOOKUP($A50,FB_25,P$5,0))=16,\"\",VLOOKUP($A50,FB_25,P$5,0))&IF(TYPE(VLOOKUP($A50,FB_26,P$5,0))=16,\"\",VLOOKUP($A50,FB_26,P$5,0))&IF(TYPE(VLOOKUP($A50,FB_27,P$5,0))=16,\"\",VLOOKUP($A50,FB_27,P$5,0))&IF(TYPE(VLOOKUP($A50,FB_28,P$5,0))=16,\"\",VLOOKUP($A50,FB_28,P$5,0))&IF(TYPE(VLOOKUP($A50,FB_29,P$5,0))=16,\"\",VLOOKUP($A50,FB_29,P$5,0))&IF(TYPE(VLOOKUP($A50,FB_30,P$5,0))=16,\"\",VLOOKUP($A50,FB_30,P$5,0))))","v":""},"",{"$f":"IF($B50=\"\",\"\",_xlfn.NUMBERVALUE(IF(TYPE(VLOOKUP($A50,FB_1,R$5,0))=16,\"\",VLOOKUP($A50,FB_1,R$5,0))&IF(TYPE(VLOOKUP($A50,FB_2,R$5,0))=16,\"\",VLOOKUP($A50,FB_2,R$5,0))&IF(TYPE(VLOOKUP($A50,FB_3,R$5,0))=16,\"\",VLOOKUP($A50,FB_3,R$5,0))&IF(TYPE(VLOOKUP($A50,FB_4,R$5,0))=16,\"\",VLOOKUP($A50,FB_4,R$5,0))&IF(TYPE(VLOOKUP($A50,FB_5,R$5,0))=16,\"\",VLOOKUP($A50,FB_5,R$5,0))&IF(TYPE(VLOOKUP($A50,FB_6,R$5,0))=16,\"\",VLOOKUP($A50,FB_6,R$5,0))&IF(TYPE(VLOOKUP($A50,FB_7,R$5,0))=16,\"\",VLOOKUP($A50,FB_7,R$5,0))&IF(TYPE(VLOOKUP($A50,FB_8,R$5,0))=16,\"\",VLOOKUP($A50,FB_8,R$5,0))&IF(TYPE(VLOOKUP($A50,FB_9,R$5,0))=16,\"\",VLOOKUP($A50,FB_9,R$5,0))&IF(TYPE(VLOOKUP($A50,FB_10,R$5,0))=16,\"\",VLOOKUP($A50,FB_10,R$5,0))&IF(TYPE(VLOOKUP($A50,FB_11,R$5,0))=16,\"\",VLOOKUP($A50,FB_11,R$5,0))&IF(TYPE(VLOOKUP($A50,FB_12,R$5,0))=16,\"\",VLOOKUP($A50,FB_12,R$5,0))&IF(TYPE(VLOOKUP($A50,FB_13,R$5,0))=16,\"\",VLOOKUP($A50,FB_13,R$5,0))&IF(TYPE(VLOOKUP($A50,FB_14,R$5,0))=16,\"\",VLOOKUP($A50,FB_14,R$5,0))&IF(TYPE(VLOOKUP($A50,FB_15,R$5,0))=16,\"\",VLOOKUP($A50,FB_15,R$5,0))&IF(TYPE(VLOOKUP($A50,FB_16,R$5,0))=16,\"\",VLOOKUP($A50,FB_16,R$5,0))&IF(TYPE(VLOOKUP($A50,FB_17,R$5,0))=16,\"\",VLOOKUP($A50,FB_17,R$5,0))&IF(TYPE(VLOOKUP($A50,FB_18,R$5,0))=16,\"\",VLOOKUP($A50,FB_18,R$5,0))&IF(TYPE(VLOOKUP($A50,FB_19,R$5,0))=16,\"\",VLOOKUP($A50,FB_19,R$5,0))&IF(TYPE(VLOOKUP($A50,FB_20,R$5,0))=16,\"\",VLOOKUP($A50,FB_20,R$5,0))&IF(TYPE(VLOOKUP($A50,FB_21,R$5,0))=16,\"\",VLOOKUP($A50,FB_21,R$5,0))&IF(TYPE(VLOOKUP($A50,FB_22,R$5,0))=16,\"\",VLOOKUP($A50,FB_22,R$5,0))&IF(TYPE(VLOOKUP($A50,FB_23,R$5,0))=16,\"\",VLOOKUP($A50,FB_23,R$5,0))&IF(TYPE(VLOOKUP($A50,FB_24,R$5,0))=16,\"\",VLOOKUP($A50,FB_24,R$5,0))&IF(TYPE(VLOOKUP($A50,FB_25,R$5,0))=16,\"\",VLOOKUP($A50,FB_25,R$5,0))&IF(TYPE(VLOOKUP($A50,FB_26,R$5,0))=16,\"\",VLOOKUP($A50,FB_26,R$5,0))&IF(TYPE(VLOOKUP($A50,FB_27,R$5,0))=16,\"\",VLOOKUP($A50,FB_27,R$5,0))&IF(TYPE(VLOOKUP($A50,FB_28,R$5,0))=16,\"\",VLOOKUP($A50,FB_28,R$5,0))&IF(TYPE(VLOOKUP($A50,FB_29,R$5,0))=16,\"\",VLOOKUP($A50,FB_29,R$5,0))&IF(TYPE(VLOOKUP($A50,FB_30,R$5,0))=16,\"\",VLOOKUP($A50,FB_30,R$5,0))))","v":""},{"$f":"IF($B50=\"\",\"\",IF(TYPE(VLOOKUP($A50,FB_1,S$5,0))=16,\"\",VLOOKUP($A50,FB_1,S$5,0))&IF(TYPE(VLOOKUP($A50,FB_2,S$5,0))=16,\"\",VLOOKUP($A50,FB_2,S$5,0))&IF(TYPE(VLOOKUP($A50,FB_3,S$5,0))=16,\"\",VLOOKUP($A50,FB_3,S$5,0))&IF(TYPE(VLOOKUP($A50,FB_4,S$5,0))=16,\"\",VLOOKUP($A50,FB_4,S$5,0))&IF(TYPE(VLOOKUP($A50,FB_5,S$5,0))=16,\"\",VLOOKUP($A50,FB_5,S$5,0))&IF(TYPE(VLOOKUP($A50,FB_6,S$5,0))=16,\"\",VLOOKUP($A50,FB_6,S$5,0))&IF(TYPE(VLOOKUP($A50,FB_7,S$5,0))=16,\"\",VLOOKUP($A50,FB_7,S$5,0))&IF(TYPE(VLOOKUP($A50,FB_8,S$5,0))=16,\"\",VLOOKUP($A50,FB_8,S$5,0))&IF(TYPE(VLOOKUP($A50,FB_9,S$5,0))=16,\"\",VLOOKUP($A50,FB_9,S$5,0))&IF(TYPE(VLOOKUP($A50,FB_10,S$5,0))=16,\"\",VLOOKUP($A50,FB_10,S$5,0))&IF(TYPE(VLOOKUP($A50,FB_11,S$5,0))=16,\"\",VLOOKUP($A50,FB_11,S$5,0))&IF(TYPE(VLOOKUP($A50,FB_12,S$5,0))=16,\"\",VLOOKUP($A50,FB_12,S$5,0))&IF(TYPE(VLOOKUP($A50,FB_13,S$5,0))=16,\"\",VLOOKUP($A50,FB_13,S$5,0))&IF(TYPE(VLOOKUP($A50,FB_14,S$5,0))=16,\"\",VLOOKUP($A50,FB_14,S$5,0))&IF(TYPE(VLOOKUP($A50,FB_15,S$5,0))=16,\"\",VLOOKUP($A50,FB_15,S$5,0))&IF(TYPE(VLOOKUP($A50,FB_16,S$5,0))=16,\"\",VLOOKUP($A50,FB_16,S$5,0))&IF(TYPE(VLOOKUP($A50,FB_17,S$5,0))=16,\"\",VLOOKUP($A50,FB_17,S$5,0))&IF(TYPE(VLOOKUP($A50,FB_18,S$5,0))=16,\"\",VLOOKUP($A50,FB_18,S$5,0))&IF(TYPE(VLOOKUP($A50,FB_19,S$5,0))=16,\"\",VLOOKUP($A50,FB_19,S$5,0))&IF(TYPE(VLOOKUP($A50,FB_20,S$5,0))=16,\"\",VLOOKUP($A50,FB_20,S$5,0))&IF(TYPE(VLOOKUP($A50,FB_21,S$5,0))=16,\"\",VLOOKUP($A50,FB_21,S$5,0))&IF(TYPE(VLOOKUP($A50,FB_22,S$5,0))=16,\"\",VLOOKUP($A50,FB_22,S$5,0))&IF(TYPE(VLOOKUP($A50,FB_23,S$5,0))=16,\"\",VLOOKUP($A50,FB_23,S$5,0))&IF(TYPE(VLOOKUP($A50,FB_24,S$5,0))=16,\"\",VLOOKUP($A50,FB_24,S$5,0))&IF(TYPE(VLOOKUP($A50,FB_25,S$5,0))=16,\"\",VLOOKUP($A50,FB_25,S$5,0))&IF(TYPE(VLOOKUP($A50,FB_26,S$5,0))=16,\"\",VLOOKUP($A50,FB_26,S$5,0))&IF(TYPE(VLOOKUP($A50,FB_27,S$5,0))=16,\"\",VLOOKUP($A50,FB_27,S$5,0))&IF(TYPE(VLOOKUP($A50,FB_28,S$5,0))=16,\"\",VLOOKUP($A50,FB_28,S$5,0))&IF(TYPE(VLOOKUP($A50,FB_29,S$5,0))=16,\"\",VLOOKUP($A50,FB_29,S$5,0))&IF(TYPE(VLOOKUP($A50,FB_30,S$5,0))=16,\"\",VLOOKUP($A50,FB_30,S$5,0)))","v":""},null,null,null,null,null,null,null,null,null,null,null,null,null,null,null,null,"",":","","",""]
["22.",{"$f":"IF(TYPE(VLOOKUP($A51,FB_1,2,0))=16,\"\",VLOOKUP($A51,FB_1,2,0))&IF(TYPE(VLOOKUP($A51,FB_2,2,0))=16,\"\",VLOOKUP($A51,FB_2,2,0))&IF(TYPE(VLOOKUP($A51,FB_3,2,0))=16,\"\",VLOOKUP($A51,FB_3,2,0))&IF(TYPE(VLOOKUP($A51,FB_4,2,0))=16,\"\",VLOOKUP($A51,FB_4,2,0))&IF(TYPE(VLOOKUP($A51,FB_5,2,0))=16,\"\",VLOOKUP($A51,FB_5,2,0))&IF(TYPE(VLOOKUP($A51,FB_6,2,0))=16,\"\",VLOOKUP($A51,FB_6,2,0))&IF(TYPE(VLOOKUP($A51,FB_7,2,0))=16,\"\",VLOOKUP($A51,FB_7,2,0))&IF(TYPE(VLOOKUP($A51,FB_8,2,0))=16,\"\",VLOOKUP($A51,FB_8,2,0))&IF(TYPE(VLOOKUP($A51,FB_9,2,0))=16,\"\",VLOOKUP($A51,FB_9,2,0))&IF(TYPE(VLOOKUP($A51,FB_10,2,0))=16,\"\",VLOOKUP($A51,FB_10,2,0))&IF(TYPE(VLOOKUP($A51,FB_11,2,0))=16,\"\",VLOOKUP($A51,FB_11,2,0))&IF(TYPE(VLOOKUP($A51,FB_12,2,0))=16,\"\",VLOOKUP($A51,FB_12,2,0))&IF(TYPE(VLOOKUP($A51,FB_13,2,0))=16,\"\",VLOOKUP($A51,FB_13,2,0))&IF(TYPE(VLOOKUP($A51,FB_14,2,0))=16,\"\",VLOOKUP($A51,FB_14,2,0))&IF(TYPE(VLOOKUP($A51,FB_15,2,0))=16,\"\",VLOOKUP($A51,FB_15,2,0))&IF(TYPE(VLOOKUP($A51,FB_16,2,0))=16,\"\",VLOOKUP($A51,FB_16,2,0))&IF(TYPE(VLOOKUP($A51,FB_17,2,0))=16,\"\",VLOOKUP($A51,FB_17,2,0))&IF(TYPE(VLOOKUP($A51,FB_18,2,0))=16,\"\",VLOOKUP($A51,FB_18,2,0))&IF(TYPE(VLOOKUP($A51,FB_19,2,0))=16,\"\",VLOOKUP($A51,FB_19,2,0))&IF(TYPE(VLOOKUP($A51,FB_20,2,0))=16,\"\",VLOOKUP($A51,FB_20,2,0))&IF(TYPE(VLOOKUP($A51,FB_21,2,0))=16,\"\",VLOOKUP($A51,FB_21,2,0))&IF(TYPE(VLOOKUP($A51,FB_22,2,0))=16,\"\",VLOOKUP($A51,FB_22,2,0))&IF(TYPE(VLOOKUP($A51,FB_23,2,0))=16,\"\",VLOOKUP($A51,FB_23,2,0))&IF(TYPE(VLOOKUP($A51,FB_24,2,0))=16,\"\",VLOOKUP($A51,FB_24,2,0))&IF(TYPE(VLOOKUP($A51,FB_25,2,0))=16,\"\",VLOOKUP($A51,FB_25,2,0))&IF(TYPE(VLOOKUP($A51,FB_26,2,0))=16,\"\",VLOOKUP($A51,FB_26,2,0))&IF(TYPE(VLOOKUP($A51,FB_27,2,0))=16,\"\",VLOOKUP($A51,FB_27,2,0))&IF(TYPE(VLOOKUP($A51,FB_28,2,0))=16,\"\",VLOOKUP($A51,FB_28,2,0))&IF(TYPE(VLOOKUP($A51,FB_29,2,0))=16,\"\",VLOOKUP($A51,FB_29,2,0))&IF(TYPE(VLOOKUP($A51,FB_30,2,0))=16,\"\",VLOOKUP($A51,FB_30,2,0))","v":""},null,{"$f":"IF($B51=\"\",\"\",_xlfn.NUMBERVALUE(IF(TYPE(VLOOKUP($A51,FB_1,P$5,0))=16,\"\",VLOOKUP($A51,FB_1,P$5,0))&IF(TYPE(VLOOKUP($A51,FB_2,P$5,0))=16,\"\",VLOOKUP($A51,FB_2,P$5,0))&IF(TYPE(VLOOKUP($A51,FB_3,P$5,0))=16,\"\",VLOOKUP($A51,FB_3,P$5,0))&IF(TYPE(VLOOKUP($A51,FB_4,P$5,0))=16,\"\",VLOOKUP($A51,FB_4,P$5,0))&IF(TYPE(VLOOKUP($A51,FB_5,P$5,0))=16,\"\",VLOOKUP($A51,FB_5,P$5,0))&IF(TYPE(VLOOKUP($A51,FB_6,P$5,0))=16,\"\",VLOOKUP($A51,FB_6,P$5,0))&IF(TYPE(VLOOKUP($A51,FB_7,P$5,0))=16,\"\",VLOOKUP($A51,FB_7,P$5,0))&IF(TYPE(VLOOKUP($A51,FB_8,P$5,0))=16,\"\",VLOOKUP($A51,FB_8,P$5,0))&IF(TYPE(VLOOKUP($A51,FB_9,P$5,0))=16,\"\",VLOOKUP($A51,FB_9,P$5,0))&IF(TYPE(VLOOKUP($A51,FB_10,P$5,0))=16,\"\",VLOOKUP($A51,FB_10,P$5,0))&IF(TYPE(VLOOKUP($A51,FB_11,P$5,0))=16,\"\",VLOOKUP($A51,FB_11,P$5,0))&IF(TYPE(VLOOKUP($A51,FB_12,P$5,0))=16,\"\",VLOOKUP($A51,FB_12,P$5,0))&IF(TYPE(VLOOKUP($A51,FB_13,P$5,0))=16,\"\",VLOOKUP($A51,FB_13,P$5,0))&IF(TYPE(VLOOKUP($A51,FB_14,P$5,0))=16,\"\",VLOOKUP($A51,FB_14,P$5,0))&IF(TYPE(VLOOKUP($A51,FB_15,P$5,0))=16,\"\",VLOOKUP($A51,FB_15,P$5,0))&IF(TYPE(VLOOKUP($A51,FB_16,P$5,0))=16,\"\",VLOOKUP($A51,FB_16,P$5,0))&IF(TYPE(VLOOKUP($A51,FB_17,P$5,0))=16,\"\",VLOOKUP($A51,FB_17,P$5,0))&IF(TYPE(VLOOKUP($A51,FB_18,P$5,0))=16,\"\",VLOOKUP($A51,FB_18,P$5,0))&IF(TYPE(VLOOKUP($A51,FB_19,P$5,0))=16,\"\",VLOOKUP($A51,FB_19,P$5,0))&IF(TYPE(VLOOKUP($A51,FB_20,P$5,0))=16,\"\",VLOOKUP($A51,FB_20,P$5,0))&IF(TYPE(VLOOKUP($A51,FB_21,P$5,0))=16,\"\",VLOOKUP($A51,FB_21,P$5,0))&IF(TYPE(VLOOKUP($A51,FB_22,P$5,0))=16,\"\",VLOOKUP($A51,FB_22,P$5,0))&IF(TYPE(VLOOKUP($A51,FB_23,P$5,0))=16,\"\",VLOOKUP($A51,FB_23,P$5,0))&IF(TYPE(VLOOKUP($A51,FB_24,P$5,0))=16,\"\",VLOOKUP($A51,FB_24,P$5,0))&IF(TYPE(VLOOKUP($A51,FB_25,P$5,0))=16,\"\",VLOOKUP($A51,FB_25,P$5,0))&IF(TYPE(VLOOKUP($A51,FB_26,P$5,0))=16,\"\",VLOOKUP($A51,FB_26,P$5,0))&IF(TYPE(VLOOKUP($A51,FB_27,P$5,0))=16,\"\",VLOOKUP($A51,FB_27,P$5,0))&IF(TYPE(VLOOKUP($A51,FB_28,P$5,0))=16,\"\",VLOOKUP($A51,FB_28,P$5,0))&IF(TYPE(VLOOKUP($A51,FB_29,P$5,0))=16,\"\",VLOOKUP($A51,FB_29,P$5,0))&IF(TYPE(VLOOKUP($A51,FB_30,P$5,0))=16,\"\",VLOOKUP($A51,FB_30,P$5,0))))","v":""},"",{"$f":"IF($B51=\"\",\"\",_xlfn.NUMBERVALUE(IF(TYPE(VLOOKUP($A51,FB_1,R$5,0))=16,\"\",VLOOKUP($A51,FB_1,R$5,0))&IF(TYPE(VLOOKUP($A51,FB_2,R$5,0))=16,\"\",VLOOKUP($A51,FB_2,R$5,0))&IF(TYPE(VLOOKUP($A51,FB_3,R$5,0))=16,\"\",VLOOKUP($A51,FB_3,R$5,0))&IF(TYPE(VLOOKUP($A51,FB_4,R$5,0))=16,\"\",VLOOKUP($A51,FB_4,R$5,0))&IF(TYPE(VLOOKUP($A51,FB_5,R$5,0))=16,\"\",VLOOKUP($A51,FB_5,R$5,0))&IF(TYPE(VLOOKUP($A51,FB_6,R$5,0))=16,\"\",VLOOKUP($A51,FB_6,R$5,0))&IF(TYPE(VLOOKUP($A51,FB_7,R$5,0))=16,\"\",VLOOKUP($A51,FB_7,R$5,0))&IF(TYPE(VLOOKUP($A51,FB_8,R$5,0))=16,\"\",VLOOKUP($A51,FB_8,R$5,0))&IF(TYPE(VLOOKUP($A51,FB_9,R$5,0))=16,\"\",VLOOKUP($A51,FB_9,R$5,0))&IF(TYPE(VLOOKUP($A51,FB_10,R$5,0))=16,\"\",VLOOKUP($A51,FB_10,R$5,0))&IF(TYPE(VLOOKUP($A51,FB_11,R$5,0))=16,\"\",VLOOKUP($A51,FB_11,R$5,0))&IF(TYPE(VLOOKUP($A51,FB_12,R$5,0))=16,\"\",VLOOKUP($A51,FB_12,R$5,0))&IF(TYPE(VLOOKUP($A51,FB_13,R$5,0))=16,\"\",VLOOKUP($A51,FB_13,R$5,0))&IF(TYPE(VLOOKUP($A51,FB_14,R$5,0))=16,\"\",VLOOKUP($A51,FB_14,R$5,0))&IF(TYPE(VLOOKUP($A51,FB_15,R$5,0))=16,\"\",VLOOKUP($A51,FB_15,R$5,0))&IF(TYPE(VLOOKUP($A51,FB_16,R$5,0))=16,\"\",VLOOKUP($A51,FB_16,R$5,0))&IF(TYPE(VLOOKUP($A51,FB_17,R$5,0))=16,\"\",VLOOKUP($A51,FB_17,R$5,0))&IF(TYPE(VLOOKUP($A51,FB_18,R$5,0))=16,\"\",VLOOKUP($A51,FB_18,R$5,0))&IF(TYPE(VLOOKUP($A51,FB_19,R$5,0))=16,\"\",VLOOKUP($A51,FB_19,R$5,0))&IF(TYPE(VLOOKUP($A51,FB_20,R$5,0))=16,\"\",VLOOKUP($A51,FB_20,R$5,0))&IF(TYPE(VLOOKUP($A51,FB_21,R$5,0))=16,\"\",VLOOKUP($A51,FB_21,R$5,0))&IF(TYPE(VLOOKUP($A51,FB_22,R$5,0))=16,\"\",VLOOKUP($A51,FB_22,R$5,0))&IF(TYPE(VLOOKUP($A51,FB_23,R$5,0))=16,\"\",VLOOKUP($A51,FB_23,R$5,0))&IF(TYPE(VLOOKUP($A51,FB_24,R$5,0))=16,\"\",VLOOKUP($A51,FB_24,R$5,0))&IF(TYPE(VLOOKUP($A51,FB_25,R$5,0))=16,\"\",VLOOKUP($A51,FB_25,R$5,0))&IF(TYPE(VLOOKUP($A51,FB_26,R$5,0))=16,\"\",VLOOKUP($A51,FB_26,R$5,0))&IF(TYPE(VLOOKUP($A51,FB_27,R$5,0))=16,\"\",VLOOKUP($A51,FB_27,R$5,0))&IF(TYPE(VLOOKUP($A51,FB_28,R$5,0))=16,\"\",VLOOKUP($A51,FB_28,R$5,0))&IF(TYPE(VLOOKUP($A51,FB_29,R$5,0))=16,\"\",VLOOKUP($A51,FB_29,R$5,0))&IF(TYPE(VLOOKUP($A51,FB_30,R$5,0))=16,\"\",VLOOKUP($A51,FB_30,R$5,0))))","v":""},{"$f":"IF($B51=\"\",\"\",IF(TYPE(VLOOKUP($A51,FB_1,S$5,0))=16,\"\",VLOOKUP($A51,FB_1,S$5,0))&IF(TYPE(VLOOKUP($A51,FB_2,S$5,0))=16,\"\",VLOOKUP($A51,FB_2,S$5,0))&IF(TYPE(VLOOKUP($A51,FB_3,S$5,0))=16,\"\",VLOOKUP($A51,FB_3,S$5,0))&IF(TYPE(VLOOKUP($A51,FB_4,S$5,0))=16,\"\",VLOOKUP($A51,FB_4,S$5,0))&IF(TYPE(VLOOKUP($A51,FB_5,S$5,0))=16,\"\",VLOOKUP($A51,FB_5,S$5,0))&IF(TYPE(VLOOKUP($A51,FB_6,S$5,0))=16,\"\",VLOOKUP($A51,FB_6,S$5,0))&IF(TYPE(VLOOKUP($A51,FB_7,S$5,0))=16,\"\",VLOOKUP($A51,FB_7,S$5,0))&IF(TYPE(VLOOKUP($A51,FB_8,S$5,0))=16,\"\",VLOOKUP($A51,FB_8,S$5,0))&IF(TYPE(VLOOKUP($A51,FB_9,S$5,0))=16,\"\",VLOOKUP($A51,FB_9,S$5,0))&IF(TYPE(VLOOKUP($A51,FB_10,S$5,0))=16,\"\",VLOOKUP($A51,FB_10,S$5,0))&IF(TYPE(VLOOKUP($A51,FB_11,S$5,0))=16,\"\",VLOOKUP($A51,FB_11,S$5,0))&IF(TYPE(VLOOKUP($A51,FB_12,S$5,0))=16,\"\",VLOOKUP($A51,FB_12,S$5,0))&IF(TYPE(VLOOKUP($A51,FB_13,S$5,0))=16,\"\",VLOOKUP($A51,FB_13,S$5,0))&IF(TYPE(VLOOKUP($A51,FB_14,S$5,0))=16,\"\",VLOOKUP($A51,FB_14,S$5,0))&IF(TYPE(VLOOKUP($A51,FB_15,S$5,0))=16,\"\",VLOOKUP($A51,FB_15,S$5,0))&IF(TYPE(VLOOKUP($A51,FB_16,S$5,0))=16,\"\",VLOOKUP($A51,FB_16,S$5,0))&IF(TYPE(VLOOKUP($A51,FB_17,S$5,0))=16,\"\",VLOOKUP($A51,FB_17,S$5,0))&IF(TYPE(VLOOKUP($A51,FB_18,S$5,0))=16,\"\",VLOOKUP($A51,FB_18,S$5,0))&IF(TYPE(VLOOKUP($A51,FB_19,S$5,0))=16,\"\",VLOOKUP($A51,FB_19,S$5,0))&IF(TYPE(VLOOKUP($A51,FB_20,S$5,0))=16,\"\",VLOOKUP($A51,FB_20,S$5,0))&IF(TYPE(VLOOKUP($A51,FB_21,S$5,0))=16,\"\",VLOOKUP($A51,FB_21,S$5,0))&IF(TYPE(VLOOKUP($A51,FB_22,S$5,0))=16,\"\",VLOOKUP($A51,FB_22,S$5,0))&IF(TYPE(VLOOKUP($A51,FB_23,S$5,0))=16,\"\",VLOOKUP($A51,FB_23,S$5,0))&IF(TYPE(VLOOKUP($A51,FB_24,S$5,0))=16,\"\",VLOOKUP($A51,FB_24,S$5,0))&IF(TYPE(VLOOKUP($A51,FB_25,S$5,0))=16,\"\",VLOOKUP($A51,FB_25,S$5,0))&IF(TYPE(VLOOKUP($A51,FB_26,S$5,0))=16,\"\",VLOOKUP($A51,FB_26,S$5,0))&IF(TYPE(VLOOKUP($A51,FB_27,S$5,0))=16,\"\",VLOOKUP($A51,FB_27,S$5,0))&IF(TYPE(VLOOKUP($A51,FB_28,S$5,0))=16,\"\",VLOOKUP($A51,FB_28,S$5,0))&IF(TYPE(VLOOKUP($A51,FB_29,S$5,0))=16,\"\",VLOOKUP($A51,FB_29,S$5,0))&IF(TYPE(VLOOKUP($A51,FB_30,S$5,0))=16,\"\",VLOOKUP($A51,FB_30,S$5,0)))","v":""},null,null,null,null,null,null,null,null,null,null,null,null,null,null,null,null,"",":","","",""]
["23.",{"$f":"IF(TYPE(VLOOKUP($A52,FB_1,2,0))=16,\"\",VLOOKUP($A52,FB_1,2,0))&IF(TYPE(VLOOKUP($A52,FB_2,2,0))=16,\"\",VLOOKUP($A52,FB_2,2,0))&IF(TYPE(VLOOKUP($A52,FB_3,2,0))=16,\"\",VLOOKUP($A52,FB_3,2,0))&IF(TYPE(VLOOKUP($A52,FB_4,2,0))=16,\"\",VLOOKUP($A52,FB_4,2,0))&IF(TYPE(VLOOKUP($A52,FB_5,2,0))=16,\"\",VLOOKUP($A52,FB_5,2,0))&IF(TYPE(VLOOKUP($A52,FB_6,2,0))=16,\"\",VLOOKUP($A52,FB_6,2,0))&IF(TYPE(VLOOKUP($A52,FB_7,2,0))=16,\"\",VLOOKUP($A52,FB_7,2,0))&IF(TYPE(VLOOKUP($A52,FB_8,2,0))=16,\"\",VLOOKUP($A52,FB_8,2,0))&IF(TYPE(VLOOKUP($A52,FB_9,2,0))=16,\"\",VLOOKUP($A52,FB_9,2,0))&IF(TYPE(VLOOKUP($A52,FB_10,2,0))=16,\"\",VLOOKUP($A52,FB_10,2,0))&IF(TYPE(VLOOKUP($A52,FB_11,2,0))=16,\"\",VLOOKUP($A52,FB_11,2,0))&IF(TYPE(VLOOKUP($A52,FB_12,2,0))=16,\"\",VLOOKUP($A52,FB_12,2,0))&IF(TYPE(VLOOKUP($A52,FB_13,2,0))=16,\"\",VLOOKUP($A52,FB_13,2,0))&IF(TYPE(VLOOKUP($A52,FB_14,2,0))=16,\"\",VLOOKUP($A52,FB_14,2,0))&IF(TYPE(VLOOKUP($A52,FB_15,2,0))=16,\"\",VLOOKUP($A52,FB_15,2,0))&IF(TYPE(VLOOKUP($A52,FB_16,2,0))=16,\"\",VLOOKUP($A52,FB_16,2,0))&IF(TYPE(VLOOKUP($A52,FB_17,2,0))=16,\"\",VLOOKUP($A52,FB_17,2,0))&IF(TYPE(VLOOKUP($A52,FB_18,2,0))=16,\"\",VLOOKUP($A52,FB_18,2,0))&IF(TYPE(VLOOKUP($A52,FB_19,2,0))=16,\"\",VLOOKUP($A52,FB_19,2,0))&IF(TYPE(VLOOKUP($A52,FB_20,2,0))=16,\"\",VLOOKUP($A52,FB_20,2,0))&IF(TYPE(VLOOKUP($A52,FB_21,2,0))=16,\"\",VLOOKUP($A52,FB_21,2,0))&IF(TYPE(VLOOKUP($A52,FB_22,2,0))=16,\"\",VLOOKUP($A52,FB_22,2,0))&IF(TYPE(VLOOKUP($A52,FB_23,2,0))=16,\"\",VLOOKUP($A52,FB_23,2,0))&IF(TYPE(VLOOKUP($A52,FB_24,2,0))=16,\"\",VLOOKUP($A52,FB_24,2,0))&IF(TYPE(VLOOKUP($A52,FB_25,2,0))=16,\"\",VLOOKUP($A52,FB_25,2,0))&IF(TYPE(VLOOKUP($A52,FB_26,2,0))=16,\"\",VLOOKUP($A52,FB_26,2,0))&IF(TYPE(VLOOKUP($A52,FB_27,2,0))=16,\"\",VLOOKUP($A52,FB_27,2,0))&IF(TYPE(VLOOKUP($A52,FB_28,2,0))=16,\"\",VLOOKUP($A52,FB_28,2,0))&IF(TYPE(VLOOKUP($A52,FB_29,2,0))=16,\"\",VLOOKUP($A52,FB_29,2,0))&IF(TYPE(VLOOKUP($A52,FB_30,2,0))=16,\"\",VLOOKUP($A52,FB_30,2,0))","v":""},null,{"$f":"IF($B52=\"\",\"\",_xlfn.NUMBERVALUE(IF(TYPE(VLOOKUP($A52,FB_1,P$5,0))=16,\"\",VLOOKUP($A52,FB_1,P$5,0))&IF(TYPE(VLOOKUP($A52,FB_2,P$5,0))=16,\"\",VLOOKUP($A52,FB_2,P$5,0))&IF(TYPE(VLOOKUP($A52,FB_3,P$5,0))=16,\"\",VLOOKUP($A52,FB_3,P$5,0))&IF(TYPE(VLOOKUP($A52,FB_4,P$5,0))=16,\"\",VLOOKUP($A52,FB_4,P$5,0))&IF(TYPE(VLOOKUP($A52,FB_5,P$5,0))=16,\"\",VLOOKUP($A52,FB_5,P$5,0))&IF(TYPE(VLOOKUP($A52,FB_6,P$5,0))=16,\"\",VLOOKUP($A52,FB_6,P$5,0))&IF(TYPE(VLOOKUP($A52,FB_7,P$5,0))=16,\"\",VLOOKUP($A52,FB_7,P$5,0))&IF(TYPE(VLOOKUP($A52,FB_8,P$5,0))=16,\"\",VLOOKUP($A52,FB_8,P$5,0))&IF(TYPE(VLOOKUP($A52,FB_9,P$5,0))=16,\"\",VLOOKUP($A52,FB_9,P$5,0))&IF(TYPE(VLOOKUP($A52,FB_10,P$5,0))=16,\"\",VLOOKUP($A52,FB_10,P$5,0))&IF(TYPE(VLOOKUP($A52,FB_11,P$5,0))=16,\"\",VLOOKUP($A52,FB_11,P$5,0))&IF(TYPE(VLOOKUP($A52,FB_12,P$5,0))=16,\"\",VLOOKUP($A52,FB_12,P$5,0))&IF(TYPE(VLOOKUP($A52,FB_13,P$5,0))=16,\"\",VLOOKUP($A52,FB_13,P$5,0))&IF(TYPE(VLOOKUP($A52,FB_14,P$5,0))=16,\"\",VLOOKUP($A52,FB_14,P$5,0))&IF(TYPE(VLOOKUP($A52,FB_15,P$5,0))=16,\"\",VLOOKUP($A52,FB_15,P$5,0))&IF(TYPE(VLOOKUP($A52,FB_16,P$5,0))=16,\"\",VLOOKUP($A52,FB_16,P$5,0))&IF(TYPE(VLOOKUP($A52,FB_17,P$5,0))=16,\"\",VLOOKUP($A52,FB_17,P$5,0))&IF(TYPE(VLOOKUP($A52,FB_18,P$5,0))=16,\"\",VLOOKUP($A52,FB_18,P$5,0))&IF(TYPE(VLOOKUP($A52,FB_19,P$5,0))=16,\"\",VLOOKUP($A52,FB_19,P$5,0))&IF(TYPE(VLOOKUP($A52,FB_20,P$5,0))=16,\"\",VLOOKUP($A52,FB_20,P$5,0))&IF(TYPE(VLOOKUP($A52,FB_21,P$5,0))=16,\"\",VLOOKUP($A52,FB_21,P$5,0))&IF(TYPE(VLOOKUP($A52,FB_22,P$5,0))=16,\"\",VLOOKUP($A52,FB_22,P$5,0))&IF(TYPE(VLOOKUP($A52,FB_23,P$5,0))=16,\"\",VLOOKUP($A52,FB_23,P$5,0))&IF(TYPE(VLOOKUP($A52,FB_24,P$5,0))=16,\"\",VLOOKUP($A52,FB_24,P$5,0))&IF(TYPE(VLOOKUP($A52,FB_25,P$5,0))=16,\"\",VLOOKUP($A52,FB_25,P$5,0))&IF(TYPE(VLOOKUP($A52,FB_26,P$5,0))=16,\"\",VLOOKUP($A52,FB_26,P$5,0))&IF(TYPE(VLOOKUP($A52,FB_27,P$5,0))=16,\"\",VLOOKUP($A52,FB_27,P$5,0))&IF(TYPE(VLOOKUP($A52,FB_28,P$5,0))=16,\"\",VLOOKUP($A52,FB_28,P$5,0))&IF(TYPE(VLOOKUP($A52,FB_29,P$5,0))=16,\"\",VLOOKUP($A52,FB_29,P$5,0))&IF(TYPE(VLOOKUP($A52,FB_30,P$5,0))=16,\"\",VLOOKUP($A52,FB_30,P$5,0))))","v":""},"",{"$f":"IF($B52=\"\",\"\",_xlfn.NUMBERVALUE(IF(TYPE(VLOOKUP($A52,FB_1,R$5,0))=16,\"\",VLOOKUP($A52,FB_1,R$5,0))&IF(TYPE(VLOOKUP($A52,FB_2,R$5,0))=16,\"\",VLOOKUP($A52,FB_2,R$5,0))&IF(TYPE(VLOOKUP($A52,FB_3,R$5,0))=16,\"\",VLOOKUP($A52,FB_3,R$5,0))&IF(TYPE(VLOOKUP($A52,FB_4,R$5,0))=16,\"\",VLOOKUP($A52,FB_4,R$5,0))&IF(TYPE(VLOOKUP($A52,FB_5,R$5,0))=16,\"\",VLOOKUP($A52,FB_5,R$5,0))&IF(TYPE(VLOOKUP($A52,FB_6,R$5,0))=16,\"\",VLOOKUP($A52,FB_6,R$5,0))&IF(TYPE(VLOOKUP($A52,FB_7,R$5,0))=16,\"\",VLOOKUP($A52,FB_7,R$5,0))&IF(TYPE(VLOOKUP($A52,FB_8,R$5,0))=16,\"\",VLOOKUP($A52,FB_8,R$5,0))&IF(TYPE(VLOOKUP($A52,FB_9,R$5,0))=16,\"\",VLOOKUP($A52,FB_9,R$5,0))&IF(TYPE(VLOOKUP($A52,FB_10,R$5,0))=16,\"\",VLOOKUP($A52,FB_10,R$5,0))&IF(TYPE(VLOOKUP($A52,FB_11,R$5,0))=16,\"\",VLOOKUP($A52,FB_11,R$5,0))&IF(TYPE(VLOOKUP($A52,FB_12,R$5,0))=16,\"\",VLOOKUP($A52,FB_12,R$5,0))&IF(TYPE(VLOOKUP($A52,FB_13,R$5,0))=16,\"\",VLOOKUP($A52,FB_13,R$5,0))&IF(TYPE(VLOOKUP($A52,FB_14,R$5,0))=16,\"\",VLOOKUP($A52,FB_14,R$5,0))&IF(TYPE(VLOOKUP($A52,FB_15,R$5,0))=16,\"\",VLOOKUP($A52,FB_15,R$5,0))&IF(TYPE(VLOOKUP($A52,FB_16,R$5,0))=16,\"\",VLOOKUP($A52,FB_16,R$5,0))&IF(TYPE(VLOOKUP($A52,FB_17,R$5,0))=16,\"\",VLOOKUP($A52,FB_17,R$5,0))&IF(TYPE(VLOOKUP($A52,FB_18,R$5,0))=16,\"\",VLOOKUP($A52,FB_18,R$5,0))&IF(TYPE(VLOOKUP($A52,FB_19,R$5,0))=16,\"\",VLOOKUP($A52,FB_19,R$5,0))&IF(TYPE(VLOOKUP($A52,FB_20,R$5,0))=16,\"\",VLOOKUP($A52,FB_20,R$5,0))&IF(TYPE(VLOOKUP($A52,FB_21,R$5,0))=16,\"\",VLOOKUP($A52,FB_21,R$5,0))&IF(TYPE(VLOOKUP($A52,FB_22,R$5,0))=16,\"\",VLOOKUP($A52,FB_22,R$5,0))&IF(TYPE(VLOOKUP($A52,FB_23,R$5,0))=16,\"\",VLOOKUP($A52,FB_23,R$5,0))&IF(TYPE(VLOOKUP($A52,FB_24,R$5,0))=16,\"\",VLOOKUP($A52,FB_24,R$5,0))&IF(TYPE(VLOOKUP($A52,FB_25,R$5,0))=16,\"\",VLOOKUP($A52,FB_25,R$5,0))&IF(TYPE(VLOOKUP($A52,FB_26,R$5,0))=16,\"\",VLOOKUP($A52,FB_26,R$5,0))&IF(TYPE(VLOOKUP($A52,FB_27,R$5,0))=16,\"\",VLOOKUP($A52,FB_27,R$5,0))&IF(TYPE(VLOOKUP($A52,FB_28,R$5,0))=16,\"\",VLOOKUP($A52,FB_28,R$5,0))&IF(TYPE(VLOOKUP($A52,FB_29,R$5,0))=16,\"\",VLOOKUP($A52,FB_29,R$5,0))&IF(TYPE(VLOOKUP($A52,FB_30,R$5,0))=16,\"\",VLOOKUP($A52,FB_30,R$5,0))))","v":""},{"$f":"IF($B52=\"\",\"\",IF(TYPE(VLOOKUP($A52,FB_1,S$5,0))=16,\"\",VLOOKUP($A52,FB_1,S$5,0))&IF(TYPE(VLOOKUP($A52,FB_2,S$5,0))=16,\"\",VLOOKUP($A52,FB_2,S$5,0))&IF(TYPE(VLOOKUP($A52,FB_3,S$5,0))=16,\"\",VLOOKUP($A52,FB_3,S$5,0))&IF(TYPE(VLOOKUP($A52,FB_4,S$5,0))=16,\"\",VLOOKUP($A52,FB_4,S$5,0))&IF(TYPE(VLOOKUP($A52,FB_5,S$5,0))=16,\"\",VLOOKUP($A52,FB_5,S$5,0))&IF(TYPE(VLOOKUP($A52,FB_6,S$5,0))=16,\"\",VLOOKUP($A52,FB_6,S$5,0))&IF(TYPE(VLOOKUP($A52,FB_7,S$5,0))=16,\"\",VLOOKUP($A52,FB_7,S$5,0))&IF(TYPE(VLOOKUP($A52,FB_8,S$5,0))=16,\"\",VLOOKUP($A52,FB_8,S$5,0))&IF(TYPE(VLOOKUP($A52,FB_9,S$5,0))=16,\"\",VLOOKUP($A52,FB_9,S$5,0))&IF(TYPE(VLOOKUP($A52,FB_10,S$5,0))=16,\"\",VLOOKUP($A52,FB_10,S$5,0))&IF(TYPE(VLOOKUP($A52,FB_11,S$5,0))=16,\"\",VLOOKUP($A52,FB_11,S$5,0))&IF(TYPE(VLOOKUP($A52,FB_12,S$5,0))=16,\"\",VLOOKUP($A52,FB_12,S$5,0))&IF(TYPE(VLOOKUP($A52,FB_13,S$5,0))=16,\"\",VLOOKUP($A52,FB_13,S$5,0))&IF(TYPE(VLOOKUP($A52,FB_14,S$5,0))=16,\"\",VLOOKUP($A52,FB_14,S$5,0))&IF(TYPE(VLOOKUP($A52,FB_15,S$5,0))=16,\"\",VLOOKUP($A52,FB_15,S$5,0))&IF(TYPE(VLOOKUP($A52,FB_16,S$5,0))=16,\"\",VLOOKUP($A52,FB_16,S$5,0))&IF(TYPE(VLOOKUP($A52,FB_17,S$5,0))=16,\"\",VLOOKUP($A52,FB_17,S$5,0))&IF(TYPE(VLOOKUP($A52,FB_18,S$5,0))=16,\"\",VLOOKUP($A52,FB_18,S$5,0))&IF(TYPE(VLOOKUP($A52,FB_19,S$5,0))=16,\"\",VLOOKUP($A52,FB_19,S$5,0))&IF(TYPE(VLOOKUP($A52,FB_20,S$5,0))=16,\"\",VLOOKUP($A52,FB_20,S$5,0))&IF(TYPE(VLOOKUP($A52,FB_21,S$5,0))=16,\"\",VLOOKUP($A52,FB_21,S$5,0))&IF(TYPE(VLOOKUP($A52,FB_22,S$5,0))=16,\"\",VLOOKUP($A52,FB_22,S$5,0))&IF(TYPE(VLOOKUP($A52,FB_23,S$5,0))=16,\"\",VLOOKUP($A52,FB_23,S$5,0))&IF(TYPE(VLOOKUP($A52,FB_24,S$5,0))=16,\"\",VLOOKUP($A52,FB_24,S$5,0))&IF(TYPE(VLOOKUP($A52,FB_25,S$5,0))=16,\"\",VLOOKUP($A52,FB_25,S$5,0))&IF(TYPE(VLOOKUP($A52,FB_26,S$5,0))=16,\"\",VLOOKUP($A52,FB_26,S$5,0))&IF(TYPE(VLOOKUP($A52,FB_27,S$5,0))=16,\"\",VLOOKUP($A52,FB_27,S$5,0))&IF(TYPE(VLOOKUP($A52,FB_28,S$5,0))=16,\"\",VLOOKUP($A52,FB_28,S$5,0))&IF(TYPE(VLOOKUP($A52,FB_29,S$5,0))=16,\"\",VLOOKUP($A52,FB_29,S$5,0))&IF(TYPE(VLOOKUP($A52,FB_30,S$5,0))=16,\"\",VLOOKUP($A52,FB_30,S$5,0)))","v":""},null,null,null,null,null,null,null,null,null,null,null,null,null,null,null,null,"",":","","",""]
["24.",{"$f":"IF(TYPE(VLOOKUP($A53,FB_1,2,0))=16,\"\",VLOOKUP($A53,FB_1,2,0))&IF(TYPE(VLOOKUP($A53,FB_2,2,0))=16,\"\",VLOOKUP($A53,FB_2,2,0))&IF(TYPE(VLOOKUP($A53,FB_3,2,0))=16,\"\",VLOOKUP($A53,FB_3,2,0))&IF(TYPE(VLOOKUP($A53,FB_4,2,0))=16,\"\",VLOOKUP($A53,FB_4,2,0))&IF(TYPE(VLOOKUP($A53,FB_5,2,0))=16,\"\",VLOOKUP($A53,FB_5,2,0))&IF(TYPE(VLOOKUP($A53,FB_6,2,0))=16,\"\",VLOOKUP($A53,FB_6,2,0))&IF(TYPE(VLOOKUP($A53,FB_7,2,0))=16,\"\",VLOOKUP($A53,FB_7,2,0))&IF(TYPE(VLOOKUP($A53,FB_8,2,0))=16,\"\",VLOOKUP($A53,FB_8,2,0))&IF(TYPE(VLOOKUP($A53,FB_9,2,0))=16,\"\",VLOOKUP($A53,FB_9,2,0))&IF(TYPE(VLOOKUP($A53,FB_10,2,0))=16,\"\",VLOOKUP($A53,FB_10,2,0))&IF(TYPE(VLOOKUP($A53,FB_11,2,0))=16,\"\",VLOOKUP($A53,FB_11,2,0))&IF(TYPE(VLOOKUP($A53,FB_12,2,0))=16,\"\",VLOOKUP($A53,FB_12,2,0))&IF(TYPE(VLOOKUP($A53,FB_13,2,0))=16,\"\",VLOOKUP($A53,FB_13,2,0))&IF(TYPE(VLOOKUP($A53,FB_14,2,0))=16,\"\",VLOOKUP($A53,FB_14,2,0))&IF(TYPE(VLOOKUP($A53,FB_15,2,0))=16,\"\",VLOOKUP($A53,FB_15,2,0))&IF(TYPE(VLOOKUP($A53,FB_16,2,0))=16,\"\",VLOOKUP($A53,FB_16,2,0))&IF(TYPE(VLOOKUP($A53,FB_17,2,0))=16,\"\",VLOOKUP($A53,FB_17,2,0))&IF(TYPE(VLOOKUP($A53,FB_18,2,0))=16,\"\",VLOOKUP($A53,FB_18,2,0))&IF(TYPE(VLOOKUP($A53,FB_19,2,0))=16,\"\",VLOOKUP($A53,FB_19,2,0))&IF(TYPE(VLOOKUP($A53,FB_20,2,0))=16,\"\",VLOOKUP($A53,FB_20,2,0))&IF(TYPE(VLOOKUP($A53,FB_21,2,0))=16,\"\",VLOOKUP($A53,FB_21,2,0))&IF(TYPE(VLOOKUP($A53,FB_22,2,0))=16,\"\",VLOOKUP($A53,FB_22,2,0))&IF(TYPE(VLOOKUP($A53,FB_23,2,0))=16,\"\",VLOOKUP($A53,FB_23,2,0))&IF(TYPE(VLOOKUP($A53,FB_24,2,0))=16,\"\",VLOOKUP($A53,FB_24,2,0))&IF(TYPE(VLOOKUP($A53,FB_25,2,0))=16,\"\",VLOOKUP($A53,FB_25,2,0))&IF(TYPE(VLOOKUP($A53,FB_26,2,0))=16,\"\",VLOOKUP($A53,FB_26,2,0))&IF(TYPE(VLOOKUP($A53,FB_27,2,0))=16,\"\",VLOOKUP($A53,FB_27,2,0))&IF(TYPE(VLOOKUP($A53,FB_28,2,0))=16,\"\",VLOOKUP($A53,FB_28,2,0))&IF(TYPE(VLOOKUP($A53,FB_29,2,0))=16,\"\",VLOOKUP($A53,FB_29,2,0))&IF(TYPE(VLOOKUP($A53,FB_30,2,0))=16,\"\",VLOOKUP($A53,FB_30,2,0))","v":""},null,{"$f":"IF($B53=\"\",\"\",_xlfn.NUMBERVALUE(IF(TYPE(VLOOKUP($A53,FB_1,P$5,0))=16,\"\",VLOOKUP($A53,FB_1,P$5,0))&IF(TYPE(VLOOKUP($A53,FB_2,P$5,0))=16,\"\",VLOOKUP($A53,FB_2,P$5,0))&IF(TYPE(VLOOKUP($A53,FB_3,P$5,0))=16,\"\",VLOOKUP($A53,FB_3,P$5,0))&IF(TYPE(VLOOKUP($A53,FB_4,P$5,0))=16,\"\",VLOOKUP($A53,FB_4,P$5,0))&IF(TYPE(VLOOKUP($A53,FB_5,P$5,0))=16,\"\",VLOOKUP($A53,FB_5,P$5,0))&IF(TYPE(VLOOKUP($A53,FB_6,P$5,0))=16,\"\",VLOOKUP($A53,FB_6,P$5,0))&IF(TYPE(VLOOKUP($A53,FB_7,P$5,0))=16,\"\",VLOOKUP($A53,FB_7,P$5,0))&IF(TYPE(VLOOKUP($A53,FB_8,P$5,0))=16,\"\",VLOOKUP($A53,FB_8,P$5,0))&IF(TYPE(VLOOKUP($A53,FB_9,P$5,0))=16,\"\",VLOOKUP($A53,FB_9,P$5,0))&IF(TYPE(VLOOKUP($A53,FB_10,P$5,0))=16,\"\",VLOOKUP($A53,FB_10,P$5,0))&IF(TYPE(VLOOKUP($A53,FB_11,P$5,0))=16,\"\",VLOOKUP($A53,FB_11,P$5,0))&IF(TYPE(VLOOKUP($A53,FB_12,P$5,0))=16,\"\",VLOOKUP($A53,FB_12,P$5,0))&IF(TYPE(VLOOKUP($A53,FB_13,P$5,0))=16,\"\",VLOOKUP($A53,FB_13,P$5,0))&IF(TYPE(VLOOKUP($A53,FB_14,P$5,0))=16,\"\",VLOOKUP($A53,FB_14,P$5,0))&IF(TYPE(VLOOKUP($A53,FB_15,P$5,0))=16,\"\",VLOOKUP($A53,FB_15,P$5,0))&IF(TYPE(VLOOKUP($A53,FB_16,P$5,0))=16,\"\",VLOOKUP($A53,FB_16,P$5,0))&IF(TYPE(VLOOKUP($A53,FB_17,P$5,0))=16,\"\",VLOOKUP($A53,FB_17,P$5,0))&IF(TYPE(VLOOKUP($A53,FB_18,P$5,0))=16,\"\",VLOOKUP($A53,FB_18,P$5,0))&IF(TYPE(VLOOKUP($A53,FB_19,P$5,0))=16,\"\",VLOOKUP($A53,FB_19,P$5,0))&IF(TYPE(VLOOKUP($A53,FB_20,P$5,0))=16,\"\",VLOOKUP($A53,FB_20,P$5,0))&IF(TYPE(VLOOKUP($A53,FB_21,P$5,0))=16,\"\",VLOOKUP($A53,FB_21,P$5,0))&IF(TYPE(VLOOKUP($A53,FB_22,P$5,0))=16,\"\",VLOOKUP($A53,FB_22,P$5,0))&IF(TYPE(VLOOKUP($A53,FB_23,P$5,0))=16,\"\",VLOOKUP($A53,FB_23,P$5,0))&IF(TYPE(VLOOKUP($A53,FB_24,P$5,0))=16,\"\",VLOOKUP($A53,FB_24,P$5,0))&IF(TYPE(VLOOKUP($A53,FB_25,P$5,0))=16,\"\",VLOOKUP($A53,FB_25,P$5,0))&IF(TYPE(VLOOKUP($A53,FB_26,P$5,0))=16,\"\",VLOOKUP($A53,FB_26,P$5,0))&IF(TYPE(VLOOKUP($A53,FB_27,P$5,0))=16,\"\",VLOOKUP($A53,FB_27,P$5,0))&IF(TYPE(VLOOKUP($A53,FB_28,P$5,0))=16,\"\",VLOOKUP($A53,FB_28,P$5,0))&IF(TYPE(VLOOKUP($A53,FB_29,P$5,0))=16,\"\",VLOOKUP($A53,FB_29,P$5,0))&IF(TYPE(VLOOKUP($A53,FB_30,P$5,0))=16,\"\",VLOOKUP($A53,FB_30,P$5,0))))","v":""},"",{"$f":"IF($B53=\"\",\"\",_xlfn.NUMBERVALUE(IF(TYPE(VLOOKUP($A53,FB_1,R$5,0))=16,\"\",VLOOKUP($A53,FB_1,R$5,0))&IF(TYPE(VLOOKUP($A53,FB_2,R$5,0))=16,\"\",VLOOKUP($A53,FB_2,R$5,0))&IF(TYPE(VLOOKUP($A53,FB_3,R$5,0))=16,\"\",VLOOKUP($A53,FB_3,R$5,0))&IF(TYPE(VLOOKUP($A53,FB_4,R$5,0))=16,\"\",VLOOKUP($A53,FB_4,R$5,0))&IF(TYPE(VLOOKUP($A53,FB_5,R$5,0))=16,\"\",VLOOKUP($A53,FB_5,R$5,0))&IF(TYPE(VLOOKUP($A53,FB_6,R$5,0))=16,\"\",VLOOKUP($A53,FB_6,R$5,0))&IF(TYPE(VLOOKUP($A53,FB_7,R$5,0))=16,\"\",VLOOKUP($A53,FB_7,R$5,0))&IF(TYPE(VLOOKUP($A53,FB_8,R$5,0))=16,\"\",VLOOKUP($A53,FB_8,R$5,0))&IF(TYPE(VLOOKUP($A53,FB_9,R$5,0))=16,\"\",VLOOKUP($A53,FB_9,R$5,0))&IF(TYPE(VLOOKUP($A53,FB_10,R$5,0))=16,\"\",VLOOKUP($A53,FB_10,R$5,0))&IF(TYPE(VLOOKUP($A53,FB_11,R$5,0))=16,\"\",VLOOKUP($A53,FB_11,R$5,0))&IF(TYPE(VLOOKUP($A53,FB_12,R$5,0))=16,\"\",VLOOKUP($A53,FB_12,R$5,0))&IF(TYPE(VLOOKUP($A53,FB_13,R$5,0))=16,\"\",VLOOKUP($A53,FB_13,R$5,0))&IF(TYPE(VLOOKUP($A53,FB_14,R$5,0))=16,\"\",VLOOKUP($A53,FB_14,R$5,0))&IF(TYPE(VLOOKUP($A53,FB_15,R$5,0))=16,\"\",VLOOKUP($A53,FB_15,R$5,0))&IF(TYPE(VLOOKUP($A53,FB_16,R$5,0))=16,\"\",VLOOKUP($A53,FB_16,R$5,0))&IF(TYPE(VLOOKUP($A53,FB_17,R$5,0))=16,\"\",VLOOKUP($A53,FB_17,R$5,0))&IF(TYPE(VLOOKUP($A53,FB_18,R$5,0))=16,\"\",VLOOKUP($A53,FB_18,R$5,0))&IF(TYPE(VLOOKUP($A53,FB_19,R$5,0))=16,\"\",VLOOKUP($A53,FB_19,R$5,0))&IF(TYPE(VLOOKUP($A53,FB_20,R$5,0))=16,\"\",VLOOKUP($A53,FB_20,R$5,0))&IF(TYPE(VLOOKUP($A53,FB_21,R$5,0))=16,\"\",VLOOKUP($A53,FB_21,R$5,0))&IF(TYPE(VLOOKUP($A53,FB_22,R$5,0))=16,\"\",VLOOKUP($A53,FB_22,R$5,0))&IF(TYPE(VLOOKUP($A53,FB_23,R$5,0))=16,\"\",VLOOKUP($A53,FB_23,R$5,0))&IF(TYPE(VLOOKUP($A53,FB_24,R$5,0))=16,\"\",VLOOKUP($A53,FB_24,R$5,0))&IF(TYPE(VLOOKUP($A53,FB_25,R$5,0))=16,\"\",VLOOKUP($A53,FB_25,R$5,0))&IF(TYPE(VLOOKUP($A53,FB_26,R$5,0))=16,\"\",VLOOKUP($A53,FB_26,R$5,0))&IF(TYPE(VLOOKUP($A53,FB_27,R$5,0))=16,\"\",VLOOKUP($A53,FB_27,R$5,0))&IF(TYPE(VLOOKUP($A53,FB_28,R$5,0))=16,\"\",VLOOKUP($A53,FB_28,R$5,0))&IF(TYPE(VLOOKUP($A53,FB_29,R$5,0))=16,\"\",VLOOKUP($A53,FB_29,R$5,0))&IF(TYPE(VLOOKUP($A53,FB_30,R$5,0))=16,\"\",VLOOKUP($A53,FB_30,R$5,0))))","v":""},{"$f":"IF($B53=\"\",\"\",IF(TYPE(VLOOKUP($A53,FB_1,S$5,0))=16,\"\",VLOOKUP($A53,FB_1,S$5,0))&IF(TYPE(VLOOKUP($A53,FB_2,S$5,0))=16,\"\",VLOOKUP($A53,FB_2,S$5,0))&IF(TYPE(VLOOKUP($A53,FB_3,S$5,0))=16,\"\",VLOOKUP($A53,FB_3,S$5,0))&IF(TYPE(VLOOKUP($A53,FB_4,S$5,0))=16,\"\",VLOOKUP($A53,FB_4,S$5,0))&IF(TYPE(VLOOKUP($A53,FB_5,S$5,0))=16,\"\",VLOOKUP($A53,FB_5,S$5,0))&IF(TYPE(VLOOKUP($A53,FB_6,S$5,0))=16,\"\",VLOOKUP($A53,FB_6,S$5,0))&IF(TYPE(VLOOKUP($A53,FB_7,S$5,0))=16,\"\",VLOOKUP($A53,FB_7,S$5,0))&IF(TYPE(VLOOKUP($A53,FB_8,S$5,0))=16,\"\",VLOOKUP($A53,FB_8,S$5,0))&IF(TYPE(VLOOKUP($A53,FB_9,S$5,0))=16,\"\",VLOOKUP($A53,FB_9,S$5,0))&IF(TYPE(VLOOKUP($A53,FB_10,S$5,0))=16,\"\",VLOOKUP($A53,FB_10,S$5,0))&IF(TYPE(VLOOKUP($A53,FB_11,S$5,0))=16,\"\",VLOOKUP($A53,FB_11,S$5,0))&IF(TYPE(VLOOKUP($A53,FB_12,S$5,0))=16,\"\",VLOOKUP($A53,FB_12,S$5,0))&IF(TYPE(VLOOKUP($A53,FB_13,S$5,0))=16,\"\",VLOOKUP($A53,FB_13,S$5,0))&IF(TYPE(VLOOKUP($A53,FB_14,S$5,0))=16,\"\",VLOOKUP($A53,FB_14,S$5,0))&IF(TYPE(VLOOKUP($A53,FB_15,S$5,0))=16,\"\",VLOOKUP($A53,FB_15,S$5,0))&IF(TYPE(VLOOKUP($A53,FB_16,S$5,0))=16,\"\",VLOOKUP($A53,FB_16,S$5,0))&IF(TYPE(VLOOKUP($A53,FB_17,S$5,0))=16,\"\",VLOOKUP($A53,FB_17,S$5,0))&IF(TYPE(VLOOKUP($A53,FB_18,S$5,0))=16,\"\",VLOOKUP($A53,FB_18,S$5,0))&IF(TYPE(VLOOKUP($A53,FB_19,S$5,0))=16,\"\",VLOOKUP($A53,FB_19,S$5,0))&IF(TYPE(VLOOKUP($A53,FB_20,S$5,0))=16,\"\",VLOOKUP($A53,FB_20,S$5,0))&IF(TYPE(VLOOKUP($A53,FB_21,S$5,0))=16,\"\",VLOOKUP($A53,FB_21,S$5,0))&IF(TYPE(VLOOKUP($A53,FB_22,S$5,0))=16,\"\",VLOOKUP($A53,FB_22,S$5,0))&IF(TYPE(VLOOKUP($A53,FB_23,S$5,0))=16,\"\",VLOOKUP($A53,FB_23,S$5,0))&IF(TYPE(VLOOKUP($A53,FB_24,S$5,0))=16,\"\",VLOOKUP($A53,FB_24,S$5,0))&IF(TYPE(VLOOKUP($A53,FB_25,S$5,0))=16,\"\",VLOOKUP($A53,FB_25,S$5,0))&IF(TYPE(VLOOKUP($A53,FB_26,S$5,0))=16,\"\",VLOOKUP($A53,FB_26,S$5,0))&IF(TYPE(VLOOKUP($A53,FB_27,S$5,0))=16,\"\",VLOOKUP($A53,FB_27,S$5,0))&IF(TYPE(VLOOKUP($A53,FB_28,S$5,0))=16,\"\",VLOOKUP($A53,FB_28,S$5,0))&IF(TYPE(VLOOKUP($A53,FB_29,S$5,0))=16,\"\",VLOOKUP($A53,FB_29,S$5,0))&IF(TYPE(VLOOKUP($A53,FB_30,S$5,0))=16,\"\",VLOOKUP($A53,FB_30,S$5,0)))","v":""},null,null,null,null,null,null,null,null,null,null,null,null,null,null,null,null,"",":","","",""]
["25.",{"$f":"IF(TYPE(VLOOKUP($A54,FB_1,2,0))=16,\"\",VLOOKUP($A54,FB_1,2,0))&IF(TYPE(VLOOKUP($A54,FB_2,2,0))=16,\"\",VLOOKUP($A54,FB_2,2,0))&IF(TYPE(VLOOKUP($A54,FB_3,2,0))=16,\"\",VLOOKUP($A54,FB_3,2,0))&IF(TYPE(VLOOKUP($A54,FB_4,2,0))=16,\"\",VLOOKUP($A54,FB_4,2,0))&IF(TYPE(VLOOKUP($A54,FB_5,2,0))=16,\"\",VLOOKUP($A54,FB_5,2,0))&IF(TYPE(VLOOKUP($A54,FB_6,2,0))=16,\"\",VLOOKUP($A54,FB_6,2,0))&IF(TYPE(VLOOKUP($A54,FB_7,2,0))=16,\"\",VLOOKUP($A54,FB_7,2,0))&IF(TYPE(VLOOKUP($A54,FB_8,2,0))=16,\"\",VLOOKUP($A54,FB_8,2,0))&IF(TYPE(VLOOKUP($A54,FB_9,2,0))=16,\"\",VLOOKUP($A54,FB_9,2,0))&IF(TYPE(VLOOKUP($A54,FB_10,2,0))=16,\"\",VLOOKUP($A54,FB_10,2,0))&IF(TYPE(VLOOKUP($A54,FB_11,2,0))=16,\"\",VLOOKUP($A54,FB_11,2,0))&IF(TYPE(VLOOKUP($A54,FB_12,2,0))=16,\"\",VLOOKUP($A54,FB_12,2,0))&IF(TYPE(VLOOKUP($A54,FB_13,2,0))=16,\"\",VLOOKUP($A54,FB_13,2,0))&IF(TYPE(VLOOKUP($A54,FB_14,2,0))=16,\"\",VLOOKUP($A54,FB_14,2,0))&IF(TYPE(VLOOKUP($A54,FB_15,2,0))=16,\"\",VLOOKUP($A54,FB_15,2,0))&IF(TYPE(VLOOKUP($A54,FB_16,2,0))=16,\"\",VLOOKUP($A54,FB_16,2,0))&IF(TYPE(VLOOKUP($A54,FB_17,2,0))=16,\"\",VLOOKUP($A54,FB_17,2,0))&IF(TYPE(VLOOKUP($A54,FB_18,2,0))=16,\"\",VLOOKUP($A54,FB_18,2,0))&IF(TYPE(VLOOKUP($A54,FB_19,2,0))=16,\"\",VLOOKUP($A54,FB_19,2,0))&IF(TYPE(VLOOKUP($A54,FB_20,2,0))=16,\"\",VLOOKUP($A54,FB_20,2,0))&IF(TYPE(VLOOKUP($A54,FB_21,2,0))=16,\"\",VLOOKUP($A54,FB_21,2,0))&IF(TYPE(VLOOKUP($A54,FB_22,2,0))=16,\"\",VLOOKUP($A54,FB_22,2,0))&IF(TYPE(VLOOKUP($A54,FB_23,2,0))=16,\"\",VLOOKUP($A54,FB_23,2,0))&IF(TYPE(VLOOKUP($A54,FB_24,2,0))=16,\"\",VLOOKUP($A54,FB_24,2,0))&IF(TYPE(VLOOKUP($A54,FB_25,2,0))=16,\"\",VLOOKUP($A54,FB_25,2,0))&IF(TYPE(VLOOKUP($A54,FB_26,2,0))=16,\"\",VLOOKUP($A54,FB_26,2,0))&IF(TYPE(VLOOKUP($A54,FB_27,2,0))=16,\"\",VLOOKUP($A54,FB_27,2,0))&IF(TYPE(VLOOKUP($A54,FB_28,2,0))=16,\"\",VLOOKUP($A54,FB_28,2,0))&IF(TYPE(VLOOKUP($A54,FB_29,2,0))=16,\"\",VLOOKUP($A54,FB_29,2,0))&IF(TYPE(VLOOKUP($A54,FB_30,2,0))=16,\"\",VLOOKUP($A54,FB_30,2,0))","v":""},null,{"$f":"IF($B54=\"\",\"\",_xlfn.NUMBERVALUE(IF(TYPE(VLOOKUP($A54,FB_1,P$5,0))=16,\"\",VLOOKUP($A54,FB_1,P$5,0))&IF(TYPE(VLOOKUP($A54,FB_2,P$5,0))=16,\"\",VLOOKUP($A54,FB_2,P$5,0))&IF(TYPE(VLOOKUP($A54,FB_3,P$5,0))=16,\"\",VLOOKUP($A54,FB_3,P$5,0))&IF(TYPE(VLOOKUP($A54,FB_4,P$5,0))=16,\"\",VLOOKUP($A54,FB_4,P$5,0))&IF(TYPE(VLOOKUP($A54,FB_5,P$5,0))=16,\"\",VLOOKUP($A54,FB_5,P$5,0))&IF(TYPE(VLOOKUP($A54,FB_6,P$5,0))=16,\"\",VLOOKUP($A54,FB_6,P$5,0))&IF(TYPE(VLOOKUP($A54,FB_7,P$5,0))=16,\"\",VLOOKUP($A54,FB_7,P$5,0))&IF(TYPE(VLOOKUP($A54,FB_8,P$5,0))=16,\"\",VLOOKUP($A54,FB_8,P$5,0))&IF(TYPE(VLOOKUP($A54,FB_9,P$5,0))=16,\"\",VLOOKUP($A54,FB_9,P$5,0))&IF(TYPE(VLOOKUP($A54,FB_10,P$5,0))=16,\"\",VLOOKUP($A54,FB_10,P$5,0))&IF(TYPE(VLOOKUP($A54,FB_11,P$5,0))=16,\"\",VLOOKUP($A54,FB_11,P$5,0))&IF(TYPE(VLOOKUP($A54,FB_12,P$5,0))=16,\"\",VLOOKUP($A54,FB_12,P$5,0))&IF(TYPE(VLOOKUP($A54,FB_13,P$5,0))=16,\"\",VLOOKUP($A54,FB_13,P$5,0))&IF(TYPE(VLOOKUP($A54,FB_14,P$5,0))=16,\"\",VLOOKUP($A54,FB_14,P$5,0))&IF(TYPE(VLOOKUP($A54,FB_15,P$5,0))=16,\"\",VLOOKUP($A54,FB_15,P$5,0))&IF(TYPE(VLOOKUP($A54,FB_16,P$5,0))=16,\"\",VLOOKUP($A54,FB_16,P$5,0))&IF(TYPE(VLOOKUP($A54,FB_17,P$5,0))=16,\"\",VLOOKUP($A54,FB_17,P$5,0))&IF(TYPE(VLOOKUP($A54,FB_18,P$5,0))=16,\"\",VLOOKUP($A54,FB_18,P$5,0))&IF(TYPE(VLOOKUP($A54,FB_19,P$5,0))=16,\"\",VLOOKUP($A54,FB_19,P$5,0))&IF(TYPE(VLOOKUP($A54,FB_20,P$5,0))=16,\"\",VLOOKUP($A54,FB_20,P$5,0))&IF(TYPE(VLOOKUP($A54,FB_21,P$5,0))=16,\"\",VLOOKUP($A54,FB_21,P$5,0))&IF(TYPE(VLOOKUP($A54,FB_22,P$5,0))=16,\"\",VLOOKUP($A54,FB_22,P$5,0))&IF(TYPE(VLOOKUP($A54,FB_23,P$5,0))=16,\"\",VLOOKUP($A54,FB_23,P$5,0))&IF(TYPE(VLOOKUP($A54,FB_24,P$5,0))=16,\"\",VLOOKUP($A54,FB_24,P$5,0))&IF(TYPE(VLOOKUP($A54,FB_25,P$5,0))=16,\"\",VLOOKUP($A54,FB_25,P$5,0))&IF(TYPE(VLOOKUP($A54,FB_26,P$5,0))=16,\"\",VLOOKUP($A54,FB_26,P$5,0))&IF(TYPE(VLOOKUP($A54,FB_27,P$5,0))=16,\"\",VLOOKUP($A54,FB_27,P$5,0))&IF(TYPE(VLOOKUP($A54,FB_28,P$5,0))=16,\"\",VLOOKUP($A54,FB_28,P$5,0))&IF(TYPE(VLOOKUP($A54,FB_29,P$5,0))=16,\"\",VLOOKUP($A54,FB_29,P$5,0))&IF(TYPE(VLOOKUP($A54,FB_30,P$5,0))=16,\"\",VLOOKUP($A54,FB_30,P$5,0))))","v":""},"",{"$f":"IF($B54=\"\",\"\",_xlfn.NUMBERVALUE(IF(TYPE(VLOOKUP($A54,FB_1,R$5,0))=16,\"\",VLOOKUP($A54,FB_1,R$5,0))&IF(TYPE(VLOOKUP($A54,FB_2,R$5,0))=16,\"\",VLOOKUP($A54,FB_2,R$5,0))&IF(TYPE(VLOOKUP($A54,FB_3,R$5,0))=16,\"\",VLOOKUP($A54,FB_3,R$5,0))&IF(TYPE(VLOOKUP($A54,FB_4,R$5,0))=16,\"\",VLOOKUP($A54,FB_4,R$5,0))&IF(TYPE(VLOOKUP($A54,FB_5,R$5,0))=16,\"\",VLOOKUP($A54,FB_5,R$5,0))&IF(TYPE(VLOOKUP($A54,FB_6,R$5,0))=16,\"\",VLOOKUP($A54,FB_6,R$5,0))&IF(TYPE(VLOOKUP($A54,FB_7,R$5,0))=16,\"\",VLOOKUP($A54,FB_7,R$5,0))&IF(TYPE(VLOOKUP($A54,FB_8,R$5,0))=16,\"\",VLOOKUP($A54,FB_8,R$5,0))&IF(TYPE(VLOOKUP($A54,FB_9,R$5,0))=16,\"\",VLOOKUP($A54,FB_9,R$5,0))&IF(TYPE(VLOOKUP($A54,FB_10,R$5,0))=16,\"\",VLOOKUP($A54,FB_10,R$5,0))&IF(TYPE(VLOOKUP($A54,FB_11,R$5,0))=16,\"\",VLOOKUP($A54,FB_11,R$5,0))&IF(TYPE(VLOOKUP($A54,FB_12,R$5,0))=16,\"\",VLOOKUP($A54,FB_12,R$5,0))&IF(TYPE(VLOOKUP($A54,FB_13,R$5,0))=16,\"\",VLOOKUP($A54,FB_13,R$5,0))&IF(TYPE(VLOOKUP($A54,FB_14,R$5,0))=16,\"\",VLOOKUP($A54,FB_14,R$5,0))&IF(TYPE(VLOOKUP($A54,FB_15,R$5,0))=16,\"\",VLOOKUP($A54,FB_15,R$5,0))&IF(TYPE(VLOOKUP($A54,FB_16,R$5,0))=16,\"\",VLOOKUP($A54,FB_16,R$5,0))&IF(TYPE(VLOOKUP($A54,FB_17,R$5,0))=16,\"\",VLOOKUP($A54,FB_17,R$5,0))&IF(TYPE(VLOOKUP($A54,FB_18,R$5,0))=16,\"\",VLOOKUP($A54,FB_18,R$5,0))&IF(TYPE(VLOOKUP($A54,FB_19,R$5,0))=16,\"\",VLOOKUP($A54,FB_19,R$5,0))&IF(TYPE(VLOOKUP($A54,FB_20,R$5,0))=16,\"\",VLOOKUP($A54,FB_20,R$5,0))&IF(TYPE(VLOOKUP($A54,FB_21,R$5,0))=16,\"\",VLOOKUP($A54,FB_21,R$5,0))&IF(TYPE(VLOOKUP($A54,FB_22,R$5,0))=16,\"\",VLOOKUP($A54,FB_22,R$5,0))&IF(TYPE(VLOOKUP($A54,FB_23,R$5,0))=16,\"\",VLOOKUP($A54,FB_23,R$5,0))&IF(TYPE(VLOOKUP($A54,FB_24,R$5,0))=16,\"\",VLOOKUP($A54,FB_24,R$5,0))&IF(TYPE(VLOOKUP($A54,FB_25,R$5,0))=16,\"\",VLOOKUP($A54,FB_25,R$5,0))&IF(TYPE(VLOOKUP($A54,FB_26,R$5,0))=16,\"\",VLOOKUP($A54,FB_26,R$5,0))&IF(TYPE(VLOOKUP($A54,FB_27,R$5,0))=16,\"\",VLOOKUP($A54,FB_27,R$5,0))&IF(TYPE(VLOOKUP($A54,FB_28,R$5,0))=16,\"\",VLOOKUP($A54,FB_28,R$5,0))&IF(TYPE(VLOOKUP($A54,FB_29,R$5,0))=16,\"\",VLOOKUP($A54,FB_29,R$5,0))&IF(TYPE(VLOOKUP($A54,FB_30,R$5,0))=16,\"\",VLOOKUP($A54,FB_30,R$5,0))))","v":""},{"$f":"IF($B54=\"\",\"\",IF(TYPE(VLOOKUP($A54,FB_1,S$5,0))=16,\"\",VLOOKUP($A54,FB_1,S$5,0))&IF(TYPE(VLOOKUP($A54,FB_2,S$5,0))=16,\"\",VLOOKUP($A54,FB_2,S$5,0))&IF(TYPE(VLOOKUP($A54,FB_3,S$5,0))=16,\"\",VLOOKUP($A54,FB_3,S$5,0))&IF(TYPE(VLOOKUP($A54,FB_4,S$5,0))=16,\"\",VLOOKUP($A54,FB_4,S$5,0))&IF(TYPE(VLOOKUP($A54,FB_5,S$5,0))=16,\"\",VLOOKUP($A54,FB_5,S$5,0))&IF(TYPE(VLOOKUP($A54,FB_6,S$5,0))=16,\"\",VLOOKUP($A54,FB_6,S$5,0))&IF(TYPE(VLOOKUP($A54,FB_7,S$5,0))=16,\"\",VLOOKUP($A54,FB_7,S$5,0))&IF(TYPE(VLOOKUP($A54,FB_8,S$5,0))=16,\"\",VLOOKUP($A54,FB_8,S$5,0))&IF(TYPE(VLOOKUP($A54,FB_9,S$5,0))=16,\"\",VLOOKUP($A54,FB_9,S$5,0))&IF(TYPE(VLOOKUP($A54,FB_10,S$5,0))=16,\"\",VLOOKUP($A54,FB_10,S$5,0))&IF(TYPE(VLOOKUP($A54,FB_11,S$5,0))=16,\"\",VLOOKUP($A54,FB_11,S$5,0))&IF(TYPE(VLOOKUP($A54,FB_12,S$5,0))=16,\"\",VLOOKUP($A54,FB_12,S$5,0))&IF(TYPE(VLOOKUP($A54,FB_13,S$5,0))=16,\"\",VLOOKUP($A54,FB_13,S$5,0))&IF(TYPE(VLOOKUP($A54,FB_14,S$5,0))=16,\"\",VLOOKUP($A54,FB_14,S$5,0))&IF(TYPE(VLOOKUP($A54,FB_15,S$5,0))=16,\"\",VLOOKUP($A54,FB_15,S$5,0))&IF(TYPE(VLOOKUP($A54,FB_16,S$5,0))=16,\"\",VLOOKUP($A54,FB_16,S$5,0))&IF(TYPE(VLOOKUP($A54,FB_17,S$5,0))=16,\"\",VLOOKUP($A54,FB_17,S$5,0))&IF(TYPE(VLOOKUP($A54,FB_18,S$5,0))=16,\"\",VLOOKUP($A54,FB_18,S$5,0))&IF(TYPE(VLOOKUP($A54,FB_19,S$5,0))=16,\"\",VLOOKUP($A54,FB_19,S$5,0))&IF(TYPE(VLOOKUP($A54,FB_20,S$5,0))=16,\"\",VLOOKUP($A54,FB_20,S$5,0))&IF(TYPE(VLOOKUP($A54,FB_21,S$5,0))=16,\"\",VLOOKUP($A54,FB_21,S$5,0))&IF(TYPE(VLOOKUP($A54,FB_22,S$5,0))=16,\"\",VLOOKUP($A54,FB_22,S$5,0))&IF(TYPE(VLOOKUP($A54,FB_23,S$5,0))=16,\"\",VLOOKUP($A54,FB_23,S$5,0))&IF(TYPE(VLOOKUP($A54,FB_24,S$5,0))=16,\"\",VLOOKUP($A54,FB_24,S$5,0))&IF(TYPE(VLOOKUP($A54,FB_25,S$5,0))=16,\"\",VLOOKUP($A54,FB_25,S$5,0))&IF(TYPE(VLOOKUP($A54,FB_26,S$5,0))=16,\"\",VLOOKUP($A54,FB_26,S$5,0))&IF(TYPE(VLOOKUP($A54,FB_27,S$5,0))=16,\"\",VLOOKUP($A54,FB_27,S$5,0))&IF(TYPE(VLOOKUP($A54,FB_28,S$5,0))=16,\"\",VLOOKUP($A54,FB_28,S$5,0))&IF(TYPE(VLOOKUP($A54,FB_29,S$5,0))=16,\"\",VLOOKUP($A54,FB_29,S$5,0))&IF(TYPE(VLOOKUP($A54,FB_30,S$5,0))=16,\"\",VLOOKUP($A54,FB_30,S$5,0)))","v":""},null,null,null,null,null,null,null,null,null,null,null,null,null,null,null,null,"",":","","",""]
["26.",{"$f":"IF(TYPE(VLOOKUP($A55,FB_1,2,0))=16,\"\",VLOOKUP($A55,FB_1,2,0))&IF(TYPE(VLOOKUP($A55,FB_2,2,0))=16,\"\",VLOOKUP($A55,FB_2,2,0))&IF(TYPE(VLOOKUP($A55,FB_3,2,0))=16,\"\",VLOOKUP($A55,FB_3,2,0))&IF(TYPE(VLOOKUP($A55,FB_4,2,0))=16,\"\",VLOOKUP($A55,FB_4,2,0))&IF(TYPE(VLOOKUP($A55,FB_5,2,0))=16,\"\",VLOOKUP($A55,FB_5,2,0))&IF(TYPE(VLOOKUP($A55,FB_6,2,0))=16,\"\",VLOOKUP($A55,FB_6,2,0))&IF(TYPE(VLOOKUP($A55,FB_7,2,0))=16,\"\",VLOOKUP($A55,FB_7,2,0))&IF(TYPE(VLOOKUP($A55,FB_8,2,0))=16,\"\",VLOOKUP($A55,FB_8,2,0))&IF(TYPE(VLOOKUP($A55,FB_9,2,0))=16,\"\",VLOOKUP($A55,FB_9,2,0))&IF(TYPE(VLOOKUP($A55,FB_10,2,0))=16,\"\",VLOOKUP($A55,FB_10,2,0))&IF(TYPE(VLOOKUP($A55,FB_11,2,0))=16,\"\",VLOOKUP($A55,FB_11,2,0))&IF(TYPE(VLOOKUP($A55,FB_12,2,0))=16,\"\",VLOOKUP($A55,FB_12,2,0))&IF(TYPE(VLOOKUP($A55,FB_13,2,0))=16,\"\",VLOOKUP($A55,FB_13,2,0))&IF(TYPE(VLOOKUP($A55,FB_14,2,0))=16,\"\",VLOOKUP($A55,FB_14,2,0))&IF(TYPE(VLOOKUP($A55,FB_15,2,0))=16,\"\",VLOOKUP($A55,FB_15,2,0))&IF(TYPE(VLOOKUP($A55,FB_16,2,0))=16,\"\",VLOOKUP($A55,FB_16,2,0))&IF(TYPE(VLOOKUP($A55,FB_17,2,0))=16,\"\",VLOOKUP($A55,FB_17,2,0))&IF(TYPE(VLOOKUP($A55,FB_18,2,0))=16,\"\",VLOOKUP($A55,FB_18,2,0))&IF(TYPE(VLOOKUP($A55,FB_19,2,0))=16,\"\",VLOOKUP($A55,FB_19,2,0))&IF(TYPE(VLOOKUP($A55,FB_20,2,0))=16,\"\",VLOOKUP($A55,FB_20,2,0))&IF(TYPE(VLOOKUP($A55,FB_21,2,0))=16,\"\",VLOOKUP($A55,FB_21,2,0))&IF(TYPE(VLOOKUP($A55,FB_22,2,0))=16,\"\",VLOOKUP($A55,FB_22,2,0))&IF(TYPE(VLOOKUP($A55,FB_23,2,0))=16,\"\",VLOOKUP($A55,FB_23,2,0))&IF(TYPE(VLOOKUP($A55,FB_24,2,0))=16,\"\",VLOOKUP($A55,FB_24,2,0))&IF(TYPE(VLOOKUP($A55,FB_25,2,0))=16,\"\",VLOOKUP($A55,FB_25,2,0))&IF(TYPE(VLOOKUP($A55,FB_26,2,0))=16,\"\",VLOOKUP($A55,FB_26,2,0))&IF(TYPE(VLOOKUP($A55,FB_27,2,0))=16,\"\",VLOOKUP($A55,FB_27,2,0))&IF(TYPE(VLOOKUP($A55,FB_28,2,0))=16,\"\",VLOOKUP($A55,FB_28,2,0))&IF(TYPE(VLOOKUP($A55,FB_29,2,0))=16,\"\",VLOOKUP($A55,FB_29,2,0))&IF(TYPE(VLOOKUP($A55,FB_30,2,0))=16,\"\",VLOOKUP($A55,FB_30,2,0))","v":""},null,{"$f":"IF($B55=\"\",\"\",_xlfn.NUMBERVALUE(IF(TYPE(VLOOKUP($A55,FB_1,P$5,0))=16,\"\",VLOOKUP($A55,FB_1,P$5,0))&IF(TYPE(VLOOKUP($A55,FB_2,P$5,0))=16,\"\",VLOOKUP($A55,FB_2,P$5,0))&IF(TYPE(VLOOKUP($A55,FB_3,P$5,0))=16,\"\",VLOOKUP($A55,FB_3,P$5,0))&IF(TYPE(VLOOKUP($A55,FB_4,P$5,0))=16,\"\",VLOOKUP($A55,FB_4,P$5,0))&IF(TYPE(VLOOKUP($A55,FB_5,P$5,0))=16,\"\",VLOOKUP($A55,FB_5,P$5,0))&IF(TYPE(VLOOKUP($A55,FB_6,P$5,0))=16,\"\",VLOOKUP($A55,FB_6,P$5,0))&IF(TYPE(VLOOKUP($A55,FB_7,P$5,0))=16,\"\",VLOOKUP($A55,FB_7,P$5,0))&IF(TYPE(VLOOKUP($A55,FB_8,P$5,0))=16,\"\",VLOOKUP($A55,FB_8,P$5,0))&IF(TYPE(VLOOKUP($A55,FB_9,P$5,0))=16,\"\",VLOOKUP($A55,FB_9,P$5,0))&IF(TYPE(VLOOKUP($A55,FB_10,P$5,0))=16,\"\",VLOOKUP($A55,FB_10,P$5,0))&IF(TYPE(VLOOKUP($A55,FB_11,P$5,0))=16,\"\",VLOOKUP($A55,FB_11,P$5,0))&IF(TYPE(VLOOKUP($A55,FB_12,P$5,0))=16,\"\",VLOOKUP($A55,FB_12,P$5,0))&IF(TYPE(VLOOKUP($A55,FB_13,P$5,0))=16,\"\",VLOOKUP($A55,FB_13,P$5,0))&IF(TYPE(VLOOKUP($A55,FB_14,P$5,0))=16,\"\",VLOOKUP($A55,FB_14,P$5,0))&IF(TYPE(VLOOKUP($A55,FB_15,P$5,0))=16,\"\",VLOOKUP($A55,FB_15,P$5,0))&IF(TYPE(VLOOKUP($A55,FB_16,P$5,0))=16,\"\",VLOOKUP($A55,FB_16,P$5,0))&IF(TYPE(VLOOKUP($A55,FB_17,P$5,0))=16,\"\",VLOOKUP($A55,FB_17,P$5,0))&IF(TYPE(VLOOKUP($A55,FB_18,P$5,0))=16,\"\",VLOOKUP($A55,FB_18,P$5,0))&IF(TYPE(VLOOKUP($A55,FB_19,P$5,0))=16,\"\",VLOOKUP($A55,FB_19,P$5,0))&IF(TYPE(VLOOKUP($A55,FB_20,P$5,0))=16,\"\",VLOOKUP($A55,FB_20,P$5,0))&IF(TYPE(VLOOKUP($A55,FB_21,P$5,0))=16,\"\",VLOOKUP($A55,FB_21,P$5,0))&IF(TYPE(VLOOKUP($A55,FB_22,P$5,0))=16,\"\",VLOOKUP($A55,FB_22,P$5,0))&IF(TYPE(VLOOKUP($A55,FB_23,P$5,0))=16,\"\",VLOOKUP($A55,FB_23,P$5,0))&IF(TYPE(VLOOKUP($A55,FB_24,P$5,0))=16,\"\",VLOOKUP($A55,FB_24,P$5,0))&IF(TYPE(VLOOKUP($A55,FB_25,P$5,0))=16,\"\",VLOOKUP($A55,FB_25,P$5,0))&IF(TYPE(VLOOKUP($A55,FB_26,P$5,0))=16,\"\",VLOOKUP($A55,FB_26,P$5,0))&IF(TYPE(VLOOKUP($A55,FB_27,P$5,0))=16,\"\",VLOOKUP($A55,FB_27,P$5,0))&IF(TYPE(VLOOKUP($A55,FB_28,P$5,0))=16,\"\",VLOOKUP($A55,FB_28,P$5,0))&IF(TYPE(VLOOKUP($A55,FB_29,P$5,0))=16,\"\",VLOOKUP($A55,FB_29,P$5,0))&IF(TYPE(VLOOKUP($A55,FB_30,P$5,0))=16,\"\",VLOOKUP($A55,FB_30,P$5,0))))","v":""},"",{"$f":"IF($B55=\"\",\"\",_xlfn.NUMBERVALUE(IF(TYPE(VLOOKUP($A55,FB_1,R$5,0))=16,\"\",VLOOKUP($A55,FB_1,R$5,0))&IF(TYPE(VLOOKUP($A55,FB_2,R$5,0))=16,\"\",VLOOKUP($A55,FB_2,R$5,0))&IF(TYPE(VLOOKUP($A55,FB_3,R$5,0))=16,\"\",VLOOKUP($A55,FB_3,R$5,0))&IF(TYPE(VLOOKUP($A55,FB_4,R$5,0))=16,\"\",VLOOKUP($A55,FB_4,R$5,0))&IF(TYPE(VLOOKUP($A55,FB_5,R$5,0))=16,\"\",VLOOKUP($A55,FB_5,R$5,0))&IF(TYPE(VLOOKUP($A55,FB_6,R$5,0))=16,\"\",VLOOKUP($A55,FB_6,R$5,0))&IF(TYPE(VLOOKUP($A55,FB_7,R$5,0))=16,\"\",VLOOKUP($A55,FB_7,R$5,0))&IF(TYPE(VLOOKUP($A55,FB_8,R$5,0))=16,\"\",VLOOKUP($A55,FB_8,R$5,0))&IF(TYPE(VLOOKUP($A55,FB_9,R$5,0))=16,\"\",VLOOKUP($A55,FB_9,R$5,0))&IF(TYPE(VLOOKUP($A55,FB_10,R$5,0))=16,\"\",VLOOKUP($A55,FB_10,R$5,0))&IF(TYPE(VLOOKUP($A55,FB_11,R$5,0))=16,\"\",VLOOKUP($A55,FB_11,R$5,0))&IF(TYPE(VLOOKUP($A55,FB_12,R$5,0))=16,\"\",VLOOKUP($A55,FB_12,R$5,0))&IF(TYPE(VLOOKUP($A55,FB_13,R$5,0))=16,\"\",VLOOKUP($A55,FB_13,R$5,0))&IF(TYPE(VLOOKUP($A55,FB_14,R$5,0))=16,\"\",VLOOKUP($A55,FB_14,R$5,0))&IF(TYPE(VLOOKUP($A55,FB_15,R$5,0))=16,\"\",VLOOKUP($A55,FB_15,R$5,0))&IF(TYPE(VLOOKUP($A55,FB_16,R$5,0))=16,\"\",VLOOKUP($A55,FB_16,R$5,0))&IF(TYPE(VLOOKUP($A55,FB_17,R$5,0))=16,\"\",VLOOKUP($A55,FB_17,R$5,0))&IF(TYPE(VLOOKUP($A55,FB_18,R$5,0))=16,\"\",VLOOKUP($A55,FB_18,R$5,0))&IF(TYPE(VLOOKUP($A55,FB_19,R$5,0))=16,\"\",VLOOKUP($A55,FB_19,R$5,0))&IF(TYPE(VLOOKUP($A55,FB_20,R$5,0))=16,\"\",VLOOKUP($A55,FB_20,R$5,0))&IF(TYPE(VLOOKUP($A55,FB_21,R$5,0))=16,\"\",VLOOKUP($A55,FB_21,R$5,0))&IF(TYPE(VLOOKUP($A55,FB_22,R$5,0))=16,\"\",VLOOKUP($A55,FB_22,R$5,0))&IF(TYPE(VLOOKUP($A55,FB_23,R$5,0))=16,\"\",VLOOKUP($A55,FB_23,R$5,0))&IF(TYPE(VLOOKUP($A55,FB_24,R$5,0))=16,\"\",VLOOKUP($A55,FB_24,R$5,0))&IF(TYPE(VLOOKUP($A55,FB_25,R$5,0))=16,\"\",VLOOKUP($A55,FB_25,R$5,0))&IF(TYPE(VLOOKUP($A55,FB_26,R$5,0))=16,\"\",VLOOKUP($A55,FB_26,R$5,0))&IF(TYPE(VLOOKUP($A55,FB_27,R$5,0))=16,\"\",VLOOKUP($A55,FB_27,R$5,0))&IF(TYPE(VLOOKUP($A55,FB_28,R$5,0))=16,\"\",VLOOKUP($A55,FB_28,R$5,0))&IF(TYPE(VLOOKUP($A55,FB_29,R$5,0))=16,\"\",VLOOKUP($A55,FB_29,R$5,0))&IF(TYPE(VLOOKUP($A55,FB_30,R$5,0))=16,\"\",VLOOKUP($A55,FB_30,R$5,0))))","v":""},{"$f":"IF($B55=\"\",\"\",IF(TYPE(VLOOKUP($A55,FB_1,S$5,0))=16,\"\",VLOOKUP($A55,FB_1,S$5,0))&IF(TYPE(VLOOKUP($A55,FB_2,S$5,0))=16,\"\",VLOOKUP($A55,FB_2,S$5,0))&IF(TYPE(VLOOKUP($A55,FB_3,S$5,0))=16,\"\",VLOOKUP($A55,FB_3,S$5,0))&IF(TYPE(VLOOKUP($A55,FB_4,S$5,0))=16,\"\",VLOOKUP($A55,FB_4,S$5,0))&IF(TYPE(VLOOKUP($A55,FB_5,S$5,0))=16,\"\",VLOOKUP($A55,FB_5,S$5,0))&IF(TYPE(VLOOKUP($A55,FB_6,S$5,0))=16,\"\",VLOOKUP($A55,FB_6,S$5,0))&IF(TYPE(VLOOKUP($A55,FB_7,S$5,0))=16,\"\",VLOOKUP($A55,FB_7,S$5,0))&IF(TYPE(VLOOKUP($A55,FB_8,S$5,0))=16,\"\",VLOOKUP($A55,FB_8,S$5,0))&IF(TYPE(VLOOKUP($A55,FB_9,S$5,0))=16,\"\",VLOOKUP($A55,FB_9,S$5,0))&IF(TYPE(VLOOKUP($A55,FB_10,S$5,0))=16,\"\",VLOOKUP($A55,FB_10,S$5,0))&IF(TYPE(VLOOKUP($A55,FB_11,S$5,0))=16,\"\",VLOOKUP($A55,FB_11,S$5,0))&IF(TYPE(VLOOKUP($A55,FB_12,S$5,0))=16,\"\",VLOOKUP($A55,FB_12,S$5,0))&IF(TYPE(VLOOKUP($A55,FB_13,S$5,0))=16,\"\",VLOOKUP($A55,FB_13,S$5,0))&IF(TYPE(VLOOKUP($A55,FB_14,S$5,0))=16,\"\",VLOOKUP($A55,FB_14,S$5,0))&IF(TYPE(VLOOKUP($A55,FB_15,S$5,0))=16,\"\",VLOOKUP($A55,FB_15,S$5,0))&IF(TYPE(VLOOKUP($A55,FB_16,S$5,0))=16,\"\",VLOOKUP($A55,FB_16,S$5,0))&IF(TYPE(VLOOKUP($A55,FB_17,S$5,0))=16,\"\",VLOOKUP($A55,FB_17,S$5,0))&IF(TYPE(VLOOKUP($A55,FB_18,S$5,0))=16,\"\",VLOOKUP($A55,FB_18,S$5,0))&IF(TYPE(VLOOKUP($A55,FB_19,S$5,0))=16,\"\",VLOOKUP($A55,FB_19,S$5,0))&IF(TYPE(VLOOKUP($A55,FB_20,S$5,0))=16,\"\",VLOOKUP($A55,FB_20,S$5,0))&IF(TYPE(VLOOKUP($A55,FB_21,S$5,0))=16,\"\",VLOOKUP($A55,FB_21,S$5,0))&IF(TYPE(VLOOKUP($A55,FB_22,S$5,0))=16,\"\",VLOOKUP($A55,FB_22,S$5,0))&IF(TYPE(VLOOKUP($A55,FB_23,S$5,0))=16,\"\",VLOOKUP($A55,FB_23,S$5,0))&IF(TYPE(VLOOKUP($A55,FB_24,S$5,0))=16,\"\",VLOOKUP($A55,FB_24,S$5,0))&IF(TYPE(VLOOKUP($A55,FB_25,S$5,0))=16,\"\",VLOOKUP($A55,FB_25,S$5,0))&IF(TYPE(VLOOKUP($A55,FB_26,S$5,0))=16,\"\",VLOOKUP($A55,FB_26,S$5,0))&IF(TYPE(VLOOKUP($A55,FB_27,S$5,0))=16,\"\",VLOOKUP($A55,FB_27,S$5,0))&IF(TYPE(VLOOKUP($A55,FB_28,S$5,0))=16,\"\",VLOOKUP($A55,FB_28,S$5,0))&IF(TYPE(VLOOKUP($A55,FB_29,S$5,0))=16,\"\",VLOOKUP($A55,FB_29,S$5,0))&IF(TYPE(VLOOKUP($A55,FB_30,S$5,0))=16,\"\",VLOOKUP($A55,FB_30,S$5,0)))","v":""},null,null,null,null,null,null,null,null,null,null,null,null,null,null,null,null,"",":","","",""]
["27.",{"$f":"IF(TYPE(VLOOKUP($A56,FB_1,2,0))=16,\"\",VLOOKUP($A56,FB_1,2,0))&IF(TYPE(VLOOKUP($A56,FB_2,2,0))=16,\"\",VLOOKUP($A56,FB_2,2,0))&IF(TYPE(VLOOKUP($A56,FB_3,2,0))=16,\"\",VLOOKUP($A56,FB_3,2,0))&IF(TYPE(VLOOKUP($A56,FB_4,2,0))=16,\"\",VLOOKUP($A56,FB_4,2,0))&IF(TYPE(VLOOKUP($A56,FB_5,2,0))=16,\"\",VLOOKUP($A56,FB_5,2,0))&IF(TYPE(VLOOKUP($A56,FB_6,2,0))=16,\"\",VLOOKUP($A56,FB_6,2,0))&IF(TYPE(VLOOKUP($A56,FB_7,2,0))=16,\"\",VLOOKUP($A56,FB_7,2,0))&IF(TYPE(VLOOKUP($A56,FB_8,2,0))=16,\"\",VLOOKUP($A56,FB_8,2,0))&IF(TYPE(VLOOKUP($A56,FB_9,2,0))=16,\"\",VLOOKUP($A56,FB_9,2,0))&IF(TYPE(VLOOKUP($A56,FB_10,2,0))=16,\"\",VLOOKUP($A56,FB_10,2,0))&IF(TYPE(VLOOKUP($A56,FB_11,2,0))=16,\"\",VLOOKUP($A56,FB_11,2,0))&IF(TYPE(VLOOKUP($A56,FB_12,2,0))=16,\"\",VLOOKUP($A56,FB_12,2,0))&IF(TYPE(VLOOKUP($A56,FB_13,2,0))=16,\"\",VLOOKUP($A56,FB_13,2,0))&IF(TYPE(VLOOKUP($A56,FB_14,2,0))=16,\"\",VLOOKUP($A56,FB_14,2,0))&IF(TYPE(VLOOKUP($A56,FB_15,2,0))=16,\"\",VLOOKUP($A56,FB_15,2,0))&IF(TYPE(VLOOKUP($A56,FB_16,2,0))=16,\"\",VLOOKUP($A56,FB_16,2,0))&IF(TYPE(VLOOKUP($A56,FB_17,2,0))=16,\"\",VLOOKUP($A56,FB_17,2,0))&IF(TYPE(VLOOKUP($A56,FB_18,2,0))=16,\"\",VLOOKUP($A56,FB_18,2,0))&IF(TYPE(VLOOKUP($A56,FB_19,2,0))=16,\"\",VLOOKUP($A56,FB_19,2,0))&IF(TYPE(VLOOKUP($A56,FB_20,2,0))=16,\"\",VLOOKUP($A56,FB_20,2,0))&IF(TYPE(VLOOKUP($A56,FB_21,2,0))=16,\"\",VLOOKUP($A56,FB_21,2,0))&IF(TYPE(VLOOKUP($A56,FB_22,2,0))=16,\"\",VLOOKUP($A56,FB_22,2,0))&IF(TYPE(VLOOKUP($A56,FB_23,2,0))=16,\"\",VLOOKUP($A56,FB_23,2,0))&IF(TYPE(VLOOKUP($A56,FB_24,2,0))=16,\"\",VLOOKUP($A56,FB_24,2,0))&IF(TYPE(VLOOKUP($A56,FB_25,2,0))=16,\"\",VLOOKUP($A56,FB_25,2,0))&IF(TYPE(VLOOKUP($A56,FB_26,2,0))=16,\"\",VLOOKUP($A56,FB_26,2,0))&IF(TYPE(VLOOKUP($A56,FB_27,2,0))=16,\"\",VLOOKUP($A56,FB_27,2,0))&IF(TYPE(VLOOKUP($A56,FB_28,2,0))=16,\"\",VLOOKUP($A56,FB_28,2,0))&IF(TYPE(VLOOKUP($A56,FB_29,2,0))=16,\"\",VLOOKUP($A56,FB_29,2,0))&IF(TYPE(VLOOKUP($A56,FB_30,2,0))=16,\"\",VLOOKUP($A56,FB_30,2,0))","v":""},null,{"$f":"IF($B56=\"\",\"\",_xlfn.NUMBERVALUE(IF(TYPE(VLOOKUP($A56,FB_1,P$5,0))=16,\"\",VLOOKUP($A56,FB_1,P$5,0))&IF(TYPE(VLOOKUP($A56,FB_2,P$5,0))=16,\"\",VLOOKUP($A56,FB_2,P$5,0))&IF(TYPE(VLOOKUP($A56,FB_3,P$5,0))=16,\"\",VLOOKUP($A56,FB_3,P$5,0))&IF(TYPE(VLOOKUP($A56,FB_4,P$5,0))=16,\"\",VLOOKUP($A56,FB_4,P$5,0))&IF(TYPE(VLOOKUP($A56,FB_5,P$5,0))=16,\"\",VLOOKUP($A56,FB_5,P$5,0))&IF(TYPE(VLOOKUP($A56,FB_6,P$5,0))=16,\"\",VLOOKUP($A56,FB_6,P$5,0))&IF(TYPE(VLOOKUP($A56,FB_7,P$5,0))=16,\"\",VLOOKUP($A56,FB_7,P$5,0))&IF(TYPE(VLOOKUP($A56,FB_8,P$5,0))=16,\"\",VLOOKUP($A56,FB_8,P$5,0))&IF(TYPE(VLOOKUP($A56,FB_9,P$5,0))=16,\"\",VLOOKUP($A56,FB_9,P$5,0))&IF(TYPE(VLOOKUP($A56,FB_10,P$5,0))=16,\"\",VLOOKUP($A56,FB_10,P$5,0))&IF(TYPE(VLOOKUP($A56,FB_11,P$5,0))=16,\"\",VLOOKUP($A56,FB_11,P$5,0))&IF(TYPE(VLOOKUP($A56,FB_12,P$5,0))=16,\"\",VLOOKUP($A56,FB_12,P$5,0))&IF(TYPE(VLOOKUP($A56,FB_13,P$5,0))=16,\"\",VLOOKUP($A56,FB_13,P$5,0))&IF(TYPE(VLOOKUP($A56,FB_14,P$5,0))=16,\"\",VLOOKUP($A56,FB_14,P$5,0))&IF(TYPE(VLOOKUP($A56,FB_15,P$5,0))=16,\"\",VLOOKUP($A56,FB_15,P$5,0))&IF(TYPE(VLOOKUP($A56,FB_16,P$5,0))=16,\"\",VLOOKUP($A56,FB_16,P$5,0))&IF(TYPE(VLOOKUP($A56,FB_17,P$5,0))=16,\"\",VLOOKUP($A56,FB_17,P$5,0))&IF(TYPE(VLOOKUP($A56,FB_18,P$5,0))=16,\"\",VLOOKUP($A56,FB_18,P$5,0))&IF(TYPE(VLOOKUP($A56,FB_19,P$5,0))=16,\"\",VLOOKUP($A56,FB_19,P$5,0))&IF(TYPE(VLOOKUP($A56,FB_20,P$5,0))=16,\"\",VLOOKUP($A56,FB_20,P$5,0))&IF(TYPE(VLOOKUP($A56,FB_21,P$5,0))=16,\"\",VLOOKUP($A56,FB_21,P$5,0))&IF(TYPE(VLOOKUP($A56,FB_22,P$5,0))=16,\"\",VLOOKUP($A56,FB_22,P$5,0))&IF(TYPE(VLOOKUP($A56,FB_23,P$5,0))=16,\"\",VLOOKUP($A56,FB_23,P$5,0))&IF(TYPE(VLOOKUP($A56,FB_24,P$5,0))=16,\"\",VLOOKUP($A56,FB_24,P$5,0))&IF(TYPE(VLOOKUP($A56,FB_25,P$5,0))=16,\"\",VLOOKUP($A56,FB_25,P$5,0))&IF(TYPE(VLOOKUP($A56,FB_26,P$5,0))=16,\"\",VLOOKUP($A56,FB_26,P$5,0))&IF(TYPE(VLOOKUP($A56,FB_27,P$5,0))=16,\"\",VLOOKUP($A56,FB_27,P$5,0))&IF(TYPE(VLOOKUP($A56,FB_28,P$5,0))=16,\"\",VLOOKUP($A56,FB_28,P$5,0))&IF(TYPE(VLOOKUP($A56,FB_29,P$5,0))=16,\"\",VLOOKUP($A56,FB_29,P$5,0))&IF(TYPE(VLOOKUP($A56,FB_30,P$5,0))=16,\"\",VLOOKUP($A56,FB_30,P$5,0))))","v":""},"",{"$f":"IF($B56=\"\",\"\",_xlfn.NUMBERVALUE(IF(TYPE(VLOOKUP($A56,FB_1,R$5,0))=16,\"\",VLOOKUP($A56,FB_1,R$5,0))&IF(TYPE(VLOOKUP($A56,FB_2,R$5,0))=16,\"\",VLOOKUP($A56,FB_2,R$5,0))&IF(TYPE(VLOOKUP($A56,FB_3,R$5,0))=16,\"\",VLOOKUP($A56,FB_3,R$5,0))&IF(TYPE(VLOOKUP($A56,FB_4,R$5,0))=16,\"\",VLOOKUP($A56,FB_4,R$5,0))&IF(TYPE(VLOOKUP($A56,FB_5,R$5,0))=16,\"\",VLOOKUP($A56,FB_5,R$5,0))&IF(TYPE(VLOOKUP($A56,FB_6,R$5,0))=16,\"\",VLOOKUP($A56,FB_6,R$5,0))&IF(TYPE(VLOOKUP($A56,FB_7,R$5,0))=16,\"\",VLOOKUP($A56,FB_7,R$5,0))&IF(TYPE(VLOOKUP($A56,FB_8,R$5,0))=16,\"\",VLOOKUP($A56,FB_8,R$5,0))&IF(TYPE(VLOOKUP($A56,FB_9,R$5,0))=16,\"\",VLOOKUP($A56,FB_9,R$5,0))&IF(TYPE(VLOOKUP($A56,FB_10,R$5,0))=16,\"\",VLOOKUP($A56,FB_10,R$5,0))&IF(TYPE(VLOOKUP($A56,FB_11,R$5,0))=16,\"\",VLOOKUP($A56,FB_11,R$5,0))&IF(TYPE(VLOOKUP($A56,FB_12,R$5,0))=16,\"\",VLOOKUP($A56,FB_12,R$5,0))&IF(TYPE(VLOOKUP($A56,FB_13,R$5,0))=16,\"\",VLOOKUP($A56,FB_13,R$5,0))&IF(TYPE(VLOOKUP($A56,FB_14,R$5,0))=16,\"\",VLOOKUP($A56,FB_14,R$5,0))&IF(TYPE(VLOOKUP($A56,FB_15,R$5,0))=16,\"\",VLOOKUP($A56,FB_15,R$5,0))&IF(TYPE(VLOOKUP($A56,FB_16,R$5,0))=16,\"\",VLOOKUP($A56,FB_16,R$5,0))&IF(TYPE(VLOOKUP($A56,FB_17,R$5,0))=16,\"\",VLOOKUP($A56,FB_17,R$5,0))&IF(TYPE(VLOOKUP($A56,FB_18,R$5,0))=16,\"\",VLOOKUP($A56,FB_18,R$5,0))&IF(TYPE(VLOOKUP($A56,FB_19,R$5,0))=16,\"\",VLOOKUP($A56,FB_19,R$5,0))&IF(TYPE(VLOOKUP($A56,FB_20,R$5,0))=16,\"\",VLOOKUP($A56,FB_20,R$5,0))&IF(TYPE(VLOOKUP($A56,FB_21,R$5,0))=16,\"\",VLOOKUP($A56,FB_21,R$5,0))&IF(TYPE(VLOOKUP($A56,FB_22,R$5,0))=16,\"\",VLOOKUP($A56,FB_22,R$5,0))&IF(TYPE(VLOOKUP($A56,FB_23,R$5,0))=16,\"\",VLOOKUP($A56,FB_23,R$5,0))&IF(TYPE(VLOOKUP($A56,FB_24,R$5,0))=16,\"\",VLOOKUP($A56,FB_24,R$5,0))&IF(TYPE(VLOOKUP($A56,FB_25,R$5,0))=16,\"\",VLOOKUP($A56,FB_25,R$5,0))&IF(TYPE(VLOOKUP($A56,FB_26,R$5,0))=16,\"\",VLOOKUP($A56,FB_26,R$5,0))&IF(TYPE(VLOOKUP($A56,FB_27,R$5,0))=16,\"\",VLOOKUP($A56,FB_27,R$5,0))&IF(TYPE(VLOOKUP($A56,FB_28,R$5,0))=16,\"\",VLOOKUP($A56,FB_28,R$5,0))&IF(TYPE(VLOOKUP($A56,FB_29,R$5,0))=16,\"\",VLOOKUP($A56,FB_29,R$5,0))&IF(TYPE(VLOOKUP($A56,FB_30,R$5,0))=16,\"\",VLOOKUP($A56,FB_30,R$5,0))))","v":""},{"$f":"IF($B56=\"\",\"\",IF(TYPE(VLOOKUP($A56,FB_1,S$5,0))=16,\"\",VLOOKUP($A56,FB_1,S$5,0))&IF(TYPE(VLOOKUP($A56,FB_2,S$5,0))=16,\"\",VLOOKUP($A56,FB_2,S$5,0))&IF(TYPE(VLOOKUP($A56,FB_3,S$5,0))=16,\"\",VLOOKUP($A56,FB_3,S$5,0))&IF(TYPE(VLOOKUP($A56,FB_4,S$5,0))=16,\"\",VLOOKUP($A56,FB_4,S$5,0))&IF(TYPE(VLOOKUP($A56,FB_5,S$5,0))=16,\"\",VLOOKUP($A56,FB_5,S$5,0))&IF(TYPE(VLOOKUP($A56,FB_6,S$5,0))=16,\"\",VLOOKUP($A56,FB_6,S$5,0))&IF(TYPE(VLOOKUP($A56,FB_7,S$5,0))=16,\"\",VLOOKUP($A56,FB_7,S$5,0))&IF(TYPE(VLOOKUP($A56,FB_8,S$5,0))=16,\"\",VLOOKUP($A56,FB_8,S$5,0))&IF(TYPE(VLOOKUP($A56,FB_9,S$5,0))=16,\"\",VLOOKUP($A56,FB_9,S$5,0))&IF(TYPE(VLOOKUP($A56,FB_10,S$5,0))=16,\"\",VLOOKUP($A56,FB_10,S$5,0))&IF(TYPE(VLOOKUP($A56,FB_11,S$5,0))=16,\"\",VLOOKUP($A56,FB_11,S$5,0))&IF(TYPE(VLOOKUP($A56,FB_12,S$5,0))=16,\"\",VLOOKUP($A56,FB_12,S$5,0))&IF(TYPE(VLOOKUP($A56,FB_13,S$5,0))=16,\"\",VLOOKUP($A56,FB_13,S$5,0))&IF(TYPE(VLOOKUP($A56,FB_14,S$5,0))=16,\"\",VLOOKUP($A56,FB_14,S$5,0))&IF(TYPE(VLOOKUP($A56,FB_15,S$5,0))=16,\"\",VLOOKUP($A56,FB_15,S$5,0))&IF(TYPE(VLOOKUP($A56,FB_16,S$5,0))=16,\"\",VLOOKUP($A56,FB_16,S$5,0))&IF(TYPE(VLOOKUP($A56,FB_17,S$5,0))=16,\"\",VLOOKUP($A56,FB_17,S$5,0))&IF(TYPE(VLOOKUP($A56,FB_18,S$5,0))=16,\"\",VLOOKUP($A56,FB_18,S$5,0))&IF(TYPE(VLOOKUP($A56,FB_19,S$5,0))=16,\"\",VLOOKUP($A56,FB_19,S$5,0))&IF(TYPE(VLOOKUP($A56,FB_20,S$5,0))=16,\"\",VLOOKUP($A56,FB_20,S$5,0))&IF(TYPE(VLOOKUP($A56,FB_21,S$5,0))=16,\"\",VLOOKUP($A56,FB_21,S$5,0))&IF(TYPE(VLOOKUP($A56,FB_22,S$5,0))=16,\"\",VLOOKUP($A56,FB_22,S$5,0))&IF(TYPE(VLOOKUP($A56,FB_23,S$5,0))=16,\"\",VLOOKUP($A56,FB_23,S$5,0))&IF(TYPE(VLOOKUP($A56,FB_24,S$5,0))=16,\"\",VLOOKUP($A56,FB_24,S$5,0))&IF(TYPE(VLOOKUP($A56,FB_25,S$5,0))=16,\"\",VLOOKUP($A56,FB_25,S$5,0))&IF(TYPE(VLOOKUP($A56,FB_26,S$5,0))=16,\"\",VLOOKUP($A56,FB_26,S$5,0))&IF(TYPE(VLOOKUP($A56,FB_27,S$5,0))=16,\"\",VLOOKUP($A56,FB_27,S$5,0))&IF(TYPE(VLOOKUP($A56,FB_28,S$5,0))=16,\"\",VLOOKUP($A56,FB_28,S$5,0))&IF(TYPE(VLOOKUP($A56,FB_29,S$5,0))=16,\"\",VLOOKUP($A56,FB_29,S$5,0))&IF(TYPE(VLOOKUP($A56,FB_30,S$5,0))=16,\"\",VLOOKUP($A56,FB_30,S$5,0)))","v":""},null,null,null,null,null,null,null,null,null,null,null,null,null,null,null,null,"",":","","",""]
["28.",{"$f":"IF(TYPE(VLOOKUP($A57,FB_1,2,0))=16,\"\",VLOOKUP($A57,FB_1,2,0))&IF(TYPE(VLOOKUP($A57,FB_2,2,0))=16,\"\",VLOOKUP($A57,FB_2,2,0))&IF(TYPE(VLOOKUP($A57,FB_3,2,0))=16,\"\",VLOOKUP($A57,FB_3,2,0))&IF(TYPE(VLOOKUP($A57,FB_4,2,0))=16,\"\",VLOOKUP($A57,FB_4,2,0))&IF(TYPE(VLOOKUP($A57,FB_5,2,0))=16,\"\",VLOOKUP($A57,FB_5,2,0))&IF(TYPE(VLOOKUP($A57,FB_6,2,0))=16,\"\",VLOOKUP($A57,FB_6,2,0))&IF(TYPE(VLOOKUP($A57,FB_7,2,0))=16,\"\",VLOOKUP($A57,FB_7,2,0))&IF(TYPE(VLOOKUP($A57,FB_8,2,0))=16,\"\",VLOOKUP($A57,FB_8,2,0))&IF(TYPE(VLOOKUP($A57,FB_9,2,0))=16,\"\",VLOOKUP($A57,FB_9,2,0))&IF(TYPE(VLOOKUP($A57,FB_10,2,0))=16,\"\",VLOOKUP($A57,FB_10,2,0))&IF(TYPE(VLOOKUP($A57,FB_11,2,0))=16,\"\",VLOOKUP($A57,FB_11,2,0))&IF(TYPE(VLOOKUP($A57,FB_12,2,0))=16,\"\",VLOOKUP($A57,FB_12,2,0))&IF(TYPE(VLOOKUP($A57,FB_13,2,0))=16,\"\",VLOOKUP($A57,FB_13,2,0))&IF(TYPE(VLOOKUP($A57,FB_14,2,0))=16,\"\",VLOOKUP($A57,FB_14,2,0))&IF(TYPE(VLOOKUP($A57,FB_15,2,0))=16,\"\",VLOOKUP($A57,FB_15,2,0))&IF(TYPE(VLOOKUP($A57,FB_16,2,0))=16,\"\",VLOOKUP($A57,FB_16,2,0))&IF(TYPE(VLOOKUP($A57,FB_17,2,0))=16,\"\",VLOOKUP($A57,FB_17,2,0))&IF(TYPE(VLOOKUP($A57,FB_18,2,0))=16,\"\",VLOOKUP($A57,FB_18,2,0))&IF(TYPE(VLOOKUP($A57,FB_19,2,0))=16,\"\",VLOOKUP($A57,FB_19,2,0))&IF(TYPE(VLOOKUP($A57,FB_20,2,0))=16,\"\",VLOOKUP($A57,FB_20,2,0))&IF(TYPE(VLOOKUP($A57,FB_21,2,0))=16,\"\",VLOOKUP($A57,FB_21,2,0))&IF(TYPE(VLOOKUP($A57,FB_22,2,0))=16,\"\",VLOOKUP($A57,FB_22,2,0))&IF(TYPE(VLOOKUP($A57,FB_23,2,0))=16,\"\",VLOOKUP($A57,FB_23,2,0))&IF(TYPE(VLOOKUP($A57,FB_24,2,0))=16,\"\",VLOOKUP($A57,FB_24,2,0))&IF(TYPE(VLOOKUP($A57,FB_25,2,0))=16,\"\",VLOOKUP($A57,FB_25,2,0))&IF(TYPE(VLOOKUP($A57,FB_26,2,0))=16,\"\",VLOOKUP($A57,FB_26,2,0))&IF(TYPE(VLOOKUP($A57,FB_27,2,0))=16,\"\",VLOOKUP($A57,FB_27,2,0))&IF(TYPE(VLOOKUP($A57,FB_28,2,0))=16,\"\",VLOOKUP($A57,FB_28,2,0))&IF(TYPE(VLOOKUP($A57,FB_29,2,0))=16,\"\",VLOOKUP($A57,FB_29,2,0))&IF(TYPE(VLOOKUP($A57,FB_30,2,0))=16,\"\",VLOOKUP($A57,FB_30,2,0))","v":""},null,{"$f":"IF($B57=\"\",\"\",_xlfn.NUMBERVALUE(IF(TYPE(VLOOKUP($A57,FB_1,P$5,0))=16,\"\",VLOOKUP($A57,FB_1,P$5,0))&IF(TYPE(VLOOKUP($A57,FB_2,P$5,0))=16,\"\",VLOOKUP($A57,FB_2,P$5,0))&IF(TYPE(VLOOKUP($A57,FB_3,P$5,0))=16,\"\",VLOOKUP($A57,FB_3,P$5,0))&IF(TYPE(VLOOKUP($A57,FB_4,P$5,0))=16,\"\",VLOOKUP($A57,FB_4,P$5,0))&IF(TYPE(VLOOKUP($A57,FB_5,P$5,0))=16,\"\",VLOOKUP($A57,FB_5,P$5,0))&IF(TYPE(VLOOKUP($A57,FB_6,P$5,0))=16,\"\",VLOOKUP($A57,FB_6,P$5,0))&IF(TYPE(VLOOKUP($A57,FB_7,P$5,0))=16,\"\",VLOOKUP($A57,FB_7,P$5,0))&IF(TYPE(VLOOKUP($A57,FB_8,P$5,0))=16,\"\",VLOOKUP($A57,FB_8,P$5,0))&IF(TYPE(VLOOKUP($A57,FB_9,P$5,0))=16,\"\",VLOOKUP($A57,FB_9,P$5,0))&IF(TYPE(VLOOKUP($A57,FB_10,P$5,0))=16,\"\",VLOOKUP($A57,FB_10,P$5,0))&IF(TYPE(VLOOKUP($A57,FB_11,P$5,0))=16,\"\",VLOOKUP($A57,FB_11,P$5,0))&IF(TYPE(VLOOKUP($A57,FB_12,P$5,0))=16,\"\",VLOOKUP($A57,FB_12,P$5,0))&IF(TYPE(VLOOKUP($A57,FB_13,P$5,0))=16,\"\",VLOOKUP($A57,FB_13,P$5,0))&IF(TYPE(VLOOKUP($A57,FB_14,P$5,0))=16,\"\",VLOOKUP($A57,FB_14,P$5,0))&IF(TYPE(VLOOKUP($A57,FB_15,P$5,0))=16,\"\",VLOOKUP($A57,FB_15,P$5,0))&IF(TYPE(VLOOKUP($A57,FB_16,P$5,0))=16,\"\",VLOOKUP($A57,FB_16,P$5,0))&IF(TYPE(VLOOKUP($A57,FB_17,P$5,0))=16,\"\",VLOOKUP($A57,FB_17,P$5,0))&IF(TYPE(VLOOKUP($A57,FB_18,P$5,0))=16,\"\",VLOOKUP($A57,FB_18,P$5,0))&IF(TYPE(VLOOKUP($A57,FB_19,P$5,0))=16,\"\",VLOOKUP($A57,FB_19,P$5,0))&IF(TYPE(VLOOKUP($A57,FB_20,P$5,0))=16,\"\",VLOOKUP($A57,FB_20,P$5,0))&IF(TYPE(VLOOKUP($A57,FB_21,P$5,0))=16,\"\",VLOOKUP($A57,FB_21,P$5,0))&IF(TYPE(VLOOKUP($A57,FB_22,P$5,0))=16,\"\",VLOOKUP($A57,FB_22,P$5,0))&IF(TYPE(VLOOKUP($A57,FB_23,P$5,0))=16,\"\",VLOOKUP($A57,FB_23,P$5,0))&IF(TYPE(VLOOKUP($A57,FB_24,P$5,0))=16,\"\",VLOOKUP($A57,FB_24,P$5,0))&IF(TYPE(VLOOKUP($A57,FB_25,P$5,0))=16,\"\",VLOOKUP($A57,FB_25,P$5,0))&IF(TYPE(VLOOKUP($A57,FB_26,P$5,0))=16,\"\",VLOOKUP($A57,FB_26,P$5,0))&IF(TYPE(VLOOKUP($A57,FB_27,P$5,0))=16,\"\",VLOOKUP($A57,FB_27,P$5,0))&IF(TYPE(VLOOKUP($A57,FB_28,P$5,0))=16,\"\",VLOOKUP($A57,FB_28,P$5,0))&IF(TYPE(VLOOKUP($A57,FB_29,P$5,0))=16,\"\",VLOOKUP($A57,FB_29,P$5,0))&IF(TYPE(VLOOKUP($A57,FB_30,P$5,0))=16,\"\",VLOOKUP($A57,FB_30,P$5,0))))","v":""},"",{"$f":"IF($B57=\"\",\"\",_xlfn.NUMBERVALUE(IF(TYPE(VLOOKUP($A57,FB_1,R$5,0))=16,\"\",VLOOKUP($A57,FB_1,R$5,0))&IF(TYPE(VLOOKUP($A57,FB_2,R$5,0))=16,\"\",VLOOKUP($A57,FB_2,R$5,0))&IF(TYPE(VLOOKUP($A57,FB_3,R$5,0))=16,\"\",VLOOKUP($A57,FB_3,R$5,0))&IF(TYPE(VLOOKUP($A57,FB_4,R$5,0))=16,\"\",VLOOKUP($A57,FB_4,R$5,0))&IF(TYPE(VLOOKUP($A57,FB_5,R$5,0))=16,\"\",VLOOKUP($A57,FB_5,R$5,0))&IF(TYPE(VLOOKUP($A57,FB_6,R$5,0))=16,\"\",VLOOKUP($A57,FB_6,R$5,0))&IF(TYPE(VLOOKUP($A57,FB_7,R$5,0))=16,\"\",VLOOKUP($A57,FB_7,R$5,0))&IF(TYPE(VLOOKUP($A57,FB_8,R$5,0))=16,\"\",VLOOKUP($A57,FB_8,R$5,0))&IF(TYPE(VLOOKUP($A57,FB_9,R$5,0))=16,\"\",VLOOKUP($A57,FB_9,R$5,0))&IF(TYPE(VLOOKUP($A57,FB_10,R$5,0))=16,\"\",VLOOKUP($A57,FB_10,R$5,0))&IF(TYPE(VLOOKUP($A57,FB_11,R$5,0))=16,\"\",VLOOKUP($A57,FB_11,R$5,0))&IF(TYPE(VLOOKUP($A57,FB_12,R$5,0))=16,\"\",VLOOKUP($A57,FB_12,R$5,0))&IF(TYPE(VLOOKUP($A57,FB_13,R$5,0))=16,\"\",VLOOKUP($A57,FB_13,R$5,0))&IF(TYPE(VLOOKUP($A57,FB_14,R$5,0))=16,\"\",VLOOKUP($A57,FB_14,R$5,0))&IF(TYPE(VLOOKUP($A57,FB_15,R$5,0))=16,\"\",VLOOKUP($A57,FB_15,R$5,0))&IF(TYPE(VLOOKUP($A57,FB_16,R$5,0))=16,\"\",VLOOKUP($A57,FB_16,R$5,0))&IF(TYPE(VLOOKUP($A57,FB_17,R$5,0))=16,\"\",VLOOKUP($A57,FB_17,R$5,0))&IF(TYPE(VLOOKUP($A57,FB_18,R$5,0))=16,\"\",VLOOKUP($A57,FB_18,R$5,0))&IF(TYPE(VLOOKUP($A57,FB_19,R$5,0))=16,\"\",VLOOKUP($A57,FB_19,R$5,0))&IF(TYPE(VLOOKUP($A57,FB_20,R$5,0))=16,\"\",VLOOKUP($A57,FB_20,R$5,0))&IF(TYPE(VLOOKUP($A57,FB_21,R$5,0))=16,\"\",VLOOKUP($A57,FB_21,R$5,0))&IF(TYPE(VLOOKUP($A57,FB_22,R$5,0))=16,\"\",VLOOKUP($A57,FB_22,R$5,0))&IF(TYPE(VLOOKUP($A57,FB_23,R$5,0))=16,\"\",VLOOKUP($A57,FB_23,R$5,0))&IF(TYPE(VLOOKUP($A57,FB_24,R$5,0))=16,\"\",VLOOKUP($A57,FB_24,R$5,0))&IF(TYPE(VLOOKUP($A57,FB_25,R$5,0))=16,\"\",VLOOKUP($A57,FB_25,R$5,0))&IF(TYPE(VLOOKUP($A57,FB_26,R$5,0))=16,\"\",VLOOKUP($A57,FB_26,R$5,0))&IF(TYPE(VLOOKUP($A57,FB_27,R$5,0))=16,\"\",VLOOKUP($A57,FB_27,R$5,0))&IF(TYPE(VLOOKUP($A57,FB_28,R$5,0))=16,\"\",VLOOKUP($A57,FB_28,R$5,0))&IF(TYPE(VLOOKUP($A57,FB_29,R$5,0))=16,\"\",VLOOKUP($A57,FB_29,R$5,0))&IF(TYPE(VLOOKUP($A57,FB_30,R$5,0))=16,\"\",VLOOKUP($A57,FB_30,R$5,0))))","v":""},{"$f":"IF($B57=\"\",\"\",IF(TYPE(VLOOKUP($A57,FB_1,S$5,0))=16,\"\",VLOOKUP($A57,FB_1,S$5,0))&IF(TYPE(VLOOKUP($A57,FB_2,S$5,0))=16,\"\",VLOOKUP($A57,FB_2,S$5,0))&IF(TYPE(VLOOKUP($A57,FB_3,S$5,0))=16,\"\",VLOOKUP($A57,FB_3,S$5,0))&IF(TYPE(VLOOKUP($A57,FB_4,S$5,0))=16,\"\",VLOOKUP($A57,FB_4,S$5,0))&IF(TYPE(VLOOKUP($A57,FB_5,S$5,0))=16,\"\",VLOOKUP($A57,FB_5,S$5,0))&IF(TYPE(VLOOKUP($A57,FB_6,S$5,0))=16,\"\",VLOOKUP($A57,FB_6,S$5,0))&IF(TYPE(VLOOKUP($A57,FB_7,S$5,0))=16,\"\",VLOOKUP($A57,FB_7,S$5,0))&IF(TYPE(VLOOKUP($A57,FB_8,S$5,0))=16,\"\",VLOOKUP($A57,FB_8,S$5,0))&IF(TYPE(VLOOKUP($A57,FB_9,S$5,0))=16,\"\",VLOOKUP($A57,FB_9,S$5,0))&IF(TYPE(VLOOKUP($A57,FB_10,S$5,0))=16,\"\",VLOOKUP($A57,FB_10,S$5,0))&IF(TYPE(VLOOKUP($A57,FB_11,S$5,0))=16,\"\",VLOOKUP($A57,FB_11,S$5,0))&IF(TYPE(VLOOKUP($A57,FB_12,S$5,0))=16,\"\",VLOOKUP($A57,FB_12,S$5,0))&IF(TYPE(VLOOKUP($A57,FB_13,S$5,0))=16,\"\",VLOOKUP($A57,FB_13,S$5,0))&IF(TYPE(VLOOKUP($A57,FB_14,S$5,0))=16,\"\",VLOOKUP($A57,FB_14,S$5,0))&IF(TYPE(VLOOKUP($A57,FB_15,S$5,0))=16,\"\",VLOOKUP($A57,FB_15,S$5,0))&IF(TYPE(VLOOKUP($A57,FB_16,S$5,0))=16,\"\",VLOOKUP($A57,FB_16,S$5,0))&IF(TYPE(VLOOKUP($A57,FB_17,S$5,0))=16,\"\",VLOOKUP($A57,FB_17,S$5,0))&IF(TYPE(VLOOKUP($A57,FB_18,S$5,0))=16,\"\",VLOOKUP($A57,FB_18,S$5,0))&IF(TYPE(VLOOKUP($A57,FB_19,S$5,0))=16,\"\",VLOOKUP($A57,FB_19,S$5,0))&IF(TYPE(VLOOKUP($A57,FB_20,S$5,0))=16,\"\",VLOOKUP($A57,FB_20,S$5,0))&IF(TYPE(VLOOKUP($A57,FB_21,S$5,0))=16,\"\",VLOOKUP($A57,FB_21,S$5,0))&IF(TYPE(VLOOKUP($A57,FB_22,S$5,0))=16,\"\",VLOOKUP($A57,FB_22,S$5,0))&IF(TYPE(VLOOKUP($A57,FB_23,S$5,0))=16,\"\",VLOOKUP($A57,FB_23,S$5,0))&IF(TYPE(VLOOKUP($A57,FB_24,S$5,0))=16,\"\",VLOOKUP($A57,FB_24,S$5,0))&IF(TYPE(VLOOKUP($A57,FB_25,S$5,0))=16,\"\",VLOOKUP($A57,FB_25,S$5,0))&IF(TYPE(VLOOKUP($A57,FB_26,S$5,0))=16,\"\",VLOOKUP($A57,FB_26,S$5,0))&IF(TYPE(VLOOKUP($A57,FB_27,S$5,0))=16,\"\",VLOOKUP($A57,FB_27,S$5,0))&IF(TYPE(VLOOKUP($A57,FB_28,S$5,0))=16,\"\",VLOOKUP($A57,FB_28,S$5,0))&IF(TYPE(VLOOKUP($A57,FB_29,S$5,0))=16,\"\",VLOOKUP($A57,FB_29,S$5,0))&IF(TYPE(VLOOKUP($A57,FB_30,S$5,0))=16,\"\",VLOOKUP($A57,FB_30,S$5,0)))","v":""},null,null,null,null,null,null,null,null,null,null,null,null,null,null,null,null,"",":","","",""]
["29.",{"$f":"IF(TYPE(VLOOKUP($A58,FB_1,2,0))=16,\"\",VLOOKUP($A58,FB_1,2,0))&IF(TYPE(VLOOKUP($A58,FB_2,2,0))=16,\"\",VLOOKUP($A58,FB_2,2,0))&IF(TYPE(VLOOKUP($A58,FB_3,2,0))=16,\"\",VLOOKUP($A58,FB_3,2,0))&IF(TYPE(VLOOKUP($A58,FB_4,2,0))=16,\"\",VLOOKUP($A58,FB_4,2,0))&IF(TYPE(VLOOKUP($A58,FB_5,2,0))=16,\"\",VLOOKUP($A58,FB_5,2,0))&IF(TYPE(VLOOKUP($A58,FB_6,2,0))=16,\"\",VLOOKUP($A58,FB_6,2,0))&IF(TYPE(VLOOKUP($A58,FB_7,2,0))=16,\"\",VLOOKUP($A58,FB_7,2,0))&IF(TYPE(VLOOKUP($A58,FB_8,2,0))=16,\"\",VLOOKUP($A58,FB_8,2,0))&IF(TYPE(VLOOKUP($A58,FB_9,2,0))=16,\"\",VLOOKUP($A58,FB_9,2,0))&IF(TYPE(VLOOKUP($A58,FB_10,2,0))=16,\"\",VLOOKUP($A58,FB_10,2,0))&IF(TYPE(VLOOKUP($A58,FB_11,2,0))=16,\"\",VLOOKUP($A58,FB_11,2,0))&IF(TYPE(VLOOKUP($A58,FB_12,2,0))=16,\"\",VLOOKUP($A58,FB_12,2,0))&IF(TYPE(VLOOKUP($A58,FB_13,2,0))=16,\"\",VLOOKUP($A58,FB_13,2,0))&IF(TYPE(VLOOKUP($A58,FB_14,2,0))=16,\"\",VLOOKUP($A58,FB_14,2,0))&IF(TYPE(VLOOKUP($A58,FB_15,2,0))=16,\"\",VLOOKUP($A58,FB_15,2,0))&IF(TYPE(VLOOKUP($A58,FB_16,2,0))=16,\"\",VLOOKUP($A58,FB_16,2,0))&IF(TYPE(VLOOKUP($A58,FB_17,2,0))=16,\"\",VLOOKUP($A58,FB_17,2,0))&IF(TYPE(VLOOKUP($A58,FB_18,2,0))=16,\"\",VLOOKUP($A58,FB_18,2,0))&IF(TYPE(VLOOKUP($A58,FB_19,2,0))=16,\"\",VLOOKUP($A58,FB_19,2,0))&IF(TYPE(VLOOKUP($A58,FB_20,2,0))=16,\"\",VLOOKUP($A58,FB_20,2,0))&IF(TYPE(VLOOKUP($A58,FB_21,2,0))=16,\"\",VLOOKUP($A58,FB_21,2,0))&IF(TYPE(VLOOKUP($A58,FB_22,2,0))=16,\"\",VLOOKUP($A58,FB_22,2,0))&IF(TYPE(VLOOKUP($A58,FB_23,2,0))=16,\"\",VLOOKUP($A58,FB_23,2,0))&IF(TYPE(VLOOKUP($A58,FB_24,2,0))=16,\"\",VLOOKUP($A58,FB_24,2,0))&IF(TYPE(VLOOKUP($A58,FB_25,2,0))=16,\"\",VLOOKUP($A58,FB_25,2,0))&IF(TYPE(VLOOKUP($A58,FB_26,2,0))=16,\"\",VLOOKUP($A58,FB_26,2,0))&IF(TYPE(VLOOKUP($A58,FB_27,2,0))=16,\"\",VLOOKUP($A58,FB_27,2,0))&IF(TYPE(VLOOKUP($A58,FB_28,2,0))=16,\"\",VLOOKUP($A58,FB_28,2,0))&IF(TYPE(VLOOKUP($A58,FB_29,2,0))=16,\"\",VLOOKUP($A58,FB_29,2,0))&IF(TYPE(VLOOKUP($A58,FB_30,2,0))=16,\"\",VLOOKUP($A58,FB_30,2,0))","v":""},null,{"$f":"IF($B58=\"\",\"\",_xlfn.NUMBERVALUE(IF(TYPE(VLOOKUP($A58,FB_1,P$5,0))=16,\"\",VLOOKUP($A58,FB_1,P$5,0))&IF(TYPE(VLOOKUP($A58,FB_2,P$5,0))=16,\"\",VLOOKUP($A58,FB_2,P$5,0))&IF(TYPE(VLOOKUP($A58,FB_3,P$5,0))=16,\"\",VLOOKUP($A58,FB_3,P$5,0))&IF(TYPE(VLOOKUP($A58,FB_4,P$5,0))=16,\"\",VLOOKUP($A58,FB_4,P$5,0))&IF(TYPE(VLOOKUP($A58,FB_5,P$5,0))=16,\"\",VLOOKUP($A58,FB_5,P$5,0))&IF(TYPE(VLOOKUP($A58,FB_6,P$5,0))=16,\"\",VLOOKUP($A58,FB_6,P$5,0))&IF(TYPE(VLOOKUP($A58,FB_7,P$5,0))=16,\"\",VLOOKUP($A58,FB_7,P$5,0))&IF(TYPE(VLOOKUP($A58,FB_8,P$5,0))=16,\"\",VLOOKUP($A58,FB_8,P$5,0))&IF(TYPE(VLOOKUP($A58,FB_9,P$5,0))=16,\"\",VLOOKUP($A58,FB_9,P$5,0))&IF(TYPE(VLOOKUP($A58,FB_10,P$5,0))=16,\"\",VLOOKUP($A58,FB_10,P$5,0))&IF(TYPE(VLOOKUP($A58,FB_11,P$5,0))=16,\"\",VLOOKUP($A58,FB_11,P$5,0))&IF(TYPE(VLOOKUP($A58,FB_12,P$5,0))=16,\"\",VLOOKUP($A58,FB_12,P$5,0))&IF(TYPE(VLOOKUP($A58,FB_13,P$5,0))=16,\"\",VLOOKUP($A58,FB_13,P$5,0))&IF(TYPE(VLOOKUP($A58,FB_14,P$5,0))=16,\"\",VLOOKUP($A58,FB_14,P$5,0))&IF(TYPE(VLOOKUP($A58,FB_15,P$5,0))=16,\"\",VLOOKUP($A58,FB_15,P$5,0))&IF(TYPE(VLOOKUP($A58,FB_16,P$5,0))=16,\"\",VLOOKUP($A58,FB_16,P$5,0))&IF(TYPE(VLOOKUP($A58,FB_17,P$5,0))=16,\"\",VLOOKUP($A58,FB_17,P$5,0))&IF(TYPE(VLOOKUP($A58,FB_18,P$5,0))=16,\"\",VLOOKUP($A58,FB_18,P$5,0))&IF(TYPE(VLOOKUP($A58,FB_19,P$5,0))=16,\"\",VLOOKUP($A58,FB_19,P$5,0))&IF(TYPE(VLOOKUP($A58,FB_20,P$5,0))=16,\"\",VLOOKUP($A58,FB_20,P$5,0))&IF(TYPE(VLOOKUP($A58,FB_21,P$5,0))=16,\"\",VLOOKUP($A58,FB_21,P$5,0))&IF(TYPE(VLOOKUP($A58,FB_22,P$5,0))=16,\"\",VLOOKUP($A58,FB_22,P$5,0))&IF(TYPE(VLOOKUP($A58,FB_23,P$5,0))=16,\"\",VLOOKUP($A58,FB_23,P$5,0))&IF(TYPE(VLOOKUP($A58,FB_24,P$5,0))=16,\"\",VLOOKUP($A58,FB_24,P$5,0))&IF(TYPE(VLOOKUP($A58,FB_25,P$5,0))=16,\"\",VLOOKUP($A58,FB_25,P$5,0))&IF(TYPE(VLOOKUP($A58,FB_26,P$5,0))=16,\"\",VLOOKUP($A58,FB_26,P$5,0))&IF(TYPE(VLOOKUP($A58,FB_27,P$5,0))=16,\"\",VLOOKUP($A58,FB_27,P$5,0))&IF(TYPE(VLOOKUP($A58,FB_28,P$5,0))=16,\"\",VLOOKUP($A58,FB_28,P$5,0))&IF(TYPE(VLOOKUP($A58,FB_29,P$5,0))=16,\"\",VLOOKUP($A58,FB_29,P$5,0))&IF(TYPE(VLOOKUP($A58,FB_30,P$5,0))=16,\"\",VLOOKUP($A58,FB_30,P$5,0))))","v":""},"",{"$f":"IF($B58=\"\",\"\",_xlfn.NUMBERVALUE(IF(TYPE(VLOOKUP($A58,FB_1,R$5,0))=16,\"\",VLOOKUP($A58,FB_1,R$5,0))&IF(TYPE(VLOOKUP($A58,FB_2,R$5,0))=16,\"\",VLOOKUP($A58,FB_2,R$5,0))&IF(TYPE(VLOOKUP($A58,FB_3,R$5,0))=16,\"\",VLOOKUP($A58,FB_3,R$5,0))&IF(TYPE(VLOOKUP($A58,FB_4,R$5,0))=16,\"\",VLOOKUP($A58,FB_4,R$5,0))&IF(TYPE(VLOOKUP($A58,FB_5,R$5,0))=16,\"\",VLOOKUP($A58,FB_5,R$5,0))&IF(TYPE(VLOOKUP($A58,FB_6,R$5,0))=16,\"\",VLOOKUP($A58,FB_6,R$5,0))&IF(TYPE(VLOOKUP($A58,FB_7,R$5,0))=16,\"\",VLOOKUP($A58,FB_7,R$5,0))&IF(TYPE(VLOOKUP($A58,FB_8,R$5,0))=16,\"\",VLOOKUP($A58,FB_8,R$5,0))&IF(TYPE(VLOOKUP($A58,FB_9,R$5,0))=16,\"\",VLOOKUP($A58,FB_9,R$5,0))&IF(TYPE(VLOOKUP($A58,FB_10,R$5,0))=16,\"\",VLOOKUP($A58,FB_10,R$5,0))&IF(TYPE(VLOOKUP($A58,FB_11,R$5,0))=16,\"\",VLOOKUP($A58,FB_11,R$5,0))&IF(TYPE(VLOOKUP($A58,FB_12,R$5,0))=16,\"\",VLOOKUP($A58,FB_12,R$5,0))&IF(TYPE(VLOOKUP($A58,FB_13,R$5,0))=16,\"\",VLOOKUP($A58,FB_13,R$5,0))&IF(TYPE(VLOOKUP($A58,FB_14,R$5,0))=16,\"\",VLOOKUP($A58,FB_14,R$5,0))&IF(TYPE(VLOOKUP($A58,FB_15,R$5,0))=16,\"\",VLOOKUP($A58,FB_15,R$5,0))&IF(TYPE(VLOOKUP($A58,FB_16,R$5,0))=16,\"\",VLOOKUP($A58,FB_16,R$5,0))&IF(TYPE(VLOOKUP($A58,FB_17,R$5,0))=16,\"\",VLOOKUP($A58,FB_17,R$5,0))&IF(TYPE(VLOOKUP($A58,FB_18,R$5,0))=16,\"\",VLOOKUP($A58,FB_18,R$5,0))&IF(TYPE(VLOOKUP($A58,FB_19,R$5,0))=16,\"\",VLOOKUP($A58,FB_19,R$5,0))&IF(TYPE(VLOOKUP($A58,FB_20,R$5,0))=16,\"\",VLOOKUP($A58,FB_20,R$5,0))&IF(TYPE(VLOOKUP($A58,FB_21,R$5,0))=16,\"\",VLOOKUP($A58,FB_21,R$5,0))&IF(TYPE(VLOOKUP($A58,FB_22,R$5,0))=16,\"\",VLOOKUP($A58,FB_22,R$5,0))&IF(TYPE(VLOOKUP($A58,FB_23,R$5,0))=16,\"\",VLOOKUP($A58,FB_23,R$5,0))&IF(TYPE(VLOOKUP($A58,FB_24,R$5,0))=16,\"\",VLOOKUP($A58,FB_24,R$5,0))&IF(TYPE(VLOOKUP($A58,FB_25,R$5,0))=16,\"\",VLOOKUP($A58,FB_25,R$5,0))&IF(TYPE(VLOOKUP($A58,FB_26,R$5,0))=16,\"\",VLOOKUP($A58,FB_26,R$5,0))&IF(TYPE(VLOOKUP($A58,FB_27,R$5,0))=16,\"\",VLOOKUP($A58,FB_27,R$5,0))&IF(TYPE(VLOOKUP($A58,FB_28,R$5,0))=16,\"\",VLOOKUP($A58,FB_28,R$5,0))&IF(TYPE(VLOOKUP($A58,FB_29,R$5,0))=16,\"\",VLOOKUP($A58,FB_29,R$5,0))&IF(TYPE(VLOOKUP($A58,FB_30,R$5,0))=16,\"\",VLOOKUP($A58,FB_30,R$5,0))))","v":""},{"$f":"IF($B58=\"\",\"\",IF(TYPE(VLOOKUP($A58,FB_1,S$5,0))=16,\"\",VLOOKUP($A58,FB_1,S$5,0))&IF(TYPE(VLOOKUP($A58,FB_2,S$5,0))=16,\"\",VLOOKUP($A58,FB_2,S$5,0))&IF(TYPE(VLOOKUP($A58,FB_3,S$5,0))=16,\"\",VLOOKUP($A58,FB_3,S$5,0))&IF(TYPE(VLOOKUP($A58,FB_4,S$5,0))=16,\"\",VLOOKUP($A58,FB_4,S$5,0))&IF(TYPE(VLOOKUP($A58,FB_5,S$5,0))=16,\"\",VLOOKUP($A58,FB_5,S$5,0))&IF(TYPE(VLOOKUP($A58,FB_6,S$5,0))=16,\"\",VLOOKUP($A58,FB_6,S$5,0))&IF(TYPE(VLOOKUP($A58,FB_7,S$5,0))=16,\"\",VLOOKUP($A58,FB_7,S$5,0))&IF(TYPE(VLOOKUP($A58,FB_8,S$5,0))=16,\"\",VLOOKUP($A58,FB_8,S$5,0))&IF(TYPE(VLOOKUP($A58,FB_9,S$5,0))=16,\"\",VLOOKUP($A58,FB_9,S$5,0))&IF(TYPE(VLOOKUP($A58,FB_10,S$5,0))=16,\"\",VLOOKUP($A58,FB_10,S$5,0))&IF(TYPE(VLOOKUP($A58,FB_11,S$5,0))=16,\"\",VLOOKUP($A58,FB_11,S$5,0))&IF(TYPE(VLOOKUP($A58,FB_12,S$5,0))=16,\"\",VLOOKUP($A58,FB_12,S$5,0))&IF(TYPE(VLOOKUP($A58,FB_13,S$5,0))=16,\"\",VLOOKUP($A58,FB_13,S$5,0))&IF(TYPE(VLOOKUP($A58,FB_14,S$5,0))=16,\"\",VLOOKUP($A58,FB_14,S$5,0))&IF(TYPE(VLOOKUP($A58,FB_15,S$5,0))=16,\"\",VLOOKUP($A58,FB_15,S$5,0))&IF(TYPE(VLOOKUP($A58,FB_16,S$5,0))=16,\"\",VLOOKUP($A58,FB_16,S$5,0))&IF(TYPE(VLOOKUP($A58,FB_17,S$5,0))=16,\"\",VLOOKUP($A58,FB_17,S$5,0))&IF(TYPE(VLOOKUP($A58,FB_18,S$5,0))=16,\"\",VLOOKUP($A58,FB_18,S$5,0))&IF(TYPE(VLOOKUP($A58,FB_19,S$5,0))=16,\"\",VLOOKUP($A58,FB_19,S$5,0))&IF(TYPE(VLOOKUP($A58,FB_20,S$5,0))=16,\"\",VLOOKUP($A58,FB_20,S$5,0))&IF(TYPE(VLOOKUP($A58,FB_21,S$5,0))=16,\"\",VLOOKUP($A58,FB_21,S$5,0))&IF(TYPE(VLOOKUP($A58,FB_22,S$5,0))=16,\"\",VLOOKUP($A58,FB_22,S$5,0))&IF(TYPE(VLOOKUP($A58,FB_23,S$5,0))=16,\"\",VLOOKUP($A58,FB_23,S$5,0))&IF(TYPE(VLOOKUP($A58,FB_24,S$5,0))=16,\"\",VLOOKUP($A58,FB_24,S$5,0))&IF(TYPE(VLOOKUP($A58,FB_25,S$5,0))=16,\"\",VLOOKUP($A58,FB_25,S$5,0))&IF(TYPE(VLOOKUP($A58,FB_26,S$5,0))=16,\"\",VLOOKUP($A58,FB_26,S$5,0))&IF(TYPE(VLOOKUP($A58,FB_27,S$5,0))=16,\"\",VLOOKUP($A58,FB_27,S$5,0))&IF(TYPE(VLOOKUP($A58,FB_28,S$5,0))=16,\"\",VLOOKUP($A58,FB_28,S$5,0))&IF(TYPE(VLOOKUP($A58,FB_29,S$5,0))=16,\"\",VLOOKUP($A58,FB_29,S$5,0))&IF(TYPE(VLOOKUP($A58,FB_30,S$5,0))=16,\"\",VLOOKUP($A58,FB_30,S$5,0)))","v":""},null,null,null,null,null,null,null,null,null,null,null,null,null,null,null,null,"",":","","",""]
["30.",{"$f":"IF(TYPE(VLOOKUP($A59,FB_1,2,0))=16,\"\",VLOOKUP($A59,FB_1,2,0))&IF(TYPE(VLOOKUP($A59,FB_2,2,0))=16,\"\",VLOOKUP($A59,FB_2,2,0))&IF(TYPE(VLOOKUP($A59,FB_3,2,0))=16,\"\",VLOOKUP($A59,FB_3,2,0))&IF(TYPE(VLOOKUP($A59,FB_4,2,0))=16,\"\",VLOOKUP($A59,FB_4,2,0))&IF(TYPE(VLOOKUP($A59,FB_5,2,0))=16,\"\",VLOOKUP($A59,FB_5,2,0))&IF(TYPE(VLOOKUP($A59,FB_6,2,0))=16,\"\",VLOOKUP($A59,FB_6,2,0))&IF(TYPE(VLOOKUP($A59,FB_7,2,0))=16,\"\",VLOOKUP($A59,FB_7,2,0))&IF(TYPE(VLOOKUP($A59,FB_8,2,0))=16,\"\",VLOOKUP($A59,FB_8,2,0))&IF(TYPE(VLOOKUP($A59,FB_9,2,0))=16,\"\",VLOOKUP($A59,FB_9,2,0))&IF(TYPE(VLOOKUP($A59,FB_10,2,0))=16,\"\",VLOOKUP($A59,FB_10,2,0))&IF(TYPE(VLOOKUP($A59,FB_11,2,0))=16,\"\",VLOOKUP($A59,FB_11,2,0))&IF(TYPE(VLOOKUP($A59,FB_12,2,0))=16,\"\",VLOOKUP($A59,FB_12,2,0))&IF(TYPE(VLOOKUP($A59,FB_13,2,0))=16,\"\",VLOOKUP($A59,FB_13,2,0))&IF(TYPE(VLOOKUP($A59,FB_14,2,0))=16,\"\",VLOOKUP($A59,FB_14,2,0))&IF(TYPE(VLOOKUP($A59,FB_15,2,0))=16,\"\",VLOOKUP($A59,FB_15,2,0))&IF(TYPE(VLOOKUP($A59,FB_16,2,0))=16,\"\",VLOOKUP($A59,FB_16,2,0))&IF(TYPE(VLOOKUP($A59,FB_17,2,0))=16,\"\",VLOOKUP($A59,FB_17,2,0))&IF(TYPE(VLOOKUP($A59,FB_18,2,0))=16,\"\",VLOOKUP($A59,FB_18,2,0))&IF(TYPE(VLOOKUP($A59,FB_19,2,0))=16,\"\",VLOOKUP($A59,FB_19,2,0))&IF(TYPE(VLOOKUP($A59,FB_20,2,0))=16,\"\",VLOOKUP($A59,FB_20,2,0))&IF(TYPE(VLOOKUP($A59,FB_21,2,0))=16,\"\",VLOOKUP($A59,FB_21,2,0))&IF(TYPE(VLOOKUP($A59,FB_22,2,0))=16,\"\",VLOOKUP($A59,FB_22,2,0))&IF(TYPE(VLOOKUP($A59,FB_23,2,0))=16,\"\",VLOOKUP($A59,FB_23,2,0))&IF(TYPE(VLOOKUP($A59,FB_24,2,0))=16,\"\",VLOOKUP($A59,FB_24,2,0))&IF(TYPE(VLOOKUP($A59,FB_25,2,0))=16,\"\",VLOOKUP($A59,FB_25,2,0))&IF(TYPE(VLOOKUP($A59,FB_26,2,0))=16,\"\",VLOOKUP($A59,FB_26,2,0))&IF(TYPE(VLOOKUP($A59,FB_27,2,0))=16,\"\",VLOOKUP($A59,FB_27,2,0))&IF(TYPE(VLOOKUP($A59,FB_28,2,0))=16,\"\",VLOOKUP($A59,FB_28,2,0))&IF(TYPE(VLOOKUP($A59,FB_29,2,0))=16,\"\",VLOOKUP($A59,FB_29,2,0))&IF(TYPE(VLOOKUP($A59,FB_30,2,0))=16,\"\",VLOOKUP($A59,FB_30,2,0))","v":""},null,{"$f":"IF($B59=\"\",\"\",_xlfn.NUMBERVALUE(IF(TYPE(VLOOKUP($A59,FB_1,P$5,0))=16,\"\",VLOOKUP($A59,FB_1,P$5,0))&IF(TYPE(VLOOKUP($A59,FB_2,P$5,0))=16,\"\",VLOOKUP($A59,FB_2,P$5,0))&IF(TYPE(VLOOKUP($A59,FB_3,P$5,0))=16,\"\",VLOOKUP($A59,FB_3,P$5,0))&IF(TYPE(VLOOKUP($A59,FB_4,P$5,0))=16,\"\",VLOOKUP($A59,FB_4,P$5,0))&IF(TYPE(VLOOKUP($A59,FB_5,P$5,0))=16,\"\",VLOOKUP($A59,FB_5,P$5,0))&IF(TYPE(VLOOKUP($A59,FB_6,P$5,0))=16,\"\",VLOOKUP($A59,FB_6,P$5,0))&IF(TYPE(VLOOKUP($A59,FB_7,P$5,0))=16,\"\",VLOOKUP($A59,FB_7,P$5,0))&IF(TYPE(VLOOKUP($A59,FB_8,P$5,0))=16,\"\",VLOOKUP($A59,FB_8,P$5,0))&IF(TYPE(VLOOKUP($A59,FB_9,P$5,0))=16,\"\",VLOOKUP($A59,FB_9,P$5,0))&IF(TYPE(VLOOKUP($A59,FB_10,P$5,0))=16,\"\",VLOOKUP($A59,FB_10,P$5,0))&IF(TYPE(VLOOKUP($A59,FB_11,P$5,0))=16,\"\",VLOOKUP($A59,FB_11,P$5,0))&IF(TYPE(VLOOKUP($A59,FB_12,P$5,0))=16,\"\",VLOOKUP($A59,FB_12,P$5,0))&IF(TYPE(VLOOKUP($A59,FB_13,P$5,0))=16,\"\",VLOOKUP($A59,FB_13,P$5,0))&IF(TYPE(VLOOKUP($A59,FB_14,P$5,0))=16,\"\",VLOOKUP($A59,FB_14,P$5,0))&IF(TYPE(VLOOKUP($A59,FB_15,P$5,0))=16,\"\",VLOOKUP($A59,FB_15,P$5,0))&IF(TYPE(VLOOKUP($A59,FB_16,P$5,0))=16,\"\",VLOOKUP($A59,FB_16,P$5,0))&IF(TYPE(VLOOKUP($A59,FB_17,P$5,0))=16,\"\",VLOOKUP($A59,FB_17,P$5,0))&IF(TYPE(VLOOKUP($A59,FB_18,P$5,0))=16,\"\",VLOOKUP($A59,FB_18,P$5,0))&IF(TYPE(VLOOKUP($A59,FB_19,P$5,0))=16,\"\",VLOOKUP($A59,FB_19,P$5,0))&IF(TYPE(VLOOKUP($A59,FB_20,P$5,0))=16,\"\",VLOOKUP($A59,FB_20,P$5,0))&IF(TYPE(VLOOKUP($A59,FB_21,P$5,0))=16,\"\",VLOOKUP($A59,FB_21,P$5,0))&IF(TYPE(VLOOKUP($A59,FB_22,P$5,0))=16,\"\",VLOOKUP($A59,FB_22,P$5,0))&IF(TYPE(VLOOKUP($A59,FB_23,P$5,0))=16,\"\",VLOOKUP($A59,FB_23,P$5,0))&IF(TYPE(VLOOKUP($A59,FB_24,P$5,0))=16,\"\",VLOOKUP($A59,FB_24,P$5,0))&IF(TYPE(VLOOKUP($A59,FB_25,P$5,0))=16,\"\",VLOOKUP($A59,FB_25,P$5,0))&IF(TYPE(VLOOKUP($A59,FB_26,P$5,0))=16,\"\",VLOOKUP($A59,FB_26,P$5,0))&IF(TYPE(VLOOKUP($A59,FB_27,P$5,0))=16,\"\",VLOOKUP($A59,FB_27,P$5,0))&IF(TYPE(VLOOKUP($A59,FB_28,P$5,0))=16,\"\",VLOOKUP($A59,FB_28,P$5,0))&IF(TYPE(VLOOKUP($A59,FB_29,P$5,0))=16,\"\",VLOOKUP($A59,FB_29,P$5,0))&IF(TYPE(VLOOKUP($A59,FB_30,P$5,0))=16,\"\",VLOOKUP($A59,FB_30,P$5,0))))","v":""},"",{"$f":"IF($B59=\"\",\"\",_xlfn.NUMBERVALUE(IF(TYPE(VLOOKUP($A59,FB_1,R$5,0))=16,\"\",VLOOKUP($A59,FB_1,R$5,0))&IF(TYPE(VLOOKUP($A59,FB_2,R$5,0))=16,\"\",VLOOKUP($A59,FB_2,R$5,0))&IF(TYPE(VLOOKUP($A59,FB_3,R$5,0))=16,\"\",VLOOKUP($A59,FB_3,R$5,0))&IF(TYPE(VLOOKUP($A59,FB_4,R$5,0))=16,\"\",VLOOKUP($A59,FB_4,R$5,0))&IF(TYPE(VLOOKUP($A59,FB_5,R$5,0))=16,\"\",VLOOKUP($A59,FB_5,R$5,0))&IF(TYPE(VLOOKUP($A59,FB_6,R$5,0))=16,\"\",VLOOKUP($A59,FB_6,R$5,0))&IF(TYPE(VLOOKUP($A59,FB_7,R$5,0))=16,\"\",VLOOKUP($A59,FB_7,R$5,0))&IF(TYPE(VLOOKUP($A59,FB_8,R$5,0))=16,\"\",VLOOKUP($A59,FB_8,R$5,0))&IF(TYPE(VLOOKUP($A59,FB_9,R$5,0))=16,\"\",VLOOKUP($A59,FB_9,R$5,0))&IF(TYPE(VLOOKUP($A59,FB_10,R$5,0))=16,\"\",VLOOKUP($A59,FB_10,R$5,0))&IF(TYPE(VLOOKUP($A59,FB_11,R$5,0))=16,\"\",VLOOKUP($A59,FB_11,R$5,0))&IF(TYPE(VLOOKUP($A59,FB_12,R$5,0))=16,\"\",VLOOKUP($A59,FB_12,R$5,0))&IF(TYPE(VLOOKUP($A59,FB_13,R$5,0))=16,\"\",VLOOKUP($A59,FB_13,R$5,0))&IF(TYPE(VLOOKUP($A59,FB_14,R$5,0))=16,\"\",VLOOKUP($A59,FB_14,R$5,0))&IF(TYPE(VLOOKUP($A59,FB_15,R$5,0))=16,\"\",VLOOKUP($A59,FB_15,R$5,0))&IF(TYPE(VLOOKUP($A59,FB_16,R$5,0))=16,\"\",VLOOKUP($A59,FB_16,R$5,0))&IF(TYPE(VLOOKUP($A59,FB_17,R$5,0))=16,\"\",VLOOKUP($A59,FB_17,R$5,0))&IF(TYPE(VLOOKUP($A59,FB_18,R$5,0))=16,\"\",VLOOKUP($A59,FB_18,R$5,0))&IF(TYPE(VLOOKUP($A59,FB_19,R$5,0))=16,\"\",VLOOKUP($A59,FB_19,R$5,0))&IF(TYPE(VLOOKUP($A59,FB_20,R$5,0))=16,\"\",VLOOKUP($A59,FB_20,R$5,0))&IF(TYPE(VLOOKUP($A59,FB_21,R$5,0))=16,\"\",VLOOKUP($A59,FB_21,R$5,0))&IF(TYPE(VLOOKUP($A59,FB_22,R$5,0))=16,\"\",VLOOKUP($A59,FB_22,R$5,0))&IF(TYPE(VLOOKUP($A59,FB_23,R$5,0))=16,\"\",VLOOKUP($A59,FB_23,R$5,0))&IF(TYPE(VLOOKUP($A59,FB_24,R$5,0))=16,\"\",VLOOKUP($A59,FB_24,R$5,0))&IF(TYPE(VLOOKUP($A59,FB_25,R$5,0))=16,\"\",VLOOKUP($A59,FB_25,R$5,0))&IF(TYPE(VLOOKUP($A59,FB_26,R$5,0))=16,\"\",VLOOKUP($A59,FB_26,R$5,0))&IF(TYPE(VLOOKUP($A59,FB_27,R$5,0))=16,\"\",VLOOKUP($A59,FB_27,R$5,0))&IF(TYPE(VLOOKUP($A59,FB_28,R$5,0))=16,\"\",VLOOKUP($A59,FB_28,R$5,0))&IF(TYPE(VLOOKUP($A59,FB_29,R$5,0))=16,\"\",VLOOKUP($A59,FB_29,R$5,0))&IF(TYPE(VLOOKUP($A59,FB_30,R$5,0))=16,\"\",VLOOKUP($A59,FB_30,R$5,0))))","v":""},{"$f":"IF($B59=\"\",\"\",IF(TYPE(VLOOKUP($A59,FB_1,S$5,0))=16,\"\",VLOOKUP($A59,FB_1,S$5,0))&IF(TYPE(VLOOKUP($A59,FB_2,S$5,0))=16,\"\",VLOOKUP($A59,FB_2,S$5,0))&IF(TYPE(VLOOKUP($A59,FB_3,S$5,0))=16,\"\",VLOOKUP($A59,FB_3,S$5,0))&IF(TYPE(VLOOKUP($A59,FB_4,S$5,0))=16,\"\",VLOOKUP($A59,FB_4,S$5,0))&IF(TYPE(VLOOKUP($A59,FB_5,S$5,0))=16,\"\",VLOOKUP($A59,FB_5,S$5,0))&IF(TYPE(VLOOKUP($A59,FB_6,S$5,0))=16,\"\",VLOOKUP($A59,FB_6,S$5,0))&IF(TYPE(VLOOKUP($A59,FB_7,S$5,0))=16,\"\",VLOOKUP($A59,FB_7,S$5,0))&IF(TYPE(VLOOKUP($A59,FB_8,S$5,0))=16,\"\",VLOOKUP($A59,FB_8,S$5,0))&IF(TYPE(VLOOKUP($A59,FB_9,S$5,0))=16,\"\",VLOOKUP($A59,FB_9,S$5,0))&IF(TYPE(VLOOKUP($A59,FB_10,S$5,0))=16,\"\",VLOOKUP($A59,FB_10,S$5,0))&IF(TYPE(VLOOKUP($A59,FB_11,S$5,0))=16,\"\",VLOOKUP($A59,FB_11,S$5,0))&IF(TYPE(VLOOKUP($A59,FB_12,S$5,0))=16,\"\",VLOOKUP($A59,FB_12,S$5,0))&IF(TYPE(VLOOKUP($A59,FB_13,S$5,0))=16,\"\",VLOOKUP($A59,FB_13,S$5,0))&IF(TYPE(VLOOKUP($A59,FB_14,S$5,0))=16,\"\",VLOOKUP($A59,FB_14,S$5,0))&IF(TYPE(VLOOKUP($A59,FB_15,S$5,0))=16,\"\",VLOOKUP($A59,FB_15,S$5,0))&IF(TYPE(VLOOKUP($A59,FB_16,S$5,0))=16,\"\",VLOOKUP($A59,FB_16,S$5,0))&IF(TYPE(VLOOKUP($A59,FB_17,S$5,0))=16,\"\",VLOOKUP($A59,FB_17,S$5,0))&IF(TYPE(VLOOKUP($A59,FB_18,S$5,0))=16,\"\",VLOOKUP($A59,FB_18,S$5,0))&IF(TYPE(VLOOKUP($A59,FB_19,S$5,0))=16,\"\",VLOOKUP($A59,FB_19,S$5,0))&IF(TYPE(VLOOKUP($A59,FB_20,S$5,0))=16,\"\",VLOOKUP($A59,FB_20,S$5,0))&IF(TYPE(VLOOKUP($A59,FB_21,S$5,0))=16,\"\",VLOOKUP($A59,FB_21,S$5,0))&IF(TYPE(VLOOKUP($A59,FB_22,S$5,0))=16,\"\",VLOOKUP($A59,FB_22,S$5,0))&IF(TYPE(VLOOKUP($A59,FB_23,S$5,0))=16,\"\",VLOOKUP($A59,FB_23,S$5,0))&IF(TYPE(VLOOKUP($A59,FB_24,S$5,0))=16,\"\",VLOOKUP($A59,FB_24,S$5,0))&IF(TYPE(VLOOKUP($A59,FB_25,S$5,0))=16,\"\",VLOOKUP($A59,FB_25,S$5,0))&IF(TYPE(VLOOKUP($A59,FB_26,S$5,0))=16,\"\",VLOOKUP($A59,FB_26,S$5,0))&IF(TYPE(VLOOKUP($A59,FB_27,S$5,0))=16,\"\",VLOOKUP($A59,FB_27,S$5,0))&IF(TYPE(VLOOKUP($A59,FB_28,S$5,0))=16,\"\",VLOOKUP($A59,FB_28,S$5,0))&IF(TYPE(VLOOKUP($A59,FB_29,S$5,0))=16,\"\",VLOOKUP($A59,FB_29,S$5,0))&IF(TYPE(VLOOKUP($A59,FB_30,S$5,0))=16,\"\",VLOOKUP($A59,FB_30,S$5,0)))","v":""},null,null,null,null,null,null,null,null,null,null,null,null,null,null,null,null,"",":","","",""]
["31.",{"$f":"IF(TYPE(VLOOKUP($A60,FB_1,2,0))=16,\"\",VLOOKUP($A60,FB_1,2,0))&IF(TYPE(VLOOKUP($A60,FB_2,2,0))=16,\"\",VLOOKUP($A60,FB_2,2,0))&IF(TYPE(VLOOKUP($A60,FB_3,2,0))=16,\"\",VLOOKUP($A60,FB_3,2,0))&IF(TYPE(VLOOKUP($A60,FB_4,2,0))=16,\"\",VLOOKUP($A60,FB_4,2,0))&IF(TYPE(VLOOKUP($A60,FB_5,2,0))=16,\"\",VLOOKUP($A60,FB_5,2,0))&IF(TYPE(VLOOKUP($A60,FB_6,2,0))=16,\"\",VLOOKUP($A60,FB_6,2,0))&IF(TYPE(VLOOKUP($A60,FB_7,2,0))=16,\"\",VLOOKUP($A60,FB_7,2,0))&IF(TYPE(VLOOKUP($A60,FB_8,2,0))=16,\"\",VLOOKUP($A60,FB_8,2,0))&IF(TYPE(VLOOKUP($A60,FB_9,2,0))=16,\"\",VLOOKUP($A60,FB_9,2,0))&IF(TYPE(VLOOKUP($A60,FB_10,2,0))=16,\"\",VLOOKUP($A60,FB_10,2,0))&IF(TYPE(VLOOKUP($A60,FB_11,2,0))=16,\"\",VLOOKUP($A60,FB_11,2,0))&IF(TYPE(VLOOKUP($A60,FB_12,2,0))=16,\"\",VLOOKUP($A60,FB_12,2,0))&IF(TYPE(VLOOKUP($A60,FB_13,2,0))=16,\"\",VLOOKUP($A60,FB_13,2,0))&IF(TYPE(VLOOKUP($A60,FB_14,2,0))=16,\"\",VLOOKUP($A60,FB_14,2,0))&IF(TYPE(VLOOKUP($A60,FB_15,2,0))=16,\"\",VLOOKUP($A60,FB_15,2,0))&IF(TYPE(VLOOKUP($A60,FB_16,2,0))=16,\"\",VLOOKUP($A60,FB_16,2,0))&IF(TYPE(VLOOKUP($A60,FB_17,2,0))=16,\"\",VLOOKUP($A60,FB_17,2,0))&IF(TYPE(VLOOKUP($A60,FB_18,2,0))=16,\"\",VLOOKUP($A60,FB_18,2,0))&IF(TYPE(VLOOKUP($A60,FB_19,2,0))=16,\"\",VLOOKUP($A60,FB_19,2,0))&IF(TYPE(VLOOKUP($A60,FB_20,2,0))=16,\"\",VLOOKUP($A60,FB_20,2,0))&IF(TYPE(VLOOKUP($A60,FB_21,2,0))=16,\"\",VLOOKUP($A60,FB_21,2,0))&IF(TYPE(VLOOKUP($A60,FB_22,2,0))=16,\"\",VLOOKUP($A60,FB_22,2,0))&IF(TYPE(VLOOKUP($A60,FB_23,2,0))=16,\"\",VLOOKUP($A60,FB_23,2,0))&IF(TYPE(VLOOKUP($A60,FB_24,2,0))=16,\"\",VLOOKUP($A60,FB_24,2,0))&IF(TYPE(VLOOKUP($A60,FB_25,2,0))=16,\"\",VLOOKUP($A60,FB_25,2,0))&IF(TYPE(VLOOKUP($A60,FB_26,2,0))=16,\"\",VLOOKUP($A60,FB_26,2,0))&IF(TYPE(VLOOKUP($A60,FB_27,2,0))=16,\"\",VLOOKUP($A60,FB_27,2,0))&IF(TYPE(VLOOKUP($A60,FB_28,2,0))=16,\"\",VLOOKUP($A60,FB_28,2,0))&IF(TYPE(VLOOKUP($A60,FB_29,2,0))=16,\"\",VLOOKUP($A60,FB_29,2,0))&IF(TYPE(VLOOKUP($A60,FB_30,2,0))=16,\"\",VLOOKUP($A60,FB_30,2,0))","v":""},null,{"$f":"IF($B60=\"\",\"\",_xlfn.NUMBERVALUE(IF(TYPE(VLOOKUP($A60,FB_1,P$5,0))=16,\"\",VLOOKUP($A60,FB_1,P$5,0))&IF(TYPE(VLOOKUP($A60,FB_2,P$5,0))=16,\"\",VLOOKUP($A60,FB_2,P$5,0))&IF(TYPE(VLOOKUP($A60,FB_3,P$5,0))=16,\"\",VLOOKUP($A60,FB_3,P$5,0))&IF(TYPE(VLOOKUP($A60,FB_4,P$5,0))=16,\"\",VLOOKUP($A60,FB_4,P$5,0))&IF(TYPE(VLOOKUP($A60,FB_5,P$5,0))=16,\"\",VLOOKUP($A60,FB_5,P$5,0))&IF(TYPE(VLOOKUP($A60,FB_6,P$5,0))=16,\"\",VLOOKUP($A60,FB_6,P$5,0))&IF(TYPE(VLOOKUP($A60,FB_7,P$5,0))=16,\"\",VLOOKUP($A60,FB_7,P$5,0))&IF(TYPE(VLOOKUP($A60,FB_8,P$5,0))=16,\"\",VLOOKUP($A60,FB_8,P$5,0))&IF(TYPE(VLOOKUP($A60,FB_9,P$5,0))=16,\"\",VLOOKUP($A60,FB_9,P$5,0))&IF(TYPE(VLOOKUP($A60,FB_10,P$5,0))=16,\"\",VLOOKUP($A60,FB_10,P$5,0))&IF(TYPE(VLOOKUP($A60,FB_11,P$5,0))=16,\"\",VLOOKUP($A60,FB_11,P$5,0))&IF(TYPE(VLOOKUP($A60,FB_12,P$5,0))=16,\"\",VLOOKUP($A60,FB_12,P$5,0))&IF(TYPE(VLOOKUP($A60,FB_13,P$5,0))=16,\"\",VLOOKUP($A60,FB_13,P$5,0))&IF(TYPE(VLOOKUP($A60,FB_14,P$5,0))=16,\"\",VLOOKUP($A60,FB_14,P$5,0))&IF(TYPE(VLOOKUP($A60,FB_15,P$5,0))=16,\"\",VLOOKUP($A60,FB_15,P$5,0))&IF(TYPE(VLOOKUP($A60,FB_16,P$5,0))=16,\"\",VLOOKUP($A60,FB_16,P$5,0))&IF(TYPE(VLOOKUP($A60,FB_17,P$5,0))=16,\"\",VLOOKUP($A60,FB_17,P$5,0))&IF(TYPE(VLOOKUP($A60,FB_18,P$5,0))=16,\"\",VLOOKUP($A60,FB_18,P$5,0))&IF(TYPE(VLOOKUP($A60,FB_19,P$5,0))=16,\"\",VLOOKUP($A60,FB_19,P$5,0))&IF(TYPE(VLOOKUP($A60,FB_20,P$5,0))=16,\"\",VLOOKUP($A60,FB_20,P$5,0))&IF(TYPE(VLOOKUP($A60,FB_21,P$5,0))=16,\"\",VLOOKUP($A60,FB_21,P$5,0))&IF(TYPE(VLOOKUP($A60,FB_22,P$5,0))=16,\"\",VLOOKUP($A60,FB_22,P$5,0))&IF(TYPE(VLOOKUP($A60,FB_23,P$5,0))=16,\"\",VLOOKUP($A60,FB_23,P$5,0))&IF(TYPE(VLOOKUP($A60,FB_24,P$5,0))=16,\"\",VLOOKUP($A60,FB_24,P$5,0))&IF(TYPE(VLOOKUP($A60,FB_25,P$5,0))=16,\"\",VLOOKUP($A60,FB_25,P$5,0))&IF(TYPE(VLOOKUP($A60,FB_26,P$5,0))=16,\"\",VLOOKUP($A60,FB_26,P$5,0))&IF(TYPE(VLOOKUP($A60,FB_27,P$5,0))=16,\"\",VLOOKUP($A60,FB_27,P$5,0))&IF(TYPE(VLOOKUP($A60,FB_28,P$5,0))=16,\"\",VLOOKUP($A60,FB_28,P$5,0))&IF(TYPE(VLOOKUP($A60,FB_29,P$5,0))=16,\"\",VLOOKUP($A60,FB_29,P$5,0))&IF(TYPE(VLOOKUP($A60,FB_30,P$5,0))=16,\"\",VLOOKUP($A60,FB_30,P$5,0))))","v":""},"",{"$f":"IF($B60=\"\",\"\",_xlfn.NUMBERVALUE(IF(TYPE(VLOOKUP($A60,FB_1,R$5,0))=16,\"\",VLOOKUP($A60,FB_1,R$5,0))&IF(TYPE(VLOOKUP($A60,FB_2,R$5,0))=16,\"\",VLOOKUP($A60,FB_2,R$5,0))&IF(TYPE(VLOOKUP($A60,FB_3,R$5,0))=16,\"\",VLOOKUP($A60,FB_3,R$5,0))&IF(TYPE(VLOOKUP($A60,FB_4,R$5,0))=16,\"\",VLOOKUP($A60,FB_4,R$5,0))&IF(TYPE(VLOOKUP($A60,FB_5,R$5,0))=16,\"\",VLOOKUP($A60,FB_5,R$5,0))&IF(TYPE(VLOOKUP($A60,FB_6,R$5,0))=16,\"\",VLOOKUP($A60,FB_6,R$5,0))&IF(TYPE(VLOOKUP($A60,FB_7,R$5,0))=16,\"\",VLOOKUP($A60,FB_7,R$5,0))&IF(TYPE(VLOOKUP($A60,FB_8,R$5,0))=16,\"\",VLOOKUP($A60,FB_8,R$5,0))&IF(TYPE(VLOOKUP($A60,FB_9,R$5,0))=16,\"\",VLOOKUP($A60,FB_9,R$5,0))&IF(TYPE(VLOOKUP($A60,FB_10,R$5,0))=16,\"\",VLOOKUP($A60,FB_10,R$5,0))&IF(TYPE(VLOOKUP($A60,FB_11,R$5,0))=16,\"\",VLOOKUP($A60,FB_11,R$5,0))&IF(TYPE(VLOOKUP($A60,FB_12,R$5,0))=16,\"\",VLOOKUP($A60,FB_12,R$5,0))&IF(TYPE(VLOOKUP($A60,FB_13,R$5,0))=16,\"\",VLOOKUP($A60,FB_13,R$5,0))&IF(TYPE(VLOOKUP($A60,FB_14,R$5,0))=16,\"\",VLOOKUP($A60,FB_14,R$5,0))&IF(TYPE(VLOOKUP($A60,FB_15,R$5,0))=16,\"\",VLOOKUP($A60,FB_15,R$5,0))&IF(TYPE(VLOOKUP($A60,FB_16,R$5,0))=16,\"\",VLOOKUP($A60,FB_16,R$5,0))&IF(TYPE(VLOOKUP($A60,FB_17,R$5,0))=16,\"\",VLOOKUP($A60,FB_17,R$5,0))&IF(TYPE(VLOOKUP($A60,FB_18,R$5,0))=16,\"\",VLOOKUP($A60,FB_18,R$5,0))&IF(TYPE(VLOOKUP($A60,FB_19,R$5,0))=16,\"\",VLOOKUP($A60,FB_19,R$5,0))&IF(TYPE(VLOOKUP($A60,FB_20,R$5,0))=16,\"\",VLOOKUP($A60,FB_20,R$5,0))&IF(TYPE(VLOOKUP($A60,FB_21,R$5,0))=16,\"\",VLOOKUP($A60,FB_21,R$5,0))&IF(TYPE(VLOOKUP($A60,FB_22,R$5,0))=16,\"\",VLOOKUP($A60,FB_22,R$5,0))&IF(TYPE(VLOOKUP($A60,FB_23,R$5,0))=16,\"\",VLOOKUP($A60,FB_23,R$5,0))&IF(TYPE(VLOOKUP($A60,FB_24,R$5,0))=16,\"\",VLOOKUP($A60,FB_24,R$5,0))&IF(TYPE(VLOOKUP($A60,FB_25,R$5,0))=16,\"\",VLOOKUP($A60,FB_25,R$5,0))&IF(TYPE(VLOOKUP($A60,FB_26,R$5,0))=16,\"\",VLOOKUP($A60,FB_26,R$5,0))&IF(TYPE(VLOOKUP($A60,FB_27,R$5,0))=16,\"\",VLOOKUP($A60,FB_27,R$5,0))&IF(TYPE(VLOOKUP($A60,FB_28,R$5,0))=16,\"\",VLOOKUP($A60,FB_28,R$5,0))&IF(TYPE(VLOOKUP($A60,FB_29,R$5,0))=16,\"\",VLOOKUP($A60,FB_29,R$5,0))&IF(TYPE(VLOOKUP($A60,FB_30,R$5,0))=16,\"\",VLOOKUP($A60,FB_30,R$5,0))))","v":""},{"$f":"IF($B60=\"\",\"\",IF(TYPE(VLOOKUP($A60,FB_1,S$5,0))=16,\"\",VLOOKUP($A60,FB_1,S$5,0))&IF(TYPE(VLOOKUP($A60,FB_2,S$5,0))=16,\"\",VLOOKUP($A60,FB_2,S$5,0))&IF(TYPE(VLOOKUP($A60,FB_3,S$5,0))=16,\"\",VLOOKUP($A60,FB_3,S$5,0))&IF(TYPE(VLOOKUP($A60,FB_4,S$5,0))=16,\"\",VLOOKUP($A60,FB_4,S$5,0))&IF(TYPE(VLOOKUP($A60,FB_5,S$5,0))=16,\"\",VLOOKUP($A60,FB_5,S$5,0))&IF(TYPE(VLOOKUP($A60,FB_6,S$5,0))=16,\"\",VLOOKUP($A60,FB_6,S$5,0))&IF(TYPE(VLOOKUP($A60,FB_7,S$5,0))=16,\"\",VLOOKUP($A60,FB_7,S$5,0))&IF(TYPE(VLOOKUP($A60,FB_8,S$5,0))=16,\"\",VLOOKUP($A60,FB_8,S$5,0))&IF(TYPE(VLOOKUP($A60,FB_9,S$5,0))=16,\"\",VLOOKUP($A60,FB_9,S$5,0))&IF(TYPE(VLOOKUP($A60,FB_10,S$5,0))=16,\"\",VLOOKUP($A60,FB_10,S$5,0))&IF(TYPE(VLOOKUP($A60,FB_11,S$5,0))=16,\"\",VLOOKUP($A60,FB_11,S$5,0))&IF(TYPE(VLOOKUP($A60,FB_12,S$5,0))=16,\"\",VLOOKUP($A60,FB_12,S$5,0))&IF(TYPE(VLOOKUP($A60,FB_13,S$5,0))=16,\"\",VLOOKUP($A60,FB_13,S$5,0))&IF(TYPE(VLOOKUP($A60,FB_14,S$5,0))=16,\"\",VLOOKUP($A60,FB_14,S$5,0))&IF(TYPE(VLOOKUP($A60,FB_15,S$5,0))=16,\"\",VLOOKUP($A60,FB_15,S$5,0))&IF(TYPE(VLOOKUP($A60,FB_16,S$5,0))=16,\"\",VLOOKUP($A60,FB_16,S$5,0))&IF(TYPE(VLOOKUP($A60,FB_17,S$5,0))=16,\"\",VLOOKUP($A60,FB_17,S$5,0))&IF(TYPE(VLOOKUP($A60,FB_18,S$5,0))=16,\"\",VLOOKUP($A60,FB_18,S$5,0))&IF(TYPE(VLOOKUP($A60,FB_19,S$5,0))=16,\"\",VLOOKUP($A60,FB_19,S$5,0))&IF(TYPE(VLOOKUP($A60,FB_20,S$5,0))=16,\"\",VLOOKUP($A60,FB_20,S$5,0))&IF(TYPE(VLOOKUP($A60,FB_21,S$5,0))=16,\"\",VLOOKUP($A60,FB_21,S$5,0))&IF(TYPE(VLOOKUP($A60,FB_22,S$5,0))=16,\"\",VLOOKUP($A60,FB_22,S$5,0))&IF(TYPE(VLOOKUP($A60,FB_23,S$5,0))=16,\"\",VLOOKUP($A60,FB_23,S$5,0))&IF(TYPE(VLOOKUP($A60,FB_24,S$5,0))=16,\"\",VLOOKUP($A60,FB_24,S$5,0))&IF(TYPE(VLOOKUP($A60,FB_25,S$5,0))=16,\"\",VLOOKUP($A60,FB_25,S$5,0))&IF(TYPE(VLOOKUP($A60,FB_26,S$5,0))=16,\"\",VLOOKUP($A60,FB_26,S$5,0))&IF(TYPE(VLOOKUP($A60,FB_27,S$5,0))=16,\"\",VLOOKUP($A60,FB_27,S$5,0))&IF(TYPE(VLOOKUP($A60,FB_28,S$5,0))=16,\"\",VLOOKUP($A60,FB_28,S$5,0))&IF(TYPE(VLOOKUP($A60,FB_29,S$5,0))=16,\"\",VLOOKUP($A60,FB_29,S$5,0))&IF(TYPE(VLOOKUP($A60,FB_30,S$5,0))=16,\"\",VLOOKUP($A60,FB_30,S$5,0)))","v":""},null,null,null,null,null,null,null,null,null,null,null,null,null,null,null,null,"",":","","",""]
["32.",{"$f":"IF(TYPE(VLOOKUP($A61,FB_1,2,0))=16,\"\",VLOOKUP($A61,FB_1,2,0))&IF(TYPE(VLOOKUP($A61,FB_2,2,0))=16,\"\",VLOOKUP($A61,FB_2,2,0))&IF(TYPE(VLOOKUP($A61,FB_3,2,0))=16,\"\",VLOOKUP($A61,FB_3,2,0))&IF(TYPE(VLOOKUP($A61,FB_4,2,0))=16,\"\",VLOOKUP($A61,FB_4,2,0))&IF(TYPE(VLOOKUP($A61,FB_5,2,0))=16,\"\",VLOOKUP($A61,FB_5,2,0))&IF(TYPE(VLOOKUP($A61,FB_6,2,0))=16,\"\",VLOOKUP($A61,FB_6,2,0))&IF(TYPE(VLOOKUP($A61,FB_7,2,0))=16,\"\",VLOOKUP($A61,FB_7,2,0))&IF(TYPE(VLOOKUP($A61,FB_8,2,0))=16,\"\",VLOOKUP($A61,FB_8,2,0))&IF(TYPE(VLOOKUP($A61,FB_9,2,0))=16,\"\",VLOOKUP($A61,FB_9,2,0))&IF(TYPE(VLOOKUP($A61,FB_10,2,0))=16,\"\",VLOOKUP($A61,FB_10,2,0))&IF(TYPE(VLOOKUP($A61,FB_11,2,0))=16,\"\",VLOOKUP($A61,FB_11,2,0))&IF(TYPE(VLOOKUP($A61,FB_12,2,0))=16,\"\",VLOOKUP($A61,FB_12,2,0))&IF(TYPE(VLOOKUP($A61,FB_13,2,0))=16,\"\",VLOOKUP($A61,FB_13,2,0))&IF(TYPE(VLOOKUP($A61,FB_14,2,0))=16,\"\",VLOOKUP($A61,FB_14,2,0))&IF(TYPE(VLOOKUP($A61,FB_15,2,0))=16,\"\",VLOOKUP($A61,FB_15,2,0))&IF(TYPE(VLOOKUP($A61,FB_16,2,0))=16,\"\",VLOOKUP($A61,FB_16,2,0))&IF(TYPE(VLOOKUP($A61,FB_17,2,0))=16,\"\",VLOOKUP($A61,FB_17,2,0))&IF(TYPE(VLOOKUP($A61,FB_18,2,0))=16,\"\",VLOOKUP($A61,FB_18,2,0))&IF(TYPE(VLOOKUP($A61,FB_19,2,0))=16,\"\",VLOOKUP($A61,FB_19,2,0))&IF(TYPE(VLOOKUP($A61,FB_20,2,0))=16,\"\",VLOOKUP($A61,FB_20,2,0))&IF(TYPE(VLOOKUP($A61,FB_21,2,0))=16,\"\",VLOOKUP($A61,FB_21,2,0))&IF(TYPE(VLOOKUP($A61,FB_22,2,0))=16,\"\",VLOOKUP($A61,FB_22,2,0))&IF(TYPE(VLOOKUP($A61,FB_23,2,0))=16,\"\",VLOOKUP($A61,FB_23,2,0))&IF(TYPE(VLOOKUP($A61,FB_24,2,0))=16,\"\",VLOOKUP($A61,FB_24,2,0))&IF(TYPE(VLOOKUP($A61,FB_25,2,0))=16,\"\",VLOOKUP($A61,FB_25,2,0))&IF(TYPE(VLOOKUP($A61,FB_26,2,0))=16,\"\",VLOOKUP($A61,FB_26,2,0))&IF(TYPE(VLOOKUP($A61,FB_27,2,0))=16,\"\",VLOOKUP($A61,FB_27,2,0))&IF(TYPE(VLOOKUP($A61,FB_28,2,0))=16,\"\",VLOOKUP($A61,FB_28,2,0))&IF(TYPE(VLOOKUP($A61,FB_29,2,0))=16,\"\",VLOOKUP($A61,FB_29,2,0))&IF(TYPE(VLOOKUP($A61,FB_30,2,0))=16,\"\",VLOOKUP($A61,FB_30,2,0))","v":""},null,{"$f":"IF($B61=\"\",\"\",_xlfn.NUMBERVALUE(IF(TYPE(VLOOKUP($A61,FB_1,P$5,0))=16,\"\",VLOOKUP($A61,FB_1,P$5,0))&IF(TYPE(VLOOKUP($A61,FB_2,P$5,0))=16,\"\",VLOOKUP($A61,FB_2,P$5,0))&IF(TYPE(VLOOKUP($A61,FB_3,P$5,0))=16,\"\",VLOOKUP($A61,FB_3,P$5,0))&IF(TYPE(VLOOKUP($A61,FB_4,P$5,0))=16,\"\",VLOOKUP($A61,FB_4,P$5,0))&IF(TYPE(VLOOKUP($A61,FB_5,P$5,0))=16,\"\",VLOOKUP($A61,FB_5,P$5,0))&IF(TYPE(VLOOKUP($A61,FB_6,P$5,0))=16,\"\",VLOOKUP($A61,FB_6,P$5,0))&IF(TYPE(VLOOKUP($A61,FB_7,P$5,0))=16,\"\",VLOOKUP($A61,FB_7,P$5,0))&IF(TYPE(VLOOKUP($A61,FB_8,P$5,0))=16,\"\",VLOOKUP($A61,FB_8,P$5,0))&IF(TYPE(VLOOKUP($A61,FB_9,P$5,0))=16,\"\",VLOOKUP($A61,FB_9,P$5,0))&IF(TYPE(VLOOKUP($A61,FB_10,P$5,0))=16,\"\",VLOOKUP($A61,FB_10,P$5,0))&IF(TYPE(VLOOKUP($A61,FB_11,P$5,0))=16,\"\",VLOOKUP($A61,FB_11,P$5,0))&IF(TYPE(VLOOKUP($A61,FB_12,P$5,0))=16,\"\",VLOOKUP($A61,FB_12,P$5,0))&IF(TYPE(VLOOKUP($A61,FB_13,P$5,0))=16,\"\",VLOOKUP($A61,FB_13,P$5,0))&IF(TYPE(VLOOKUP($A61,FB_14,P$5,0))=16,\"\",VLOOKUP($A61,FB_14,P$5,0))&IF(TYPE(VLOOKUP($A61,FB_15,P$5,0))=16,\"\",VLOOKUP($A61,FB_15,P$5,0))&IF(TYPE(VLOOKUP($A61,FB_16,P$5,0))=16,\"\",VLOOKUP($A61,FB_16,P$5,0))&IF(TYPE(VLOOKUP($A61,FB_17,P$5,0))=16,\"\",VLOOKUP($A61,FB_17,P$5,0))&IF(TYPE(VLOOKUP($A61,FB_18,P$5,0))=16,\"\",VLOOKUP($A61,FB_18,P$5,0))&IF(TYPE(VLOOKUP($A61,FB_19,P$5,0))=16,\"\",VLOOKUP($A61,FB_19,P$5,0))&IF(TYPE(VLOOKUP($A61,FB_20,P$5,0))=16,\"\",VLOOKUP($A61,FB_20,P$5,0))&IF(TYPE(VLOOKUP($A61,FB_21,P$5,0))=16,\"\",VLOOKUP($A61,FB_21,P$5,0))&IF(TYPE(VLOOKUP($A61,FB_22,P$5,0))=16,\"\",VLOOKUP($A61,FB_22,P$5,0))&IF(TYPE(VLOOKUP($A61,FB_23,P$5,0))=16,\"\",VLOOKUP($A61,FB_23,P$5,0))&IF(TYPE(VLOOKUP($A61,FB_24,P$5,0))=16,\"\",VLOOKUP($A61,FB_24,P$5,0))&IF(TYPE(VLOOKUP($A61,FB_25,P$5,0))=16,\"\",VLOOKUP($A61,FB_25,P$5,0))&IF(TYPE(VLOOKUP($A61,FB_26,P$5,0))=16,\"\",VLOOKUP($A61,FB_26,P$5,0))&IF(TYPE(VLOOKUP($A61,FB_27,P$5,0))=16,\"\",VLOOKUP($A61,FB_27,P$5,0))&IF(TYPE(VLOOKUP($A61,FB_28,P$5,0))=16,\"\",VLOOKUP($A61,FB_28,P$5,0))&IF(TYPE(VLOOKUP($A61,FB_29,P$5,0))=16,\"\",VLOOKUP($A61,FB_29,P$5,0))&IF(TYPE(VLOOKUP($A61,FB_30,P$5,0))=16,\"\",VLOOKUP($A61,FB_30,P$5,0))))","v":""},"",{"$f":"IF($B61=\"\",\"\",_xlfn.NUMBERVALUE(IF(TYPE(VLOOKUP($A61,FB_1,R$5,0))=16,\"\",VLOOKUP($A61,FB_1,R$5,0))&IF(TYPE(VLOOKUP($A61,FB_2,R$5,0))=16,\"\",VLOOKUP($A61,FB_2,R$5,0))&IF(TYPE(VLOOKUP($A61,FB_3,R$5,0))=16,\"\",VLOOKUP($A61,FB_3,R$5,0))&IF(TYPE(VLOOKUP($A61,FB_4,R$5,0))=16,\"\",VLOOKUP($A61,FB_4,R$5,0))&IF(TYPE(VLOOKUP($A61,FB_5,R$5,0))=16,\"\",VLOOKUP($A61,FB_5,R$5,0))&IF(TYPE(VLOOKUP($A61,FB_6,R$5,0))=16,\"\",VLOOKUP($A61,FB_6,R$5,0))&IF(TYPE(VLOOKUP($A61,FB_7,R$5,0))=16,\"\",VLOOKUP($A61,FB_7,R$5,0))&IF(TYPE(VLOOKUP($A61,FB_8,R$5,0))=16,\"\",VLOOKUP($A61,FB_8,R$5,0))&IF(TYPE(VLOOKUP($A61,FB_9,R$5,0))=16,\"\",VLOOKUP($A61,FB_9,R$5,0))&IF(TYPE(VLOOKUP($A61,FB_10,R$5,0))=16,\"\",VLOOKUP($A61,FB_10,R$5,0))&IF(TYPE(VLOOKUP($A61,FB_11,R$5,0))=16,\"\",VLOOKUP($A61,FB_11,R$5,0))&IF(TYPE(VLOOKUP($A61,FB_12,R$5,0))=16,\"\",VLOOKUP($A61,FB_12,R$5,0))&IF(TYPE(VLOOKUP($A61,FB_13,R$5,0))=16,\"\",VLOOKUP($A61,FB_13,R$5,0))&IF(TYPE(VLOOKUP($A61,FB_14,R$5,0))=16,\"\",VLOOKUP($A61,FB_14,R$5,0))&IF(TYPE(VLOOKUP($A61,FB_15,R$5,0))=16,\"\",VLOOKUP($A61,FB_15,R$5,0))&IF(TYPE(VLOOKUP($A61,FB_16,R$5,0))=16,\"\",VLOOKUP($A61,FB_16,R$5,0))&IF(TYPE(VLOOKUP($A61,FB_17,R$5,0))=16,\"\",VLOOKUP($A61,FB_17,R$5,0))&IF(TYPE(VLOOKUP($A61,FB_18,R$5,0))=16,\"\",VLOOKUP($A61,FB_18,R$5,0))&IF(TYPE(VLOOKUP($A61,FB_19,R$5,0))=16,\"\",VLOOKUP($A61,FB_19,R$5,0))&IF(TYPE(VLOOKUP($A61,FB_20,R$5,0))=16,\"\",VLOOKUP($A61,FB_20,R$5,0))&IF(TYPE(VLOOKUP($A61,FB_21,R$5,0))=16,\"\",VLOOKUP($A61,FB_21,R$5,0))&IF(TYPE(VLOOKUP($A61,FB_22,R$5,0))=16,\"\",VLOOKUP($A61,FB_22,R$5,0))&IF(TYPE(VLOOKUP($A61,FB_23,R$5,0))=16,\"\",VLOOKUP($A61,FB_23,R$5,0))&IF(TYPE(VLOOKUP($A61,FB_24,R$5,0))=16,\"\",VLOOKUP($A61,FB_24,R$5,0))&IF(TYPE(VLOOKUP($A61,FB_25,R$5,0))=16,\"\",VLOOKUP($A61,FB_25,R$5,0))&IF(TYPE(VLOOKUP($A61,FB_26,R$5,0))=16,\"\",VLOOKUP($A61,FB_26,R$5,0))&IF(TYPE(VLOOKUP($A61,FB_27,R$5,0))=16,\"\",VLOOKUP($A61,FB_27,R$5,0))&IF(TYPE(VLOOKUP($A61,FB_28,R$5,0))=16,\"\",VLOOKUP($A61,FB_28,R$5,0))&IF(TYPE(VLOOKUP($A61,FB_29,R$5,0))=16,\"\",VLOOKUP($A61,FB_29,R$5,0))&IF(TYPE(VLOOKUP($A61,FB_30,R$5,0))=16,\"\",VLOOKUP($A61,FB_30,R$5,0))))","v":""},{"$f":"IF($B61=\"\",\"\",IF(TYPE(VLOOKUP($A61,FB_1,S$5,0))=16,\"\",VLOOKUP($A61,FB_1,S$5,0))&IF(TYPE(VLOOKUP($A61,FB_2,S$5,0))=16,\"\",VLOOKUP($A61,FB_2,S$5,0))&IF(TYPE(VLOOKUP($A61,FB_3,S$5,0))=16,\"\",VLOOKUP($A61,FB_3,S$5,0))&IF(TYPE(VLOOKUP($A61,FB_4,S$5,0))=16,\"\",VLOOKUP($A61,FB_4,S$5,0))&IF(TYPE(VLOOKUP($A61,FB_5,S$5,0))=16,\"\",VLOOKUP($A61,FB_5,S$5,0))&IF(TYPE(VLOOKUP($A61,FB_6,S$5,0))=16,\"\",VLOOKUP($A61,FB_6,S$5,0))&IF(TYPE(VLOOKUP($A61,FB_7,S$5,0))=16,\"\",VLOOKUP($A61,FB_7,S$5,0))&IF(TYPE(VLOOKUP($A61,FB_8,S$5,0))=16,\"\",VLOOKUP($A61,FB_8,S$5,0))&IF(TYPE(VLOOKUP($A61,FB_9,S$5,0))=16,\"\",VLOOKUP($A61,FB_9,S$5,0))&IF(TYPE(VLOOKUP($A61,FB_10,S$5,0))=16,\"\",VLOOKUP($A61,FB_10,S$5,0))&IF(TYPE(VLOOKUP($A61,FB_11,S$5,0))=16,\"\",VLOOKUP($A61,FB_11,S$5,0))&IF(TYPE(VLOOKUP($A61,FB_12,S$5,0))=16,\"\",VLOOKUP($A61,FB_12,S$5,0))&IF(TYPE(VLOOKUP($A61,FB_13,S$5,0))=16,\"\",VLOOKUP($A61,FB_13,S$5,0))&IF(TYPE(VLOOKUP($A61,FB_14,S$5,0))=16,\"\",VLOOKUP($A61,FB_14,S$5,0))&IF(TYPE(VLOOKUP($A61,FB_15,S$5,0))=16,\"\",VLOOKUP($A61,FB_15,S$5,0))&IF(TYPE(VLOOKUP($A61,FB_16,S$5,0))=16,\"\",VLOOKUP($A61,FB_16,S$5,0))&IF(TYPE(VLOOKUP($A61,FB_17,S$5,0))=16,\"\",VLOOKUP($A61,FB_17,S$5,0))&IF(TYPE(VLOOKUP($A61,FB_18,S$5,0))=16,\"\",VLOOKUP($A61,FB_18,S$5,0))&IF(TYPE(VLOOKUP($A61,FB_19,S$5,0))=16,\"\",VLOOKUP($A61,FB_19,S$5,0))&IF(TYPE(VLOOKUP($A61,FB_20,S$5,0))=16,\"\",VLOOKUP($A61,FB_20,S$5,0))&IF(TYPE(VLOOKUP($A61,FB_21,S$5,0))=16,\"\",VLOOKUP($A61,FB_21,S$5,0))&IF(TYPE(VLOOKUP($A61,FB_22,S$5,0))=16,\"\",VLOOKUP($A61,FB_22,S$5,0))&IF(TYPE(VLOOKUP($A61,FB_23,S$5,0))=16,\"\",VLOOKUP($A61,FB_23,S$5,0))&IF(TYPE(VLOOKUP($A61,FB_24,S$5,0))=16,\"\",VLOOKUP($A61,FB_24,S$5,0))&IF(TYPE(VLOOKUP($A61,FB_25,S$5,0))=16,\"\",VLOOKUP($A61,FB_25,S$5,0))&IF(TYPE(VLOOKUP($A61,FB_26,S$5,0))=16,\"\",VLOOKUP($A61,FB_26,S$5,0))&IF(TYPE(VLOOKUP($A61,FB_27,S$5,0))=16,\"\",VLOOKUP($A61,FB_27,S$5,0))&IF(TYPE(VLOOKUP($A61,FB_28,S$5,0))=16,\"\",VLOOKUP($A61,FB_28,S$5,0))&IF(TYPE(VLOOKUP($A61,FB_29,S$5,0))=16,\"\",VLOOKUP($A61,FB_29,S$5,0))&IF(TYPE(VLOOKUP($A61,FB_30,S$5,0))=16,\"\",VLOOKUP($A61,FB_30,S$5,0)))","v":""},null,null,null,null,null,null,null,null,null,null,null,null,null,null,null,null,"",":","","",""]
["33.",{"$f":"IF(TYPE(VLOOKUP($A62,FB_1,2,0))=16,\"\",VLOOKUP($A62,FB_1,2,0))&IF(TYPE(VLOOKUP($A62,FB_2,2,0))=16,\"\",VLOOKUP($A62,FB_2,2,0))&IF(TYPE(VLOOKUP($A62,FB_3,2,0))=16,\"\",VLOOKUP($A62,FB_3,2,0))&IF(TYPE(VLOOKUP($A62,FB_4,2,0))=16,\"\",VLOOKUP($A62,FB_4,2,0))&IF(TYPE(VLOOKUP($A62,FB_5,2,0))=16,\"\",VLOOKUP($A62,FB_5,2,0))&IF(TYPE(VLOOKUP($A62,FB_6,2,0))=16,\"\",VLOOKUP($A62,FB_6,2,0))&IF(TYPE(VLOOKUP($A62,FB_7,2,0))=16,\"\",VLOOKUP($A62,FB_7,2,0))&IF(TYPE(VLOOKUP($A62,FB_8,2,0))=16,\"\",VLOOKUP($A62,FB_8,2,0))&IF(TYPE(VLOOKUP($A62,FB_9,2,0))=16,\"\",VLOOKUP($A62,FB_9,2,0))&IF(TYPE(VLOOKUP($A62,FB_10,2,0))=16,\"\",VLOOKUP($A62,FB_10,2,0))&IF(TYPE(VLOOKUP($A62,FB_11,2,0))=16,\"\",VLOOKUP($A62,FB_11,2,0))&IF(TYPE(VLOOKUP($A62,FB_12,2,0))=16,\"\",VLOOKUP($A62,FB_12,2,0))&IF(TYPE(VLOOKUP($A62,FB_13,2,0))=16,\"\",VLOOKUP($A62,FB_13,2,0))&IF(TYPE(VLOOKUP($A62,FB_14,2,0))=16,\"\",VLOOKUP($A62,FB_14,2,0))&IF(TYPE(VLOOKUP($A62,FB_15,2,0))=16,\"\",VLOOKUP($A62,FB_15,2,0))&IF(TYPE(VLOOKUP($A62,FB_16,2,0))=16,\"\",VLOOKUP($A62,FB_16,2,0))&IF(TYPE(VLOOKUP($A62,FB_17,2,0))=16,\"\",VLOOKUP($A62,FB_17,2,0))&IF(TYPE(VLOOKUP($A62,FB_18,2,0))=16,\"\",VLOOKUP($A62,FB_18,2,0))&IF(TYPE(VLOOKUP($A62,FB_19,2,0))=16,\"\",VLOOKUP($A62,FB_19,2,0))&IF(TYPE(VLOOKUP($A62,FB_20,2,0))=16,\"\",VLOOKUP($A62,FB_20,2,0))&IF(TYPE(VLOOKUP($A62,FB_21,2,0))=16,\"\",VLOOKUP($A62,FB_21,2,0))&IF(TYPE(VLOOKUP($A62,FB_22,2,0))=16,\"\",VLOOKUP($A62,FB_22,2,0))&IF(TYPE(VLOOKUP($A62,FB_23,2,0))=16,\"\",VLOOKUP($A62,FB_23,2,0))&IF(TYPE(VLOOKUP($A62,FB_24,2,0))=16,\"\",VLOOKUP($A62,FB_24,2,0))&IF(TYPE(VLOOKUP($A62,FB_25,2,0))=16,\"\",VLOOKUP($A62,FB_25,2,0))&IF(TYPE(VLOOKUP($A62,FB_26,2,0))=16,\"\",VLOOKUP($A62,FB_26,2,0))&IF(TYPE(VLOOKUP($A62,FB_27,2,0))=16,\"\",VLOOKUP($A62,FB_27,2,0))&IF(TYPE(VLOOKUP($A62,FB_28,2,0))=16,\"\",VLOOKUP($A62,FB_28,2,0))&IF(TYPE(VLOOKUP($A62,FB_29,2,0))=16,\"\",VLOOKUP($A62,FB_29,2,0))&IF(TYPE(VLOOKUP($A62,FB_30,2,0))=16,\"\",VLOOKUP($A62,FB_30,2,0))","v":""},null,{"$f":"IF($B62=\"\",\"\",_xlfn.NUMBERVALUE(IF(TYPE(VLOOKUP($A62,FB_1,P$5,0))=16,\"\",VLOOKUP($A62,FB_1,P$5,0))&IF(TYPE(VLOOKUP($A62,FB_2,P$5,0))=16,\"\",VLOOKUP($A62,FB_2,P$5,0))&IF(TYPE(VLOOKUP($A62,FB_3,P$5,0))=16,\"\",VLOOKUP($A62,FB_3,P$5,0))&IF(TYPE(VLOOKUP($A62,FB_4,P$5,0))=16,\"\",VLOOKUP($A62,FB_4,P$5,0))&IF(TYPE(VLOOKUP($A62,FB_5,P$5,0))=16,\"\",VLOOKUP($A62,FB_5,P$5,0))&IF(TYPE(VLOOKUP($A62,FB_6,P$5,0))=16,\"\",VLOOKUP($A62,FB_6,P$5,0))&IF(TYPE(VLOOKUP($A62,FB_7,P$5,0))=16,\"\",VLOOKUP($A62,FB_7,P$5,0))&IF(TYPE(VLOOKUP($A62,FB_8,P$5,0))=16,\"\",VLOOKUP($A62,FB_8,P$5,0))&IF(TYPE(VLOOKUP($A62,FB_9,P$5,0))=16,\"\",VLOOKUP($A62,FB_9,P$5,0))&IF(TYPE(VLOOKUP($A62,FB_10,P$5,0))=16,\"\",VLOOKUP($A62,FB_10,P$5,0))&IF(TYPE(VLOOKUP($A62,FB_11,P$5,0))=16,\"\",VLOOKUP($A62,FB_11,P$5,0))&IF(TYPE(VLOOKUP($A62,FB_12,P$5,0))=16,\"\",VLOOKUP($A62,FB_12,P$5,0))&IF(TYPE(VLOOKUP($A62,FB_13,P$5,0))=16,\"\",VLOOKUP($A62,FB_13,P$5,0))&IF(TYPE(VLOOKUP($A62,FB_14,P$5,0))=16,\"\",VLOOKUP($A62,FB_14,P$5,0))&IF(TYPE(VLOOKUP($A62,FB_15,P$5,0))=16,\"\",VLOOKUP($A62,FB_15,P$5,0))&IF(TYPE(VLOOKUP($A62,FB_16,P$5,0))=16,\"\",VLOOKUP($A62,FB_16,P$5,0))&IF(TYPE(VLOOKUP($A62,FB_17,P$5,0))=16,\"\",VLOOKUP($A62,FB_17,P$5,0))&IF(TYPE(VLOOKUP($A62,FB_18,P$5,0))=16,\"\",VLOOKUP($A62,FB_18,P$5,0))&IF(TYPE(VLOOKUP($A62,FB_19,P$5,0))=16,\"\",VLOOKUP($A62,FB_19,P$5,0))&IF(TYPE(VLOOKUP($A62,FB_20,P$5,0))=16,\"\",VLOOKUP($A62,FB_20,P$5,0))&IF(TYPE(VLOOKUP($A62,FB_21,P$5,0))=16,\"\",VLOOKUP($A62,FB_21,P$5,0))&IF(TYPE(VLOOKUP($A62,FB_22,P$5,0))=16,\"\",VLOOKUP($A62,FB_22,P$5,0))&IF(TYPE(VLOOKUP($A62,FB_23,P$5,0))=16,\"\",VLOOKUP($A62,FB_23,P$5,0))&IF(TYPE(VLOOKUP($A62,FB_24,P$5,0))=16,\"\",VLOOKUP($A62,FB_24,P$5,0))&IF(TYPE(VLOOKUP($A62,FB_25,P$5,0))=16,\"\",VLOOKUP($A62,FB_25,P$5,0))&IF(TYPE(VLOOKUP($A62,FB_26,P$5,0))=16,\"\",VLOOKUP($A62,FB_26,P$5,0))&IF(TYPE(VLOOKUP($A62,FB_27,P$5,0))=16,\"\",VLOOKUP($A62,FB_27,P$5,0))&IF(TYPE(VLOOKUP($A62,FB_28,P$5,0))=16,\"\",VLOOKUP($A62,FB_28,P$5,0))&IF(TYPE(VLOOKUP($A62,FB_29,P$5,0))=16,\"\",VLOOKUP($A62,FB_29,P$5,0))&IF(TYPE(VLOOKUP($A62,FB_30,P$5,0))=16,\"\",VLOOKUP($A62,FB_30,P$5,0))))","v":""},"",{"$f":"IF($B62=\"\",\"\",_xlfn.NUMBERVALUE(IF(TYPE(VLOOKUP($A62,FB_1,R$5,0))=16,\"\",VLOOKUP($A62,FB_1,R$5,0))&IF(TYPE(VLOOKUP($A62,FB_2,R$5,0))=16,\"\",VLOOKUP($A62,FB_2,R$5,0))&IF(TYPE(VLOOKUP($A62,FB_3,R$5,0))=16,\"\",VLOOKUP($A62,FB_3,R$5,0))&IF(TYPE(VLOOKUP($A62,FB_4,R$5,0))=16,\"\",VLOOKUP($A62,FB_4,R$5,0))&IF(TYPE(VLOOKUP($A62,FB_5,R$5,0))=16,\"\",VLOOKUP($A62,FB_5,R$5,0))&IF(TYPE(VLOOKUP($A62,FB_6,R$5,0))=16,\"\",VLOOKUP($A62,FB_6,R$5,0))&IF(TYPE(VLOOKUP($A62,FB_7,R$5,0))=16,\"\",VLOOKUP($A62,FB_7,R$5,0))&IF(TYPE(VLOOKUP($A62,FB_8,R$5,0))=16,\"\",VLOOKUP($A62,FB_8,R$5,0))&IF(TYPE(VLOOKUP($A62,FB_9,R$5,0))=16,\"\",VLOOKUP($A62,FB_9,R$5,0))&IF(TYPE(VLOOKUP($A62,FB_10,R$5,0))=16,\"\",VLOOKUP($A62,FB_10,R$5,0))&IF(TYPE(VLOOKUP($A62,FB_11,R$5,0))=16,\"\",VLOOKUP($A62,FB_11,R$5,0))&IF(TYPE(VLOOKUP($A62,FB_12,R$5,0))=16,\"\",VLOOKUP($A62,FB_12,R$5,0))&IF(TYPE(VLOOKUP($A62,FB_13,R$5,0))=16,\"\",VLOOKUP($A62,FB_13,R$5,0))&IF(TYPE(VLOOKUP($A62,FB_14,R$5,0))=16,\"\",VLOOKUP($A62,FB_14,R$5,0))&IF(TYPE(VLOOKUP($A62,FB_15,R$5,0))=16,\"\",VLOOKUP($A62,FB_15,R$5,0))&IF(TYPE(VLOOKUP($A62,FB_16,R$5,0))=16,\"\",VLOOKUP($A62,FB_16,R$5,0))&IF(TYPE(VLOOKUP($A62,FB_17,R$5,0))=16,\"\",VLOOKUP($A62,FB_17,R$5,0))&IF(TYPE(VLOOKUP($A62,FB_18,R$5,0))=16,\"\",VLOOKUP($A62,FB_18,R$5,0))&IF(TYPE(VLOOKUP($A62,FB_19,R$5,0))=16,\"\",VLOOKUP($A62,FB_19,R$5,0))&IF(TYPE(VLOOKUP($A62,FB_20,R$5,0))=16,\"\",VLOOKUP($A62,FB_20,R$5,0))&IF(TYPE(VLOOKUP($A62,FB_21,R$5,0))=16,\"\",VLOOKUP($A62,FB_21,R$5,0))&IF(TYPE(VLOOKUP($A62,FB_22,R$5,0))=16,\"\",VLOOKUP($A62,FB_22,R$5,0))&IF(TYPE(VLOOKUP($A62,FB_23,R$5,0))=16,\"\",VLOOKUP($A62,FB_23,R$5,0))&IF(TYPE(VLOOKUP($A62,FB_24,R$5,0))=16,\"\",VLOOKUP($A62,FB_24,R$5,0))&IF(TYPE(VLOOKUP($A62,FB_25,R$5,0))=16,\"\",VLOOKUP($A62,FB_25,R$5,0))&IF(TYPE(VLOOKUP($A62,FB_26,R$5,0))=16,\"\",VLOOKUP($A62,FB_26,R$5,0))&IF(TYPE(VLOOKUP($A62,FB_27,R$5,0))=16,\"\",VLOOKUP($A62,FB_27,R$5,0))&IF(TYPE(VLOOKUP($A62,FB_28,R$5,0))=16,\"\",VLOOKUP($A62,FB_28,R$5,0))&IF(TYPE(VLOOKUP($A62,FB_29,R$5,0))=16,\"\",VLOOKUP($A62,FB_29,R$5,0))&IF(TYPE(VLOOKUP($A62,FB_30,R$5,0))=16,\"\",VLOOKUP($A62,FB_30,R$5,0))))","v":""},{"$f":"IF($B62=\"\",\"\",IF(TYPE(VLOOKUP($A62,FB_1,S$5,0))=16,\"\",VLOOKUP($A62,FB_1,S$5,0))&IF(TYPE(VLOOKUP($A62,FB_2,S$5,0))=16,\"\",VLOOKUP($A62,FB_2,S$5,0))&IF(TYPE(VLOOKUP($A62,FB_3,S$5,0))=16,\"\",VLOOKUP($A62,FB_3,S$5,0))&IF(TYPE(VLOOKUP($A62,FB_4,S$5,0))=16,\"\",VLOOKUP($A62,FB_4,S$5,0))&IF(TYPE(VLOOKUP($A62,FB_5,S$5,0))=16,\"\",VLOOKUP($A62,FB_5,S$5,0))&IF(TYPE(VLOOKUP($A62,FB_6,S$5,0))=16,\"\",VLOOKUP($A62,FB_6,S$5,0))&IF(TYPE(VLOOKUP($A62,FB_7,S$5,0))=16,\"\",VLOOKUP($A62,FB_7,S$5,0))&IF(TYPE(VLOOKUP($A62,FB_8,S$5,0))=16,\"\",VLOOKUP($A62,FB_8,S$5,0))&IF(TYPE(VLOOKUP($A62,FB_9,S$5,0))=16,\"\",VLOOKUP($A62,FB_9,S$5,0))&IF(TYPE(VLOOKUP($A62,FB_10,S$5,0))=16,\"\",VLOOKUP($A62,FB_10,S$5,0))&IF(TYPE(VLOOKUP($A62,FB_11,S$5,0))=16,\"\",VLOOKUP($A62,FB_11,S$5,0))&IF(TYPE(VLOOKUP($A62,FB_12,S$5,0))=16,\"\",VLOOKUP($A62,FB_12,S$5,0))&IF(TYPE(VLOOKUP($A62,FB_13,S$5,0))=16,\"\",VLOOKUP($A62,FB_13,S$5,0))&IF(TYPE(VLOOKUP($A62,FB_14,S$5,0))=16,\"\",VLOOKUP($A62,FB_14,S$5,0))&IF(TYPE(VLOOKUP($A62,FB_15,S$5,0))=16,\"\",VLOOKUP($A62,FB_15,S$5,0))&IF(TYPE(VLOOKUP($A62,FB_16,S$5,0))=16,\"\",VLOOKUP($A62,FB_16,S$5,0))&IF(TYPE(VLOOKUP($A62,FB_17,S$5,0))=16,\"\",VLOOKUP($A62,FB_17,S$5,0))&IF(TYPE(VLOOKUP($A62,FB_18,S$5,0))=16,\"\",VLOOKUP($A62,FB_18,S$5,0))&IF(TYPE(VLOOKUP($A62,FB_19,S$5,0))=16,\"\",VLOOKUP($A62,FB_19,S$5,0))&IF(TYPE(VLOOKUP($A62,FB_20,S$5,0))=16,\"\",VLOOKUP($A62,FB_20,S$5,0))&IF(TYPE(VLOOKUP($A62,FB_21,S$5,0))=16,\"\",VLOOKUP($A62,FB_21,S$5,0))&IF(TYPE(VLOOKUP($A62,FB_22,S$5,0))=16,\"\",VLOOKUP($A62,FB_22,S$5,0))&IF(TYPE(VLOOKUP($A62,FB_23,S$5,0))=16,\"\",VLOOKUP($A62,FB_23,S$5,0))&IF(TYPE(VLOOKUP($A62,FB_24,S$5,0))=16,\"\",VLOOKUP($A62,FB_24,S$5,0))&IF(TYPE(VLOOKUP($A62,FB_25,S$5,0))=16,\"\",VLOOKUP($A62,FB_25,S$5,0))&IF(TYPE(VLOOKUP($A62,FB_26,S$5,0))=16,\"\",VLOOKUP($A62,FB_26,S$5,0))&IF(TYPE(VLOOKUP($A62,FB_27,S$5,0))=16,\"\",VLOOKUP($A62,FB_27,S$5,0))&IF(TYPE(VLOOKUP($A62,FB_28,S$5,0))=16,\"\",VLOOKUP($A62,FB_28,S$5,0))&IF(TYPE(VLOOKUP($A62,FB_29,S$5,0))=16,\"\",VLOOKUP($A62,FB_29,S$5,0))&IF(TYPE(VLOOKUP($A62,FB_30,S$5,0))=16,\"\",VLOOKUP($A62,FB_30,S$5,0)))","v":""},null,null,null,null,null,null,null,null,null,null,null,null,null,null,null,null,"",":","","",""]
["34.",{"$f":"IF(TYPE(VLOOKUP($A63,FB_1,2,0))=16,\"\",VLOOKUP($A63,FB_1,2,0))&IF(TYPE(VLOOKUP($A63,FB_2,2,0))=16,\"\",VLOOKUP($A63,FB_2,2,0))&IF(TYPE(VLOOKUP($A63,FB_3,2,0))=16,\"\",VLOOKUP($A63,FB_3,2,0))&IF(TYPE(VLOOKUP($A63,FB_4,2,0))=16,\"\",VLOOKUP($A63,FB_4,2,0))&IF(TYPE(VLOOKUP($A63,FB_5,2,0))=16,\"\",VLOOKUP($A63,FB_5,2,0))&IF(TYPE(VLOOKUP($A63,FB_6,2,0))=16,\"\",VLOOKUP($A63,FB_6,2,0))&IF(TYPE(VLOOKUP($A63,FB_7,2,0))=16,\"\",VLOOKUP($A63,FB_7,2,0))&IF(TYPE(VLOOKUP($A63,FB_8,2,0))=16,\"\",VLOOKUP($A63,FB_8,2,0))&IF(TYPE(VLOOKUP($A63,FB_9,2,0))=16,\"\",VLOOKUP($A63,FB_9,2,0))&IF(TYPE(VLOOKUP($A63,FB_10,2,0))=16,\"\",VLOOKUP($A63,FB_10,2,0))&IF(TYPE(VLOOKUP($A63,FB_11,2,0))=16,\"\",VLOOKUP($A63,FB_11,2,0))&IF(TYPE(VLOOKUP($A63,FB_12,2,0))=16,\"\",VLOOKUP($A63,FB_12,2,0))&IF(TYPE(VLOOKUP($A63,FB_13,2,0))=16,\"\",VLOOKUP($A63,FB_13,2,0))&IF(TYPE(VLOOKUP($A63,FB_14,2,0))=16,\"\",VLOOKUP($A63,FB_14,2,0))&IF(TYPE(VLOOKUP($A63,FB_15,2,0))=16,\"\",VLOOKUP($A63,FB_15,2,0))&IF(TYPE(VLOOKUP($A63,FB_16,2,0))=16,\"\",VLOOKUP($A63,FB_16,2,0))&IF(TYPE(VLOOKUP($A63,FB_17,2,0))=16,\"\",VLOOKUP($A63,FB_17,2,0))&IF(TYPE(VLOOKUP($A63,FB_18,2,0))=16,\"\",VLOOKUP($A63,FB_18,2,0))&IF(TYPE(VLOOKUP($A63,FB_19,2,0))=16,\"\",VLOOKUP($A63,FB_19,2,0))&IF(TYPE(VLOOKUP($A63,FB_20,2,0))=16,\"\",VLOOKUP($A63,FB_20,2,0))&IF(TYPE(VLOOKUP($A63,FB_21,2,0))=16,\"\",VLOOKUP($A63,FB_21,2,0))&IF(TYPE(VLOOKUP($A63,FB_22,2,0))=16,\"\",VLOOKUP($A63,FB_22,2,0))&IF(TYPE(VLOOKUP($A63,FB_23,2,0))=16,\"\",VLOOKUP($A63,FB_23,2,0))&IF(TYPE(VLOOKUP($A63,FB_24,2,0))=16,\"\",VLOOKUP($A63,FB_24,2,0))&IF(TYPE(VLOOKUP($A63,FB_25,2,0))=16,\"\",VLOOKUP($A63,FB_25,2,0))&IF(TYPE(VLOOKUP($A63,FB_26,2,0))=16,\"\",VLOOKUP($A63,FB_26,2,0))&IF(TYPE(VLOOKUP($A63,FB_27,2,0))=16,\"\",VLOOKUP($A63,FB_27,2,0))&IF(TYPE(VLOOKUP($A63,FB_28,2,0))=16,\"\",VLOOKUP($A63,FB_28,2,0))&IF(TYPE(VLOOKUP($A63,FB_29,2,0))=16,\"\",VLOOKUP($A63,FB_29,2,0))&IF(TYPE(VLOOKUP($A63,FB_30,2,0))=16,\"\",VLOOKUP($A63,FB_30,2,0))","v":""},null,{"$f":"IF($B63=\"\",\"\",_xlfn.NUMBERVALUE(IF(TYPE(VLOOKUP($A63,FB_1,P$5,0))=16,\"\",VLOOKUP($A63,FB_1,P$5,0))&IF(TYPE(VLOOKUP($A63,FB_2,P$5,0))=16,\"\",VLOOKUP($A63,FB_2,P$5,0))&IF(TYPE(VLOOKUP($A63,FB_3,P$5,0))=16,\"\",VLOOKUP($A63,FB_3,P$5,0))&IF(TYPE(VLOOKUP($A63,FB_4,P$5,0))=16,\"\",VLOOKUP($A63,FB_4,P$5,0))&IF(TYPE(VLOOKUP($A63,FB_5,P$5,0))=16,\"\",VLOOKUP($A63,FB_5,P$5,0))&IF(TYPE(VLOOKUP($A63,FB_6,P$5,0))=16,\"\",VLOOKUP($A63,FB_6,P$5,0))&IF(TYPE(VLOOKUP($A63,FB_7,P$5,0))=16,\"\",VLOOKUP($A63,FB_7,P$5,0))&IF(TYPE(VLOOKUP($A63,FB_8,P$5,0))=16,\"\",VLOOKUP($A63,FB_8,P$5,0))&IF(TYPE(VLOOKUP($A63,FB_9,P$5,0))=16,\"\",VLOOKUP($A63,FB_9,P$5,0))&IF(TYPE(VLOOKUP($A63,FB_10,P$5,0))=16,\"\",VLOOKUP($A63,FB_10,P$5,0))&IF(TYPE(VLOOKUP($A63,FB_11,P$5,0))=16,\"\",VLOOKUP($A63,FB_11,P$5,0))&IF(TYPE(VLOOKUP($A63,FB_12,P$5,0))=16,\"\",VLOOKUP($A63,FB_12,P$5,0))&IF(TYPE(VLOOKUP($A63,FB_13,P$5,0))=16,\"\",VLOOKUP($A63,FB_13,P$5,0))&IF(TYPE(VLOOKUP($A63,FB_14,P$5,0))=16,\"\",VLOOKUP($A63,FB_14,P$5,0))&IF(TYPE(VLOOKUP($A63,FB_15,P$5,0))=16,\"\",VLOOKUP($A63,FB_15,P$5,0))&IF(TYPE(VLOOKUP($A63,FB_16,P$5,0))=16,\"\",VLOOKUP($A63,FB_16,P$5,0))&IF(TYPE(VLOOKUP($A63,FB_17,P$5,0))=16,\"\",VLOOKUP($A63,FB_17,P$5,0))&IF(TYPE(VLOOKUP($A63,FB_18,P$5,0))=16,\"\",VLOOKUP($A63,FB_18,P$5,0))&IF(TYPE(VLOOKUP($A63,FB_19,P$5,0))=16,\"\",VLOOKUP($A63,FB_19,P$5,0))&IF(TYPE(VLOOKUP($A63,FB_20,P$5,0))=16,\"\",VLOOKUP($A63,FB_20,P$5,0))&IF(TYPE(VLOOKUP($A63,FB_21,P$5,0))=16,\"\",VLOOKUP($A63,FB_21,P$5,0))&IF(TYPE(VLOOKUP($A63,FB_22,P$5,0))=16,\"\",VLOOKUP($A63,FB_22,P$5,0))&IF(TYPE(VLOOKUP($A63,FB_23,P$5,0))=16,\"\",VLOOKUP($A63,FB_23,P$5,0))&IF(TYPE(VLOOKUP($A63,FB_24,P$5,0))=16,\"\",VLOOKUP($A63,FB_24,P$5,0))&IF(TYPE(VLOOKUP($A63,FB_25,P$5,0))=16,\"\",VLOOKUP($A63,FB_25,P$5,0))&IF(TYPE(VLOOKUP($A63,FB_26,P$5,0))=16,\"\",VLOOKUP($A63,FB_26,P$5,0))&IF(TYPE(VLOOKUP($A63,FB_27,P$5,0))=16,\"\",VLOOKUP($A63,FB_27,P$5,0))&IF(TYPE(VLOOKUP($A63,FB_28,P$5,0))=16,\"\",VLOOKUP($A63,FB_28,P$5,0))&IF(TYPE(VLOOKUP($A63,FB_29,P$5,0))=16,\"\",VLOOKUP($A63,FB_29,P$5,0))&IF(TYPE(VLOOKUP($A63,FB_30,P$5,0))=16,\"\",VLOOKUP($A63,FB_30,P$5,0))))","v":""},"",{"$f":"IF($B63=\"\",\"\",_xlfn.NUMBERVALUE(IF(TYPE(VLOOKUP($A63,FB_1,R$5,0))=16,\"\",VLOOKUP($A63,FB_1,R$5,0))&IF(TYPE(VLOOKUP($A63,FB_2,R$5,0))=16,\"\",VLOOKUP($A63,FB_2,R$5,0))&IF(TYPE(VLOOKUP($A63,FB_3,R$5,0))=16,\"\",VLOOKUP($A63,FB_3,R$5,0))&IF(TYPE(VLOOKUP($A63,FB_4,R$5,0))=16,\"\",VLOOKUP($A63,FB_4,R$5,0))&IF(TYPE(VLOOKUP($A63,FB_5,R$5,0))=16,\"\",VLOOKUP($A63,FB_5,R$5,0))&IF(TYPE(VLOOKUP($A63,FB_6,R$5,0))=16,\"\",VLOOKUP($A63,FB_6,R$5,0))&IF(TYPE(VLOOKUP($A63,FB_7,R$5,0))=16,\"\",VLOOKUP($A63,FB_7,R$5,0))&IF(TYPE(VLOOKUP($A63,FB_8,R$5,0))=16,\"\",VLOOKUP($A63,FB_8,R$5,0))&IF(TYPE(VLOOKUP($A63,FB_9,R$5,0))=16,\"\",VLOOKUP($A63,FB_9,R$5,0))&IF(TYPE(VLOOKUP($A63,FB_10,R$5,0))=16,\"\",VLOOKUP($A63,FB_10,R$5,0))&IF(TYPE(VLOOKUP($A63,FB_11,R$5,0))=16,\"\",VLOOKUP($A63,FB_11,R$5,0))&IF(TYPE(VLOOKUP($A63,FB_12,R$5,0))=16,\"\",VLOOKUP($A63,FB_12,R$5,0))&IF(TYPE(VLOOKUP($A63,FB_13,R$5,0))=16,\"\",VLOOKUP($A63,FB_13,R$5,0))&IF(TYPE(VLOOKUP($A63,FB_14,R$5,0))=16,\"\",VLOOKUP($A63,FB_14,R$5,0))&IF(TYPE(VLOOKUP($A63,FB_15,R$5,0))=16,\"\",VLOOKUP($A63,FB_15,R$5,0))&IF(TYPE(VLOOKUP($A63,FB_16,R$5,0))=16,\"\",VLOOKUP($A63,FB_16,R$5,0))&IF(TYPE(VLOOKUP($A63,FB_17,R$5,0))=16,\"\",VLOOKUP($A63,FB_17,R$5,0))&IF(TYPE(VLOOKUP($A63,FB_18,R$5,0))=16,\"\",VLOOKUP($A63,FB_18,R$5,0))&IF(TYPE(VLOOKUP($A63,FB_19,R$5,0))=16,\"\",VLOOKUP($A63,FB_19,R$5,0))&IF(TYPE(VLOOKUP($A63,FB_20,R$5,0))=16,\"\",VLOOKUP($A63,FB_20,R$5,0))&IF(TYPE(VLOOKUP($A63,FB_21,R$5,0))=16,\"\",VLOOKUP($A63,FB_21,R$5,0))&IF(TYPE(VLOOKUP($A63,FB_22,R$5,0))=16,\"\",VLOOKUP($A63,FB_22,R$5,0))&IF(TYPE(VLOOKUP($A63,FB_23,R$5,0))=16,\"\",VLOOKUP($A63,FB_23,R$5,0))&IF(TYPE(VLOOKUP($A63,FB_24,R$5,0))=16,\"\",VLOOKUP($A63,FB_24,R$5,0))&IF(TYPE(VLOOKUP($A63,FB_25,R$5,0))=16,\"\",VLOOKUP($A63,FB_25,R$5,0))&IF(TYPE(VLOOKUP($A63,FB_26,R$5,0))=16,\"\",VLOOKUP($A63,FB_26,R$5,0))&IF(TYPE(VLOOKUP($A63,FB_27,R$5,0))=16,\"\",VLOOKUP($A63,FB_27,R$5,0))&IF(TYPE(VLOOKUP($A63,FB_28,R$5,0))=16,\"\",VLOOKUP($A63,FB_28,R$5,0))&IF(TYPE(VLOOKUP($A63,FB_29,R$5,0))=16,\"\",VLOOKUP($A63,FB_29,R$5,0))&IF(TYPE(VLOOKUP($A63,FB_30,R$5,0))=16,\"\",VLOOKUP($A63,FB_30,R$5,0))))","v":""},{"$f":"IF($B63=\"\",\"\",IF(TYPE(VLOOKUP($A63,FB_1,S$5,0))=16,\"\",VLOOKUP($A63,FB_1,S$5,0))&IF(TYPE(VLOOKUP($A63,FB_2,S$5,0))=16,\"\",VLOOKUP($A63,FB_2,S$5,0))&IF(TYPE(VLOOKUP($A63,FB_3,S$5,0))=16,\"\",VLOOKUP($A63,FB_3,S$5,0))&IF(TYPE(VLOOKUP($A63,FB_4,S$5,0))=16,\"\",VLOOKUP($A63,FB_4,S$5,0))&IF(TYPE(VLOOKUP($A63,FB_5,S$5,0))=16,\"\",VLOOKUP($A63,FB_5,S$5,0))&IF(TYPE(VLOOKUP($A63,FB_6,S$5,0))=16,\"\",VLOOKUP($A63,FB_6,S$5,0))&IF(TYPE(VLOOKUP($A63,FB_7,S$5,0))=16,\"\",VLOOKUP($A63,FB_7,S$5,0))&IF(TYPE(VLOOKUP($A63,FB_8,S$5,0))=16,\"\",VLOOKUP($A63,FB_8,S$5,0))&IF(TYPE(VLOOKUP($A63,FB_9,S$5,0))=16,\"\",VLOOKUP($A63,FB_9,S$5,0))&IF(TYPE(VLOOKUP($A63,FB_10,S$5,0))=16,\"\",VLOOKUP($A63,FB_10,S$5,0))&IF(TYPE(VLOOKUP($A63,FB_11,S$5,0))=16,\"\",VLOOKUP($A63,FB_11,S$5,0))&IF(TYPE(VLOOKUP($A63,FB_12,S$5,0))=16,\"\",VLOOKUP($A63,FB_12,S$5,0))&IF(TYPE(VLOOKUP($A63,FB_13,S$5,0))=16,\"\",VLOOKUP($A63,FB_13,S$5,0))&IF(TYPE(VLOOKUP($A63,FB_14,S$5,0))=16,\"\",VLOOKUP($A63,FB_14,S$5,0))&IF(TYPE(VLOOKUP($A63,FB_15,S$5,0))=16,\"\",VLOOKUP($A63,FB_15,S$5,0))&IF(TYPE(VLOOKUP($A63,FB_16,S$5,0))=16,\"\",VLOOKUP($A63,FB_16,S$5,0))&IF(TYPE(VLOOKUP($A63,FB_17,S$5,0))=16,\"\",VLOOKUP($A63,FB_17,S$5,0))&IF(TYPE(VLOOKUP($A63,FB_18,S$5,0))=16,\"\",VLOOKUP($A63,FB_18,S$5,0))&IF(TYPE(VLOOKUP($A63,FB_19,S$5,0))=16,\"\",VLOOKUP($A63,FB_19,S$5,0))&IF(TYPE(VLOOKUP($A63,FB_20,S$5,0))=16,\"\",VLOOKUP($A63,FB_20,S$5,0))&IF(TYPE(VLOOKUP($A63,FB_21,S$5,0))=16,\"\",VLOOKUP($A63,FB_21,S$5,0))&IF(TYPE(VLOOKUP($A63,FB_22,S$5,0))=16,\"\",VLOOKUP($A63,FB_22,S$5,0))&IF(TYPE(VLOOKUP($A63,FB_23,S$5,0))=16,\"\",VLOOKUP($A63,FB_23,S$5,0))&IF(TYPE(VLOOKUP($A63,FB_24,S$5,0))=16,\"\",VLOOKUP($A63,FB_24,S$5,0))&IF(TYPE(VLOOKUP($A63,FB_25,S$5,0))=16,\"\",VLOOKUP($A63,FB_25,S$5,0))&IF(TYPE(VLOOKUP($A63,FB_26,S$5,0))=16,\"\",VLOOKUP($A63,FB_26,S$5,0))&IF(TYPE(VLOOKUP($A63,FB_27,S$5,0))=16,\"\",VLOOKUP($A63,FB_27,S$5,0))&IF(TYPE(VLOOKUP($A63,FB_28,S$5,0))=16,\"\",VLOOKUP($A63,FB_28,S$5,0))&IF(TYPE(VLOOKUP($A63,FB_29,S$5,0))=16,\"\",VLOOKUP($A63,FB_29,S$5,0))&IF(TYPE(VLOOKUP($A63,FB_30,S$5,0))=16,\"\",VLOOKUP($A63,FB_30,S$5,0)))","v":""},null,null,null,null,null,null,null,null,null,null,null,null,null,null,null,null,"",":","","",""]
["35.",{"$f":"IF(TYPE(VLOOKUP($A64,FB_1,2,0))=16,\"\",VLOOKUP($A64,FB_1,2,0))&IF(TYPE(VLOOKUP($A64,FB_2,2,0))=16,\"\",VLOOKUP($A64,FB_2,2,0))&IF(TYPE(VLOOKUP($A64,FB_3,2,0))=16,\"\",VLOOKUP($A64,FB_3,2,0))&IF(TYPE(VLOOKUP($A64,FB_4,2,0))=16,\"\",VLOOKUP($A64,FB_4,2,0))&IF(TYPE(VLOOKUP($A64,FB_5,2,0))=16,\"\",VLOOKUP($A64,FB_5,2,0))&IF(TYPE(VLOOKUP($A64,FB_6,2,0))=16,\"\",VLOOKUP($A64,FB_6,2,0))&IF(TYPE(VLOOKUP($A64,FB_7,2,0))=16,\"\",VLOOKUP($A64,FB_7,2,0))&IF(TYPE(VLOOKUP($A64,FB_8,2,0))=16,\"\",VLOOKUP($A64,FB_8,2,0))&IF(TYPE(VLOOKUP($A64,FB_9,2,0))=16,\"\",VLOOKUP($A64,FB_9,2,0))&IF(TYPE(VLOOKUP($A64,FB_10,2,0))=16,\"\",VLOOKUP($A64,FB_10,2,0))&IF(TYPE(VLOOKUP($A64,FB_11,2,0))=16,\"\",VLOOKUP($A64,FB_11,2,0))&IF(TYPE(VLOOKUP($A64,FB_12,2,0))=16,\"\",VLOOKUP($A64,FB_12,2,0))&IF(TYPE(VLOOKUP($A64,FB_13,2,0))=16,\"\",VLOOKUP($A64,FB_13,2,0))&IF(TYPE(VLOOKUP($A64,FB_14,2,0))=16,\"\",VLOOKUP($A64,FB_14,2,0))&IF(TYPE(VLOOKUP($A64,FB_15,2,0))=16,\"\",VLOOKUP($A64,FB_15,2,0))&IF(TYPE(VLOOKUP($A64,FB_16,2,0))=16,\"\",VLOOKUP($A64,FB_16,2,0))&IF(TYPE(VLOOKUP($A64,FB_17,2,0))=16,\"\",VLOOKUP($A64,FB_17,2,0))&IF(TYPE(VLOOKUP($A64,FB_18,2,0))=16,\"\",VLOOKUP($A64,FB_18,2,0))&IF(TYPE(VLOOKUP($A64,FB_19,2,0))=16,\"\",VLOOKUP($A64,FB_19,2,0))&IF(TYPE(VLOOKUP($A64,FB_20,2,0))=16,\"\",VLOOKUP($A64,FB_20,2,0))&IF(TYPE(VLOOKUP($A64,FB_21,2,0))=16,\"\",VLOOKUP($A64,FB_21,2,0))&IF(TYPE(VLOOKUP($A64,FB_22,2,0))=16,\"\",VLOOKUP($A64,FB_22,2,0))&IF(TYPE(VLOOKUP($A64,FB_23,2,0))=16,\"\",VLOOKUP($A64,FB_23,2,0))&IF(TYPE(VLOOKUP($A64,FB_24,2,0))=16,\"\",VLOOKUP($A64,FB_24,2,0))&IF(TYPE(VLOOKUP($A64,FB_25,2,0))=16,\"\",VLOOKUP($A64,FB_25,2,0))&IF(TYPE(VLOOKUP($A64,FB_26,2,0))=16,\"\",VLOOKUP($A64,FB_26,2,0))&IF(TYPE(VLOOKUP($A64,FB_27,2,0))=16,\"\",VLOOKUP($A64,FB_27,2,0))&IF(TYPE(VLOOKUP($A64,FB_28,2,0))=16,\"\",VLOOKUP($A64,FB_28,2,0))&IF(TYPE(VLOOKUP($A64,FB_29,2,0))=16,\"\",VLOOKUP($A64,FB_29,2,0))&IF(TYPE(VLOOKUP($A64,FB_30,2,0))=16,\"\",VLOOKUP($A64,FB_30,2,0))","v":""},null,{"$f":"IF($B64=\"\",\"\",_xlfn.NUMBERVALUE(IF(TYPE(VLOOKUP($A64,FB_1,P$5,0))=16,\"\",VLOOKUP($A64,FB_1,P$5,0))&IF(TYPE(VLOOKUP($A64,FB_2,P$5,0))=16,\"\",VLOOKUP($A64,FB_2,P$5,0))&IF(TYPE(VLOOKUP($A64,FB_3,P$5,0))=16,\"\",VLOOKUP($A64,FB_3,P$5,0))&IF(TYPE(VLOOKUP($A64,FB_4,P$5,0))=16,\"\",VLOOKUP($A64,FB_4,P$5,0))&IF(TYPE(VLOOKUP($A64,FB_5,P$5,0))=16,\"\",VLOOKUP($A64,FB_5,P$5,0))&IF(TYPE(VLOOKUP($A64,FB_6,P$5,0))=16,\"\",VLOOKUP($A64,FB_6,P$5,0))&IF(TYPE(VLOOKUP($A64,FB_7,P$5,0))=16,\"\",VLOOKUP($A64,FB_7,P$5,0))&IF(TYPE(VLOOKUP($A64,FB_8,P$5,0))=16,\"\",VLOOKUP($A64,FB_8,P$5,0))&IF(TYPE(VLOOKUP($A64,FB_9,P$5,0))=16,\"\",VLOOKUP($A64,FB_9,P$5,0))&IF(TYPE(VLOOKUP($A64,FB_10,P$5,0))=16,\"\",VLOOKUP($A64,FB_10,P$5,0))&IF(TYPE(VLOOKUP($A64,FB_11,P$5,0))=16,\"\",VLOOKUP($A64,FB_11,P$5,0))&IF(TYPE(VLOOKUP($A64,FB_12,P$5,0))=16,\"\",VLOOKUP($A64,FB_12,P$5,0))&IF(TYPE(VLOOKUP($A64,FB_13,P$5,0))=16,\"\",VLOOKUP($A64,FB_13,P$5,0))&IF(TYPE(VLOOKUP($A64,FB_14,P$5,0))=16,\"\",VLOOKUP($A64,FB_14,P$5,0))&IF(TYPE(VLOOKUP($A64,FB_15,P$5,0))=16,\"\",VLOOKUP($A64,FB_15,P$5,0))&IF(TYPE(VLOOKUP($A64,FB_16,P$5,0))=16,\"\",VLOOKUP($A64,FB_16,P$5,0))&IF(TYPE(VLOOKUP($A64,FB_17,P$5,0))=16,\"\",VLOOKUP($A64,FB_17,P$5,0))&IF(TYPE(VLOOKUP($A64,FB_18,P$5,0))=16,\"\",VLOOKUP($A64,FB_18,P$5,0))&IF(TYPE(VLOOKUP($A64,FB_19,P$5,0))=16,\"\",VLOOKUP($A64,FB_19,P$5,0))&IF(TYPE(VLOOKUP($A64,FB_20,P$5,0))=16,\"\",VLOOKUP($A64,FB_20,P$5,0))&IF(TYPE(VLOOKUP($A64,FB_21,P$5,0))=16,\"\",VLOOKUP($A64,FB_21,P$5,0))&IF(TYPE(VLOOKUP($A64,FB_22,P$5,0))=16,\"\",VLOOKUP($A64,FB_22,P$5,0))&IF(TYPE(VLOOKUP($A64,FB_23,P$5,0))=16,\"\",VLOOKUP($A64,FB_23,P$5,0))&IF(TYPE(VLOOKUP($A64,FB_24,P$5,0))=16,\"\",VLOOKUP($A64,FB_24,P$5,0))&IF(TYPE(VLOOKUP($A64,FB_25,P$5,0))=16,\"\",VLOOKUP($A64,FB_25,P$5,0))&IF(TYPE(VLOOKUP($A64,FB_26,P$5,0))=16,\"\",VLOOKUP($A64,FB_26,P$5,0))&IF(TYPE(VLOOKUP($A64,FB_27,P$5,0))=16,\"\",VLOOKUP($A64,FB_27,P$5,0))&IF(TYPE(VLOOKUP($A64,FB_28,P$5,0))=16,\"\",VLOOKUP($A64,FB_28,P$5,0))&IF(TYPE(VLOOKUP($A64,FB_29,P$5,0))=16,\"\",VLOOKUP($A64,FB_29,P$5,0))&IF(TYPE(VLOOKUP($A64,FB_30,P$5,0))=16,\"\",VLOOKUP($A64,FB_30,P$5,0))))","v":""},"",{"$f":"IF($B64=\"\",\"\",_xlfn.NUMBERVALUE(IF(TYPE(VLOOKUP($A64,FB_1,R$5,0))=16,\"\",VLOOKUP($A64,FB_1,R$5,0))&IF(TYPE(VLOOKUP($A64,FB_2,R$5,0))=16,\"\",VLOOKUP($A64,FB_2,R$5,0))&IF(TYPE(VLOOKUP($A64,FB_3,R$5,0))=16,\"\",VLOOKUP($A64,FB_3,R$5,0))&IF(TYPE(VLOOKUP($A64,FB_4,R$5,0))=16,\"\",VLOOKUP($A64,FB_4,R$5,0))&IF(TYPE(VLOOKUP($A64,FB_5,R$5,0))=16,\"\",VLOOKUP($A64,FB_5,R$5,0))&IF(TYPE(VLOOKUP($A64,FB_6,R$5,0))=16,\"\",VLOOKUP($A64,FB_6,R$5,0))&IF(TYPE(VLOOKUP($A64,FB_7,R$5,0))=16,\"\",VLOOKUP($A64,FB_7,R$5,0))&IF(TYPE(VLOOKUP($A64,FB_8,R$5,0))=16,\"\",VLOOKUP($A64,FB_8,R$5,0))&IF(TYPE(VLOOKUP($A64,FB_9,R$5,0))=16,\"\",VLOOKUP($A64,FB_9,R$5,0))&IF(TYPE(VLOOKUP($A64,FB_10,R$5,0))=16,\"\",VLOOKUP($A64,FB_10,R$5,0))&IF(TYPE(VLOOKUP($A64,FB_11,R$5,0))=16,\"\",VLOOKUP($A64,FB_11,R$5,0))&IF(TYPE(VLOOKUP($A64,FB_12,R$5,0))=16,\"\",VLOOKUP($A64,FB_12,R$5,0))&IF(TYPE(VLOOKUP($A64,FB_13,R$5,0))=16,\"\",VLOOKUP($A64,FB_13,R$5,0))&IF(TYPE(VLOOKUP($A64,FB_14,R$5,0))=16,\"\",VLOOKUP($A64,FB_14,R$5,0))&IF(TYPE(VLOOKUP($A64,FB_15,R$5,0))=16,\"\",VLOOKUP($A64,FB_15,R$5,0))&IF(TYPE(VLOOKUP($A64,FB_16,R$5,0))=16,\"\",VLOOKUP($A64,FB_16,R$5,0))&IF(TYPE(VLOOKUP($A64,FB_17,R$5,0))=16,\"\",VLOOKUP($A64,FB_17,R$5,0))&IF(TYPE(VLOOKUP($A64,FB_18,R$5,0))=16,\"\",VLOOKUP($A64,FB_18,R$5,0))&IF(TYPE(VLOOKUP($A64,FB_19,R$5,0))=16,\"\",VLOOKUP($A64,FB_19,R$5,0))&IF(TYPE(VLOOKUP($A64,FB_20,R$5,0))=16,\"\",VLOOKUP($A64,FB_20,R$5,0))&IF(TYPE(VLOOKUP($A64,FB_21,R$5,0))=16,\"\",VLOOKUP($A64,FB_21,R$5,0))&IF(TYPE(VLOOKUP($A64,FB_22,R$5,0))=16,\"\",VLOOKUP($A64,FB_22,R$5,0))&IF(TYPE(VLOOKUP($A64,FB_23,R$5,0))=16,\"\",VLOOKUP($A64,FB_23,R$5,0))&IF(TYPE(VLOOKUP($A64,FB_24,R$5,0))=16,\"\",VLOOKUP($A64,FB_24,R$5,0))&IF(TYPE(VLOOKUP($A64,FB_25,R$5,0))=16,\"\",VLOOKUP($A64,FB_25,R$5,0))&IF(TYPE(VLOOKUP($A64,FB_26,R$5,0))=16,\"\",VLOOKUP($A64,FB_26,R$5,0))&IF(TYPE(VLOOKUP($A64,FB_27,R$5,0))=16,\"\",VLOOKUP($A64,FB_27,R$5,0))&IF(TYPE(VLOOKUP($A64,FB_28,R$5,0))=16,\"\",VLOOKUP($A64,FB_28,R$5,0))&IF(TYPE(VLOOKUP($A64,FB_29,R$5,0))=16,\"\",VLOOKUP($A64,FB_29,R$5,0))&IF(TYPE(VLOOKUP($A64,FB_30,R$5,0))=16,\"\",VLOOKUP($A64,FB_30,R$5,0))))","v":""},{"$f":"IF($B64=\"\",\"\",IF(TYPE(VLOOKUP($A64,FB_1,S$5,0))=16,\"\",VLOOKUP($A64,FB_1,S$5,0))&IF(TYPE(VLOOKUP($A64,FB_2,S$5,0))=16,\"\",VLOOKUP($A64,FB_2,S$5,0))&IF(TYPE(VLOOKUP($A64,FB_3,S$5,0))=16,\"\",VLOOKUP($A64,FB_3,S$5,0))&IF(TYPE(VLOOKUP($A64,FB_4,S$5,0))=16,\"\",VLOOKUP($A64,FB_4,S$5,0))&IF(TYPE(VLOOKUP($A64,FB_5,S$5,0))=16,\"\",VLOOKUP($A64,FB_5,S$5,0))&IF(TYPE(VLOOKUP($A64,FB_6,S$5,0))=16,\"\",VLOOKUP($A64,FB_6,S$5,0))&IF(TYPE(VLOOKUP($A64,FB_7,S$5,0))=16,\"\",VLOOKUP($A64,FB_7,S$5,0))&IF(TYPE(VLOOKUP($A64,FB_8,S$5,0))=16,\"\",VLOOKUP($A64,FB_8,S$5,0))&IF(TYPE(VLOOKUP($A64,FB_9,S$5,0))=16,\"\",VLOOKUP($A64,FB_9,S$5,0))&IF(TYPE(VLOOKUP($A64,FB_10,S$5,0))=16,\"\",VLOOKUP($A64,FB_10,S$5,0))&IF(TYPE(VLOOKUP($A64,FB_11,S$5,0))=16,\"\",VLOOKUP($A64,FB_11,S$5,0))&IF(TYPE(VLOOKUP($A64,FB_12,S$5,0))=16,\"\",VLOOKUP($A64,FB_12,S$5,0))&IF(TYPE(VLOOKUP($A64,FB_13,S$5,0))=16,\"\",VLOOKUP($A64,FB_13,S$5,0))&IF(TYPE(VLOOKUP($A64,FB_14,S$5,0))=16,\"\",VLOOKUP($A64,FB_14,S$5,0))&IF(TYPE(VLOOKUP($A64,FB_15,S$5,0))=16,\"\",VLOOKUP($A64,FB_15,S$5,0))&IF(TYPE(VLOOKUP($A64,FB_16,S$5,0))=16,\"\",VLOOKUP($A64,FB_16,S$5,0))&IF(TYPE(VLOOKUP($A64,FB_17,S$5,0))=16,\"\",VLOOKUP($A64,FB_17,S$5,0))&IF(TYPE(VLOOKUP($A64,FB_18,S$5,0))=16,\"\",VLOOKUP($A64,FB_18,S$5,0))&IF(TYPE(VLOOKUP($A64,FB_19,S$5,0))=16,\"\",VLOOKUP($A64,FB_19,S$5,0))&IF(TYPE(VLOOKUP($A64,FB_20,S$5,0))=16,\"\",VLOOKUP($A64,FB_20,S$5,0))&IF(TYPE(VLOOKUP($A64,FB_21,S$5,0))=16,\"\",VLOOKUP($A64,FB_21,S$5,0))&IF(TYPE(VLOOKUP($A64,FB_22,S$5,0))=16,\"\",VLOOKUP($A64,FB_22,S$5,0))&IF(TYPE(VLOOKUP($A64,FB_23,S$5,0))=16,\"\",VLOOKUP($A64,FB_23,S$5,0))&IF(TYPE(VLOOKUP($A64,FB_24,S$5,0))=16,\"\",VLOOKUP($A64,FB_24,S$5,0))&IF(TYPE(VLOOKUP($A64,FB_25,S$5,0))=16,\"\",VLOOKUP($A64,FB_25,S$5,0))&IF(TYPE(VLOOKUP($A64,FB_26,S$5,0))=16,\"\",VLOOKUP($A64,FB_26,S$5,0))&IF(TYPE(VLOOKUP($A64,FB_27,S$5,0))=16,\"\",VLOOKUP($A64,FB_27,S$5,0))&IF(TYPE(VLOOKUP($A64,FB_28,S$5,0))=16,\"\",VLOOKUP($A64,FB_28,S$5,0))&IF(TYPE(VLOOKUP($A64,FB_29,S$5,0))=16,\"\",VLOOKUP($A64,FB_29,S$5,0))&IF(TYPE(VLOOKUP($A64,FB_30,S$5,0))=16,\"\",VLOOKUP($A64,FB_30,S$5,0)))","v":""},null,null,null,null,null,null,null,null,null,null,null,null,null,null,null,null,"",":","","",""]
["36.",{"$f":"IF(TYPE(VLOOKUP($A65,FB_1,2,0))=16,\"\",VLOOKUP($A65,FB_1,2,0))&IF(TYPE(VLOOKUP($A65,FB_2,2,0))=16,\"\",VLOOKUP($A65,FB_2,2,0))&IF(TYPE(VLOOKUP($A65,FB_3,2,0))=16,\"\",VLOOKUP($A65,FB_3,2,0))&IF(TYPE(VLOOKUP($A65,FB_4,2,0))=16,\"\",VLOOKUP($A65,FB_4,2,0))&IF(TYPE(VLOOKUP($A65,FB_5,2,0))=16,\"\",VLOOKUP($A65,FB_5,2,0))&IF(TYPE(VLOOKUP($A65,FB_6,2,0))=16,\"\",VLOOKUP($A65,FB_6,2,0))&IF(TYPE(VLOOKUP($A65,FB_7,2,0))=16,\"\",VLOOKUP($A65,FB_7,2,0))&IF(TYPE(VLOOKUP($A65,FB_8,2,0))=16,\"\",VLOOKUP($A65,FB_8,2,0))&IF(TYPE(VLOOKUP($A65,FB_9,2,0))=16,\"\",VLOOKUP($A65,FB_9,2,0))&IF(TYPE(VLOOKUP($A65,FB_10,2,0))=16,\"\",VLOOKUP($A65,FB_10,2,0))&IF(TYPE(VLOOKUP($A65,FB_11,2,0))=16,\"\",VLOOKUP($A65,FB_11,2,0))&IF(TYPE(VLOOKUP($A65,FB_12,2,0))=16,\"\",VLOOKUP($A65,FB_12,2,0))&IF(TYPE(VLOOKUP($A65,FB_13,2,0))=16,\"\",VLOOKUP($A65,FB_13,2,0))&IF(TYPE(VLOOKUP($A65,FB_14,2,0))=16,\"\",VLOOKUP($A65,FB_14,2,0))&IF(TYPE(VLOOKUP($A65,FB_15,2,0))=16,\"\",VLOOKUP($A65,FB_15,2,0))&IF(TYPE(VLOOKUP($A65,FB_16,2,0))=16,\"\",VLOOKUP($A65,FB_16,2,0))&IF(TYPE(VLOOKUP($A65,FB_17,2,0))=16,\"\",VLOOKUP($A65,FB_17,2,0))&IF(TYPE(VLOOKUP($A65,FB_18,2,0))=16,\"\",VLOOKUP($A65,FB_18,2,0))&IF(TYPE(VLOOKUP($A65,FB_19,2,0))=16,\"\",VLOOKUP($A65,FB_19,2,0))&IF(TYPE(VLOOKUP($A65,FB_20,2,0))=16,\"\",VLOOKUP($A65,FB_20,2,0))&IF(TYPE(VLOOKUP($A65,FB_21,2,0))=16,\"\",VLOOKUP($A65,FB_21,2,0))&IF(TYPE(VLOOKUP($A65,FB_22,2,0))=16,\"\",VLOOKUP($A65,FB_22,2,0))&IF(TYPE(VLOOKUP($A65,FB_23,2,0))=16,\"\",VLOOKUP($A65,FB_23,2,0))&IF(TYPE(VLOOKUP($A65,FB_24,2,0))=16,\"\",VLOOKUP($A65,FB_24,2,0))&IF(TYPE(VLOOKUP($A65,FB_25,2,0))=16,\"\",VLOOKUP($A65,FB_25,2,0))&IF(TYPE(VLOOKUP($A65,FB_26,2,0))=16,\"\",VLOOKUP($A65,FB_26,2,0))&IF(TYPE(VLOOKUP($A65,FB_27,2,0))=16,\"\",VLOOKUP($A65,FB_27,2,0))&IF(TYPE(VLOOKUP($A65,FB_28,2,0))=16,\"\",VLOOKUP($A65,FB_28,2,0))&IF(TYPE(VLOOKUP($A65,FB_29,2,0))=16,\"\",VLOOKUP($A65,FB_29,2,0))&IF(TYPE(VLOOKUP($A65,FB_30,2,0))=16,\"\",VLOOKUP($A65,FB_30,2,0))","v":""},null,{"$f":"IF($B65=\"\",\"\",_xlfn.NUMBERVALUE(IF(TYPE(VLOOKUP($A65,FB_1,P$5,0))=16,\"\",VLOOKUP($A65,FB_1,P$5,0))&IF(TYPE(VLOOKUP($A65,FB_2,P$5,0))=16,\"\",VLOOKUP($A65,FB_2,P$5,0))&IF(TYPE(VLOOKUP($A65,FB_3,P$5,0))=16,\"\",VLOOKUP($A65,FB_3,P$5,0))&IF(TYPE(VLOOKUP($A65,FB_4,P$5,0))=16,\"\",VLOOKUP($A65,FB_4,P$5,0))&IF(TYPE(VLOOKUP($A65,FB_5,P$5,0))=16,\"\",VLOOKUP($A65,FB_5,P$5,0))&IF(TYPE(VLOOKUP($A65,FB_6,P$5,0))=16,\"\",VLOOKUP($A65,FB_6,P$5,0))&IF(TYPE(VLOOKUP($A65,FB_7,P$5,0))=16,\"\",VLOOKUP($A65,FB_7,P$5,0))&IF(TYPE(VLOOKUP($A65,FB_8,P$5,0))=16,\"\",VLOOKUP($A65,FB_8,P$5,0))&IF(TYPE(VLOOKUP($A65,FB_9,P$5,0))=16,\"\",VLOOKUP($A65,FB_9,P$5,0))&IF(TYPE(VLOOKUP($A65,FB_10,P$5,0))=16,\"\",VLOOKUP($A65,FB_10,P$5,0))&IF(TYPE(VLOOKUP($A65,FB_11,P$5,0))=16,\"\",VLOOKUP($A65,FB_11,P$5,0))&IF(TYPE(VLOOKUP($A65,FB_12,P$5,0))=16,\"\",VLOOKUP($A65,FB_12,P$5,0))&IF(TYPE(VLOOKUP($A65,FB_13,P$5,0))=16,\"\",VLOOKUP($A65,FB_13,P$5,0))&IF(TYPE(VLOOKUP($A65,FB_14,P$5,0))=16,\"\",VLOOKUP($A65,FB_14,P$5,0))&IF(TYPE(VLOOKUP($A65,FB_15,P$5,0))=16,\"\",VLOOKUP($A65,FB_15,P$5,0))&IF(TYPE(VLOOKUP($A65,FB_16,P$5,0))=16,\"\",VLOOKUP($A65,FB_16,P$5,0))&IF(TYPE(VLOOKUP($A65,FB_17,P$5,0))=16,\"\",VLOOKUP($A65,FB_17,P$5,0))&IF(TYPE(VLOOKUP($A65,FB_18,P$5,0))=16,\"\",VLOOKUP($A65,FB_18,P$5,0))&IF(TYPE(VLOOKUP($A65,FB_19,P$5,0))=16,\"\",VLOOKUP($A65,FB_19,P$5,0))&IF(TYPE(VLOOKUP($A65,FB_20,P$5,0))=16,\"\",VLOOKUP($A65,FB_20,P$5,0))&IF(TYPE(VLOOKUP($A65,FB_21,P$5,0))=16,\"\",VLOOKUP($A65,FB_21,P$5,0))&IF(TYPE(VLOOKUP($A65,FB_22,P$5,0))=16,\"\",VLOOKUP($A65,FB_22,P$5,0))&IF(TYPE(VLOOKUP($A65,FB_23,P$5,0))=16,\"\",VLOOKUP($A65,FB_23,P$5,0))&IF(TYPE(VLOOKUP($A65,FB_24,P$5,0))=16,\"\",VLOOKUP($A65,FB_24,P$5,0))&IF(TYPE(VLOOKUP($A65,FB_25,P$5,0))=16,\"\",VLOOKUP($A65,FB_25,P$5,0))&IF(TYPE(VLOOKUP($A65,FB_26,P$5,0))=16,\"\",VLOOKUP($A65,FB_26,P$5,0))&IF(TYPE(VLOOKUP($A65,FB_27,P$5,0))=16,\"\",VLOOKUP($A65,FB_27,P$5,0))&IF(TYPE(VLOOKUP($A65,FB_28,P$5,0))=16,\"\",VLOOKUP($A65,FB_28,P$5,0))&IF(TYPE(VLOOKUP($A65,FB_29,P$5,0))=16,\"\",VLOOKUP($A65,FB_29,P$5,0))&IF(TYPE(VLOOKUP($A65,FB_30,P$5,0))=16,\"\",VLOOKUP($A65,FB_30,P$5,0))))","v":""},"",{"$f":"IF($B65=\"\",\"\",_xlfn.NUMBERVALUE(IF(TYPE(VLOOKUP($A65,FB_1,R$5,0))=16,\"\",VLOOKUP($A65,FB_1,R$5,0))&IF(TYPE(VLOOKUP($A65,FB_2,R$5,0))=16,\"\",VLOOKUP($A65,FB_2,R$5,0))&IF(TYPE(VLOOKUP($A65,FB_3,R$5,0))=16,\"\",VLOOKUP($A65,FB_3,R$5,0))&IF(TYPE(VLOOKUP($A65,FB_4,R$5,0))=16,\"\",VLOOKUP($A65,FB_4,R$5,0))&IF(TYPE(VLOOKUP($A65,FB_5,R$5,0))=16,\"\",VLOOKUP($A65,FB_5,R$5,0))&IF(TYPE(VLOOKUP($A65,FB_6,R$5,0))=16,\"\",VLOOKUP($A65,FB_6,R$5,0))&IF(TYPE(VLOOKUP($A65,FB_7,R$5,0))=16,\"\",VLOOKUP($A65,FB_7,R$5,0))&IF(TYPE(VLOOKUP($A65,FB_8,R$5,0))=16,\"\",VLOOKUP($A65,FB_8,R$5,0))&IF(TYPE(VLOOKUP($A65,FB_9,R$5,0))=16,\"\",VLOOKUP($A65,FB_9,R$5,0))&IF(TYPE(VLOOKUP($A65,FB_10,R$5,0))=16,\"\",VLOOKUP($A65,FB_10,R$5,0))&IF(TYPE(VLOOKUP($A65,FB_11,R$5,0))=16,\"\",VLOOKUP($A65,FB_11,R$5,0))&IF(TYPE(VLOOKUP($A65,FB_12,R$5,0))=16,\"\",VLOOKUP($A65,FB_12,R$5,0))&IF(TYPE(VLOOKUP($A65,FB_13,R$5,0))=16,\"\",VLOOKUP($A65,FB_13,R$5,0))&IF(TYPE(VLOOKUP($A65,FB_14,R$5,0))=16,\"\",VLOOKUP($A65,FB_14,R$5,0))&IF(TYPE(VLOOKUP($A65,FB_15,R$5,0))=16,\"\",VLOOKUP($A65,FB_15,R$5,0))&IF(TYPE(VLOOKUP($A65,FB_16,R$5,0))=16,\"\",VLOOKUP($A65,FB_16,R$5,0))&IF(TYPE(VLOOKUP($A65,FB_17,R$5,0))=16,\"\",VLOOKUP($A65,FB_17,R$5,0))&IF(TYPE(VLOOKUP($A65,FB_18,R$5,0))=16,\"\",VLOOKUP($A65,FB_18,R$5,0))&IF(TYPE(VLOOKUP($A65,FB_19,R$5,0))=16,\"\",VLOOKUP($A65,FB_19,R$5,0))&IF(TYPE(VLOOKUP($A65,FB_20,R$5,0))=16,\"\",VLOOKUP($A65,FB_20,R$5,0))&IF(TYPE(VLOOKUP($A65,FB_21,R$5,0))=16,\"\",VLOOKUP($A65,FB_21,R$5,0))&IF(TYPE(VLOOKUP($A65,FB_22,R$5,0))=16,\"\",VLOOKUP($A65,FB_22,R$5,0))&IF(TYPE(VLOOKUP($A65,FB_23,R$5,0))=16,\"\",VLOOKUP($A65,FB_23,R$5,0))&IF(TYPE(VLOOKUP($A65,FB_24,R$5,0))=16,\"\",VLOOKUP($A65,FB_24,R$5,0))&IF(TYPE(VLOOKUP($A65,FB_25,R$5,0))=16,\"\",VLOOKUP($A65,FB_25,R$5,0))&IF(TYPE(VLOOKUP($A65,FB_26,R$5,0))=16,\"\",VLOOKUP($A65,FB_26,R$5,0))&IF(TYPE(VLOOKUP($A65,FB_27,R$5,0))=16,\"\",VLOOKUP($A65,FB_27,R$5,0))&IF(TYPE(VLOOKUP($A65,FB_28,R$5,0))=16,\"\",VLOOKUP($A65,FB_28,R$5,0))&IF(TYPE(VLOOKUP($A65,FB_29,R$5,0))=16,\"\",VLOOKUP($A65,FB_29,R$5,0))&IF(TYPE(VLOOKUP($A65,FB_30,R$5,0))=16,\"\",VLOOKUP($A65,FB_30,R$5,0))))","v":""},{"$f":"IF($B65=\"\",\"\",IF(TYPE(VLOOKUP($A65,FB_1,S$5,0))=16,\"\",VLOOKUP($A65,FB_1,S$5,0))&IF(TYPE(VLOOKUP($A65,FB_2,S$5,0))=16,\"\",VLOOKUP($A65,FB_2,S$5,0))&IF(TYPE(VLOOKUP($A65,FB_3,S$5,0))=16,\"\",VLOOKUP($A65,FB_3,S$5,0))&IF(TYPE(VLOOKUP($A65,FB_4,S$5,0))=16,\"\",VLOOKUP($A65,FB_4,S$5,0))&IF(TYPE(VLOOKUP($A65,FB_5,S$5,0))=16,\"\",VLOOKUP($A65,FB_5,S$5,0))&IF(TYPE(VLOOKUP($A65,FB_6,S$5,0))=16,\"\",VLOOKUP($A65,FB_6,S$5,0))&IF(TYPE(VLOOKUP($A65,FB_7,S$5,0))=16,\"\",VLOOKUP($A65,FB_7,S$5,0))&IF(TYPE(VLOOKUP($A65,FB_8,S$5,0))=16,\"\",VLOOKUP($A65,FB_8,S$5,0))&IF(TYPE(VLOOKUP($A65,FB_9,S$5,0))=16,\"\",VLOOKUP($A65,FB_9,S$5,0))&IF(TYPE(VLOOKUP($A65,FB_10,S$5,0))=16,\"\",VLOOKUP($A65,FB_10,S$5,0))&IF(TYPE(VLOOKUP($A65,FB_11,S$5,0))=16,\"\",VLOOKUP($A65,FB_11,S$5,0))&IF(TYPE(VLOOKUP($A65,FB_12,S$5,0))=16,\"\",VLOOKUP($A65,FB_12,S$5,0))&IF(TYPE(VLOOKUP($A65,FB_13,S$5,0))=16,\"\",VLOOKUP($A65,FB_13,S$5,0))&IF(TYPE(VLOOKUP($A65,FB_14,S$5,0))=16,\"\",VLOOKUP($A65,FB_14,S$5,0))&IF(TYPE(VLOOKUP($A65,FB_15,S$5,0))=16,\"\",VLOOKUP($A65,FB_15,S$5,0))&IF(TYPE(VLOOKUP($A65,FB_16,S$5,0))=16,\"\",VLOOKUP($A65,FB_16,S$5,0))&IF(TYPE(VLOOKUP($A65,FB_17,S$5,0))=16,\"\",VLOOKUP($A65,FB_17,S$5,0))&IF(TYPE(VLOOKUP($A65,FB_18,S$5,0))=16,\"\",VLOOKUP($A65,FB_18,S$5,0))&IF(TYPE(VLOOKUP($A65,FB_19,S$5,0))=16,\"\",VLOOKUP($A65,FB_19,S$5,0))&IF(TYPE(VLOOKUP($A65,FB_20,S$5,0))=16,\"\",VLOOKUP($A65,FB_20,S$5,0))&IF(TYPE(VLOOKUP($A65,FB_21,S$5,0))=16,\"\",VLOOKUP($A65,FB_21,S$5,0))&IF(TYPE(VLOOKUP($A65,FB_22,S$5,0))=16,\"\",VLOOKUP($A65,FB_22,S$5,0))&IF(TYPE(VLOOKUP($A65,FB_23,S$5,0))=16,\"\",VLOOKUP($A65,FB_23,S$5,0))&IF(TYPE(VLOOKUP($A65,FB_24,S$5,0))=16,\"\",VLOOKUP($A65,FB_24,S$5,0))&IF(TYPE(VLOOKUP($A65,FB_25,S$5,0))=16,\"\",VLOOKUP($A65,FB_25,S$5,0))&IF(TYPE(VLOOKUP($A65,FB_26,S$5,0))=16,\"\",VLOOKUP($A65,FB_26,S$5,0))&IF(TYPE(VLOOKUP($A65,FB_27,S$5,0))=16,\"\",VLOOKUP($A65,FB_27,S$5,0))&IF(TYPE(VLOOKUP($A65,FB_28,S$5,0))=16,\"\",VLOOKUP($A65,FB_28,S$5,0))&IF(TYPE(VLOOKUP($A65,FB_29,S$5,0))=16,\"\",VLOOKUP($A65,FB_29,S$5,0))&IF(TYPE(VLOOKUP($A65,FB_30,S$5,0))=16,\"\",VLOOKUP($A65,FB_30,S$5,0)))","v":""},null,null,null,null,null,null,null,null,null,null,null,null,null,null,null,null,"",":","","",""]
["37.",{"$f":"IF(TYPE(VLOOKUP($A66,FB_1,2,0))=16,\"\",VLOOKUP($A66,FB_1,2,0))&IF(TYPE(VLOOKUP($A66,FB_2,2,0))=16,\"\",VLOOKUP($A66,FB_2,2,0))&IF(TYPE(VLOOKUP($A66,FB_3,2,0))=16,\"\",VLOOKUP($A66,FB_3,2,0))&IF(TYPE(VLOOKUP($A66,FB_4,2,0))=16,\"\",VLOOKUP($A66,FB_4,2,0))&IF(TYPE(VLOOKUP($A66,FB_5,2,0))=16,\"\",VLOOKUP($A66,FB_5,2,0))&IF(TYPE(VLOOKUP($A66,FB_6,2,0))=16,\"\",VLOOKUP($A66,FB_6,2,0))&IF(TYPE(VLOOKUP($A66,FB_7,2,0))=16,\"\",VLOOKUP($A66,FB_7,2,0))&IF(TYPE(VLOOKUP($A66,FB_8,2,0))=16,\"\",VLOOKUP($A66,FB_8,2,0))&IF(TYPE(VLOOKUP($A66,FB_9,2,0))=16,\"\",VLOOKUP($A66,FB_9,2,0))&IF(TYPE(VLOOKUP($A66,FB_10,2,0))=16,\"\",VLOOKUP($A66,FB_10,2,0))&IF(TYPE(VLOOKUP($A66,FB_11,2,0))=16,\"\",VLOOKUP($A66,FB_11,2,0))&IF(TYPE(VLOOKUP($A66,FB_12,2,0))=16,\"\",VLOOKUP($A66,FB_12,2,0))&IF(TYPE(VLOOKUP($A66,FB_13,2,0))=16,\"\",VLOOKUP($A66,FB_13,2,0))&IF(TYPE(VLOOKUP($A66,FB_14,2,0))=16,\"\",VLOOKUP($A66,FB_14,2,0))&IF(TYPE(VLOOKUP($A66,FB_15,2,0))=16,\"\",VLOOKUP($A66,FB_15,2,0))&IF(TYPE(VLOOKUP($A66,FB_16,2,0))=16,\"\",VLOOKUP($A66,FB_16,2,0))&IF(TYPE(VLOOKUP($A66,FB_17,2,0))=16,\"\",VLOOKUP($A66,FB_17,2,0))&IF(TYPE(VLOOKUP($A66,FB_18,2,0))=16,\"\",VLOOKUP($A66,FB_18,2,0))&IF(TYPE(VLOOKUP($A66,FB_19,2,0))=16,\"\",VLOOKUP($A66,FB_19,2,0))&IF(TYPE(VLOOKUP($A66,FB_20,2,0))=16,\"\",VLOOKUP($A66,FB_20,2,0))&IF(TYPE(VLOOKUP($A66,FB_21,2,0))=16,\"\",VLOOKUP($A66,FB_21,2,0))&IF(TYPE(VLOOKUP($A66,FB_22,2,0))=16,\"\",VLOOKUP($A66,FB_22,2,0))&IF(TYPE(VLOOKUP($A66,FB_23,2,0))=16,\"\",VLOOKUP($A66,FB_23,2,0))&IF(TYPE(VLOOKUP($A66,FB_24,2,0))=16,\"\",VLOOKUP($A66,FB_24,2,0))&IF(TYPE(VLOOKUP($A66,FB_25,2,0))=16,\"\",VLOOKUP($A66,FB_25,2,0))&IF(TYPE(VLOOKUP($A66,FB_26,2,0))=16,\"\",VLOOKUP($A66,FB_26,2,0))&IF(TYPE(VLOOKUP($A66,FB_27,2,0))=16,\"\",VLOOKUP($A66,FB_27,2,0))&IF(TYPE(VLOOKUP($A66,FB_28,2,0))=16,\"\",VLOOKUP($A66,FB_28,2,0))&IF(TYPE(VLOOKUP($A66,FB_29,2,0))=16,\"\",VLOOKUP($A66,FB_29,2,0))&IF(TYPE(VLOOKUP($A66,FB_30,2,0))=16,\"\",VLOOKUP($A66,FB_30,2,0))","v":""},null,{"$f":"IF($B66=\"\",\"\",_xlfn.NUMBERVALUE(IF(TYPE(VLOOKUP($A66,FB_1,P$5,0))=16,\"\",VLOOKUP($A66,FB_1,P$5,0))&IF(TYPE(VLOOKUP($A66,FB_2,P$5,0))=16,\"\",VLOOKUP($A66,FB_2,P$5,0))&IF(TYPE(VLOOKUP($A66,FB_3,P$5,0))=16,\"\",VLOOKUP($A66,FB_3,P$5,0))&IF(TYPE(VLOOKUP($A66,FB_4,P$5,0))=16,\"\",VLOOKUP($A66,FB_4,P$5,0))&IF(TYPE(VLOOKUP($A66,FB_5,P$5,0))=16,\"\",VLOOKUP($A66,FB_5,P$5,0))&IF(TYPE(VLOOKUP($A66,FB_6,P$5,0))=16,\"\",VLOOKUP($A66,FB_6,P$5,0))&IF(TYPE(VLOOKUP($A66,FB_7,P$5,0))=16,\"\",VLOOKUP($A66,FB_7,P$5,0))&IF(TYPE(VLOOKUP($A66,FB_8,P$5,0))=16,\"\",VLOOKUP($A66,FB_8,P$5,0))&IF(TYPE(VLOOKUP($A66,FB_9,P$5,0))=16,\"\",VLOOKUP($A66,FB_9,P$5,0))&IF(TYPE(VLOOKUP($A66,FB_10,P$5,0))=16,\"\",VLOOKUP($A66,FB_10,P$5,0))&IF(TYPE(VLOOKUP($A66,FB_11,P$5,0))=16,\"\",VLOOKUP($A66,FB_11,P$5,0))&IF(TYPE(VLOOKUP($A66,FB_12,P$5,0))=16,\"\",VLOOKUP($A66,FB_12,P$5,0))&IF(TYPE(VLOOKUP($A66,FB_13,P$5,0))=16,\"\",VLOOKUP($A66,FB_13,P$5,0))&IF(TYPE(VLOOKUP($A66,FB_14,P$5,0))=16,\"\",VLOOKUP($A66,FB_14,P$5,0))&IF(TYPE(VLOOKUP($A66,FB_15,P$5,0))=16,\"\",VLOOKUP($A66,FB_15,P$5,0))&IF(TYPE(VLOOKUP($A66,FB_16,P$5,0))=16,\"\",VLOOKUP($A66,FB_16,P$5,0))&IF(TYPE(VLOOKUP($A66,FB_17,P$5,0))=16,\"\",VLOOKUP($A66,FB_17,P$5,0))&IF(TYPE(VLOOKUP($A66,FB_18,P$5,0))=16,\"\",VLOOKUP($A66,FB_18,P$5,0))&IF(TYPE(VLOOKUP($A66,FB_19,P$5,0))=16,\"\",VLOOKUP($A66,FB_19,P$5,0))&IF(TYPE(VLOOKUP($A66,FB_20,P$5,0))=16,\"\",VLOOKUP($A66,FB_20,P$5,0))&IF(TYPE(VLOOKUP($A66,FB_21,P$5,0))=16,\"\",VLOOKUP($A66,FB_21,P$5,0))&IF(TYPE(VLOOKUP($A66,FB_22,P$5,0))=16,\"\",VLOOKUP($A66,FB_22,P$5,0))&IF(TYPE(VLOOKUP($A66,FB_23,P$5,0))=16,\"\",VLOOKUP($A66,FB_23,P$5,0))&IF(TYPE(VLOOKUP($A66,FB_24,P$5,0))=16,\"\",VLOOKUP($A66,FB_24,P$5,0))&IF(TYPE(VLOOKUP($A66,FB_25,P$5,0))=16,\"\",VLOOKUP($A66,FB_25,P$5,0))&IF(TYPE(VLOOKUP($A66,FB_26,P$5,0))=16,\"\",VLOOKUP($A66,FB_26,P$5,0))&IF(TYPE(VLOOKUP($A66,FB_27,P$5,0))=16,\"\",VLOOKUP($A66,FB_27,P$5,0))&IF(TYPE(VLOOKUP($A66,FB_28,P$5,0))=16,\"\",VLOOKUP($A66,FB_28,P$5,0))&IF(TYPE(VLOOKUP($A66,FB_29,P$5,0))=16,\"\",VLOOKUP($A66,FB_29,P$5,0))&IF(TYPE(VLOOKUP($A66,FB_30,P$5,0))=16,\"\",VLOOKUP($A66,FB_30,P$5,0))))","v":""},"",{"$f":"IF($B66=\"\",\"\",_xlfn.NUMBERVALUE(IF(TYPE(VLOOKUP($A66,FB_1,R$5,0))=16,\"\",VLOOKUP($A66,FB_1,R$5,0))&IF(TYPE(VLOOKUP($A66,FB_2,R$5,0))=16,\"\",VLOOKUP($A66,FB_2,R$5,0))&IF(TYPE(VLOOKUP($A66,FB_3,R$5,0))=16,\"\",VLOOKUP($A66,FB_3,R$5,0))&IF(TYPE(VLOOKUP($A66,FB_4,R$5,0))=16,\"\",VLOOKUP($A66,FB_4,R$5,0))&IF(TYPE(VLOOKUP($A66,FB_5,R$5,0))=16,\"\",VLOOKUP($A66,FB_5,R$5,0))&IF(TYPE(VLOOKUP($A66,FB_6,R$5,0))=16,\"\",VLOOKUP($A66,FB_6,R$5,0))&IF(TYPE(VLOOKUP($A66,FB_7,R$5,0))=16,\"\",VLOOKUP($A66,FB_7,R$5,0))&IF(TYPE(VLOOKUP($A66,FB_8,R$5,0))=16,\"\",VLOOKUP($A66,FB_8,R$5,0))&IF(TYPE(VLOOKUP($A66,FB_9,R$5,0))=16,\"\",VLOOKUP($A66,FB_9,R$5,0))&IF(TYPE(VLOOKUP($A66,FB_10,R$5,0))=16,\"\",VLOOKUP($A66,FB_10,R$5,0))&IF(TYPE(VLOOKUP($A66,FB_11,R$5,0))=16,\"\",VLOOKUP($A66,FB_11,R$5,0))&IF(TYPE(VLOOKUP($A66,FB_12,R$5,0))=16,\"\",VLOOKUP($A66,FB_12,R$5,0))&IF(TYPE(VLOOKUP($A66,FB_13,R$5,0))=16,\"\",VLOOKUP($A66,FB_13,R$5,0))&IF(TYPE(VLOOKUP($A66,FB_14,R$5,0))=16,\"\",VLOOKUP($A66,FB_14,R$5,0))&IF(TYPE(VLOOKUP($A66,FB_15,R$5,0))=16,\"\",VLOOKUP($A66,FB_15,R$5,0))&IF(TYPE(VLOOKUP($A66,FB_16,R$5,0))=16,\"\",VLOOKUP($A66,FB_16,R$5,0))&IF(TYPE(VLOOKUP($A66,FB_17,R$5,0))=16,\"\",VLOOKUP($A66,FB_17,R$5,0))&IF(TYPE(VLOOKUP($A66,FB_18,R$5,0))=16,\"\",VLOOKUP($A66,FB_18,R$5,0))&IF(TYPE(VLOOKUP($A66,FB_19,R$5,0))=16,\"\",VLOOKUP($A66,FB_19,R$5,0))&IF(TYPE(VLOOKUP($A66,FB_20,R$5,0))=16,\"\",VLOOKUP($A66,FB_20,R$5,0))&IF(TYPE(VLOOKUP($A66,FB_21,R$5,0))=16,\"\",VLOOKUP($A66,FB_21,R$5,0))&IF(TYPE(VLOOKUP($A66,FB_22,R$5,0))=16,\"\",VLOOKUP($A66,FB_22,R$5,0))&IF(TYPE(VLOOKUP($A66,FB_23,R$5,0))=16,\"\",VLOOKUP($A66,FB_23,R$5,0))&IF(TYPE(VLOOKUP($A66,FB_24,R$5,0))=16,\"\",VLOOKUP($A66,FB_24,R$5,0))&IF(TYPE(VLOOKUP($A66,FB_25,R$5,0))=16,\"\",VLOOKUP($A66,FB_25,R$5,0))&IF(TYPE(VLOOKUP($A66,FB_26,R$5,0))=16,\"\",VLOOKUP($A66,FB_26,R$5,0))&IF(TYPE(VLOOKUP($A66,FB_27,R$5,0))=16,\"\",VLOOKUP($A66,FB_27,R$5,0))&IF(TYPE(VLOOKUP($A66,FB_28,R$5,0))=16,\"\",VLOOKUP($A66,FB_28,R$5,0))&IF(TYPE(VLOOKUP($A66,FB_29,R$5,0))=16,\"\",VLOOKUP($A66,FB_29,R$5,0))&IF(TYPE(VLOOKUP($A66,FB_30,R$5,0))=16,\"\",VLOOKUP($A66,FB_30,R$5,0))))","v":""},{"$f":"IF($B66=\"\",\"\",IF(TYPE(VLOOKUP($A66,FB_1,S$5,0))=16,\"\",VLOOKUP($A66,FB_1,S$5,0))&IF(TYPE(VLOOKUP($A66,FB_2,S$5,0))=16,\"\",VLOOKUP($A66,FB_2,S$5,0))&IF(TYPE(VLOOKUP($A66,FB_3,S$5,0))=16,\"\",VLOOKUP($A66,FB_3,S$5,0))&IF(TYPE(VLOOKUP($A66,FB_4,S$5,0))=16,\"\",VLOOKUP($A66,FB_4,S$5,0))&IF(TYPE(VLOOKUP($A66,FB_5,S$5,0))=16,\"\",VLOOKUP($A66,FB_5,S$5,0))&IF(TYPE(VLOOKUP($A66,FB_6,S$5,0))=16,\"\",VLOOKUP($A66,FB_6,S$5,0))&IF(TYPE(VLOOKUP($A66,FB_7,S$5,0))=16,\"\",VLOOKUP($A66,FB_7,S$5,0))&IF(TYPE(VLOOKUP($A66,FB_8,S$5,0))=16,\"\",VLOOKUP($A66,FB_8,S$5,0))&IF(TYPE(VLOOKUP($A66,FB_9,S$5,0))=16,\"\",VLOOKUP($A66,FB_9,S$5,0))&IF(TYPE(VLOOKUP($A66,FB_10,S$5,0))=16,\"\",VLOOKUP($A66,FB_10,S$5,0))&IF(TYPE(VLOOKUP($A66,FB_11,S$5,0))=16,\"\",VLOOKUP($A66,FB_11,S$5,0))&IF(TYPE(VLOOKUP($A66,FB_12,S$5,0))=16,\"\",VLOOKUP($A66,FB_12,S$5,0))&IF(TYPE(VLOOKUP($A66,FB_13,S$5,0))=16,\"\",VLOOKUP($A66,FB_13,S$5,0))&IF(TYPE(VLOOKUP($A66,FB_14,S$5,0))=16,\"\",VLOOKUP($A66,FB_14,S$5,0))&IF(TYPE(VLOOKUP($A66,FB_15,S$5,0))=16,\"\",VLOOKUP($A66,FB_15,S$5,0))&IF(TYPE(VLOOKUP($A66,FB_16,S$5,0))=16,\"\",VLOOKUP($A66,FB_16,S$5,0))&IF(TYPE(VLOOKUP($A66,FB_17,S$5,0))=16,\"\",VLOOKUP($A66,FB_17,S$5,0))&IF(TYPE(VLOOKUP($A66,FB_18,S$5,0))=16,\"\",VLOOKUP($A66,FB_18,S$5,0))&IF(TYPE(VLOOKUP($A66,FB_19,S$5,0))=16,\"\",VLOOKUP($A66,FB_19,S$5,0))&IF(TYPE(VLOOKUP($A66,FB_20,S$5,0))=16,\"\",VLOOKUP($A66,FB_20,S$5,0))&IF(TYPE(VLOOKUP($A66,FB_21,S$5,0))=16,\"\",VLOOKUP($A66,FB_21,S$5,0))&IF(TYPE(VLOOKUP($A66,FB_22,S$5,0))=16,\"\",VLOOKUP($A66,FB_22,S$5,0))&IF(TYPE(VLOOKUP($A66,FB_23,S$5,0))=16,\"\",VLOOKUP($A66,FB_23,S$5,0))&IF(TYPE(VLOOKUP($A66,FB_24,S$5,0))=16,\"\",VLOOKUP($A66,FB_24,S$5,0))&IF(TYPE(VLOOKUP($A66,FB_25,S$5,0))=16,\"\",VLOOKUP($A66,FB_25,S$5,0))&IF(TYPE(VLOOKUP($A66,FB_26,S$5,0))=16,\"\",VLOOKUP($A66,FB_26,S$5,0))&IF(TYPE(VLOOKUP($A66,FB_27,S$5,0))=16,\"\",VLOOKUP($A66,FB_27,S$5,0))&IF(TYPE(VLOOKUP($A66,FB_28,S$5,0))=16,\"\",VLOOKUP($A66,FB_28,S$5,0))&IF(TYPE(VLOOKUP($A66,FB_29,S$5,0))=16,\"\",VLOOKUP($A66,FB_29,S$5,0))&IF(TYPE(VLOOKUP($A66,FB_30,S$5,0))=16,\"\",VLOOKUP($A66,FB_30,S$5,0)))","v":""},null,null,null,null,null,null,null,null,null,null,null,null,null,null,null,null,"",":","","",""]
["38.",{"$f":"IF(TYPE(VLOOKUP($A67,FB_1,2,0))=16,\"\",VLOOKUP($A67,FB_1,2,0))&IF(TYPE(VLOOKUP($A67,FB_2,2,0))=16,\"\",VLOOKUP($A67,FB_2,2,0))&IF(TYPE(VLOOKUP($A67,FB_3,2,0))=16,\"\",VLOOKUP($A67,FB_3,2,0))&IF(TYPE(VLOOKUP($A67,FB_4,2,0))=16,\"\",VLOOKUP($A67,FB_4,2,0))&IF(TYPE(VLOOKUP($A67,FB_5,2,0))=16,\"\",VLOOKUP($A67,FB_5,2,0))&IF(TYPE(VLOOKUP($A67,FB_6,2,0))=16,\"\",VLOOKUP($A67,FB_6,2,0))&IF(TYPE(VLOOKUP($A67,FB_7,2,0))=16,\"\",VLOOKUP($A67,FB_7,2,0))&IF(TYPE(VLOOKUP($A67,FB_8,2,0))=16,\"\",VLOOKUP($A67,FB_8,2,0))&IF(TYPE(VLOOKUP($A67,FB_9,2,0))=16,\"\",VLOOKUP($A67,FB_9,2,0))&IF(TYPE(VLOOKUP($A67,FB_10,2,0))=16,\"\",VLOOKUP($A67,FB_10,2,0))&IF(TYPE(VLOOKUP($A67,FB_11,2,0))=16,\"\",VLOOKUP($A67,FB_11,2,0))&IF(TYPE(VLOOKUP($A67,FB_12,2,0))=16,\"\",VLOOKUP($A67,FB_12,2,0))&IF(TYPE(VLOOKUP($A67,FB_13,2,0))=16,\"\",VLOOKUP($A67,FB_13,2,0))&IF(TYPE(VLOOKUP($A67,FB_14,2,0))=16,\"\",VLOOKUP($A67,FB_14,2,0))&IF(TYPE(VLOOKUP($A67,FB_15,2,0))=16,\"\",VLOOKUP($A67,FB_15,2,0))&IF(TYPE(VLOOKUP($A67,FB_16,2,0))=16,\"\",VLOOKUP($A67,FB_16,2,0))&IF(TYPE(VLOOKUP($A67,FB_17,2,0))=16,\"\",VLOOKUP($A67,FB_17,2,0))&IF(TYPE(VLOOKUP($A67,FB_18,2,0))=16,\"\",VLOOKUP($A67,FB_18,2,0))&IF(TYPE(VLOOKUP($A67,FB_19,2,0))=16,\"\",VLOOKUP($A67,FB_19,2,0))&IF(TYPE(VLOOKUP($A67,FB_20,2,0))=16,\"\",VLOOKUP($A67,FB_20,2,0))&IF(TYPE(VLOOKUP($A67,FB_21,2,0))=16,\"\",VLOOKUP($A67,FB_21,2,0))&IF(TYPE(VLOOKUP($A67,FB_22,2,0))=16,\"\",VLOOKUP($A67,FB_22,2,0))&IF(TYPE(VLOOKUP($A67,FB_23,2,0))=16,\"\",VLOOKUP($A67,FB_23,2,0))&IF(TYPE(VLOOKUP($A67,FB_24,2,0))=16,\"\",VLOOKUP($A67,FB_24,2,0))&IF(TYPE(VLOOKUP($A67,FB_25,2,0))=16,\"\",VLOOKUP($A67,FB_25,2,0))&IF(TYPE(VLOOKUP($A67,FB_26,2,0))=16,\"\",VLOOKUP($A67,FB_26,2,0))&IF(TYPE(VLOOKUP($A67,FB_27,2,0))=16,\"\",VLOOKUP($A67,FB_27,2,0))&IF(TYPE(VLOOKUP($A67,FB_28,2,0))=16,\"\",VLOOKUP($A67,FB_28,2,0))&IF(TYPE(VLOOKUP($A67,FB_29,2,0))=16,\"\",VLOOKUP($A67,FB_29,2,0))&IF(TYPE(VLOOKUP($A67,FB_30,2,0))=16,\"\",VLOOKUP($A67,FB_30,2,0))","v":""},null,{"$f":"IF($B67=\"\",\"\",_xlfn.NUMBERVALUE(IF(TYPE(VLOOKUP($A67,FB_1,P$5,0))=16,\"\",VLOOKUP($A67,FB_1,P$5,0))&IF(TYPE(VLOOKUP($A67,FB_2,P$5,0))=16,\"\",VLOOKUP($A67,FB_2,P$5,0))&IF(TYPE(VLOOKUP($A67,FB_3,P$5,0))=16,\"\",VLOOKUP($A67,FB_3,P$5,0))&IF(TYPE(VLOOKUP($A67,FB_4,P$5,0))=16,\"\",VLOOKUP($A67,FB_4,P$5,0))&IF(TYPE(VLOOKUP($A67,FB_5,P$5,0))=16,\"\",VLOOKUP($A67,FB_5,P$5,0))&IF(TYPE(VLOOKUP($A67,FB_6,P$5,0))=16,\"\",VLOOKUP($A67,FB_6,P$5,0))&IF(TYPE(VLOOKUP($A67,FB_7,P$5,0))=16,\"\",VLOOKUP($A67,FB_7,P$5,0))&IF(TYPE(VLOOKUP($A67,FB_8,P$5,0))=16,\"\",VLOOKUP($A67,FB_8,P$5,0))&IF(TYPE(VLOOKUP($A67,FB_9,P$5,0))=16,\"\",VLOOKUP($A67,FB_9,P$5,0))&IF(TYPE(VLOOKUP($A67,FB_10,P$5,0))=16,\"\",VLOOKUP($A67,FB_10,P$5,0))&IF(TYPE(VLOOKUP($A67,FB_11,P$5,0))=16,\"\",VLOOKUP($A67,FB_11,P$5,0))&IF(TYPE(VLOOKUP($A67,FB_12,P$5,0))=16,\"\",VLOOKUP($A67,FB_12,P$5,0))&IF(TYPE(VLOOKUP($A67,FB_13,P$5,0))=16,\"\",VLOOKUP($A67,FB_13,P$5,0))&IF(TYPE(VLOOKUP($A67,FB_14,P$5,0))=16,\"\",VLOOKUP($A67,FB_14,P$5,0))&IF(TYPE(VLOOKUP($A67,FB_15,P$5,0))=16,\"\",VLOOKUP($A67,FB_15,P$5,0))&IF(TYPE(VLOOKUP($A67,FB_16,P$5,0))=16,\"\",VLOOKUP($A67,FB_16,P$5,0))&IF(TYPE(VLOOKUP($A67,FB_17,P$5,0))=16,\"\",VLOOKUP($A67,FB_17,P$5,0))&IF(TYPE(VLOOKUP($A67,FB_18,P$5,0))=16,\"\",VLOOKUP($A67,FB_18,P$5,0))&IF(TYPE(VLOOKUP($A67,FB_19,P$5,0))=16,\"\",VLOOKUP($A67,FB_19,P$5,0))&IF(TYPE(VLOOKUP($A67,FB_20,P$5,0))=16,\"\",VLOOKUP($A67,FB_20,P$5,0))&IF(TYPE(VLOOKUP($A67,FB_21,P$5,0))=16,\"\",VLOOKUP($A67,FB_21,P$5,0))&IF(TYPE(VLOOKUP($A67,FB_22,P$5,0))=16,\"\",VLOOKUP($A67,FB_22,P$5,0))&IF(TYPE(VLOOKUP($A67,FB_23,P$5,0))=16,\"\",VLOOKUP($A67,FB_23,P$5,0))&IF(TYPE(VLOOKUP($A67,FB_24,P$5,0))=16,\"\",VLOOKUP($A67,FB_24,P$5,0))&IF(TYPE(VLOOKUP($A67,FB_25,P$5,0))=16,\"\",VLOOKUP($A67,FB_25,P$5,0))&IF(TYPE(VLOOKUP($A67,FB_26,P$5,0))=16,\"\",VLOOKUP($A67,FB_26,P$5,0))&IF(TYPE(VLOOKUP($A67,FB_27,P$5,0))=16,\"\",VLOOKUP($A67,FB_27,P$5,0))&IF(TYPE(VLOOKUP($A67,FB_28,P$5,0))=16,\"\",VLOOKUP($A67,FB_28,P$5,0))&IF(TYPE(VLOOKUP($A67,FB_29,P$5,0))=16,\"\",VLOOKUP($A67,FB_29,P$5,0))&IF(TYPE(VLOOKUP($A67,FB_30,P$5,0))=16,\"\",VLOOKUP($A67,FB_30,P$5,0))))","v":""},"",{"$f":"IF($B67=\"\",\"\",_xlfn.NUMBERVALUE(IF(TYPE(VLOOKUP($A67,FB_1,R$5,0))=16,\"\",VLOOKUP($A67,FB_1,R$5,0))&IF(TYPE(VLOOKUP($A67,FB_2,R$5,0))=16,\"\",VLOOKUP($A67,FB_2,R$5,0))&IF(TYPE(VLOOKUP($A67,FB_3,R$5,0))=16,\"\",VLOOKUP($A67,FB_3,R$5,0))&IF(TYPE(VLOOKUP($A67,FB_4,R$5,0))=16,\"\",VLOOKUP($A67,FB_4,R$5,0))&IF(TYPE(VLOOKUP($A67,FB_5,R$5,0))=16,\"\",VLOOKUP($A67,FB_5,R$5,0))&IF(TYPE(VLOOKUP($A67,FB_6,R$5,0))=16,\"\",VLOOKUP($A67,FB_6,R$5,0))&IF(TYPE(VLOOKUP($A67,FB_7,R$5,0))=16,\"\",VLOOKUP($A67,FB_7,R$5,0))&IF(TYPE(VLOOKUP($A67,FB_8,R$5,0))=16,\"\",VLOOKUP($A67,FB_8,R$5,0))&IF(TYPE(VLOOKUP($A67,FB_9,R$5,0))=16,\"\",VLOOKUP($A67,FB_9,R$5,0))&IF(TYPE(VLOOKUP($A67,FB_10,R$5,0))=16,\"\",VLOOKUP($A67,FB_10,R$5,0))&IF(TYPE(VLOOKUP($A67,FB_11,R$5,0))=16,\"\",VLOOKUP($A67,FB_11,R$5,0))&IF(TYPE(VLOOKUP($A67,FB_12,R$5,0))=16,\"\",VLOOKUP($A67,FB_12,R$5,0))&IF(TYPE(VLOOKUP($A67,FB_13,R$5,0))=16,\"\",VLOOKUP($A67,FB_13,R$5,0))&IF(TYPE(VLOOKUP($A67,FB_14,R$5,0))=16,\"\",VLOOKUP($A67,FB_14,R$5,0))&IF(TYPE(VLOOKUP($A67,FB_15,R$5,0))=16,\"\",VLOOKUP($A67,FB_15,R$5,0))&IF(TYPE(VLOOKUP($A67,FB_16,R$5,0))=16,\"\",VLOOKUP($A67,FB_16,R$5,0))&IF(TYPE(VLOOKUP($A67,FB_17,R$5,0))=16,\"\",VLOOKUP($A67,FB_17,R$5,0))&IF(TYPE(VLOOKUP($A67,FB_18,R$5,0))=16,\"\",VLOOKUP($A67,FB_18,R$5,0))&IF(TYPE(VLOOKUP($A67,FB_19,R$5,0))=16,\"\",VLOOKUP($A67,FB_19,R$5,0))&IF(TYPE(VLOOKUP($A67,FB_20,R$5,0))=16,\"\",VLOOKUP($A67,FB_20,R$5,0))&IF(TYPE(VLOOKUP($A67,FB_21,R$5,0))=16,\"\",VLOOKUP($A67,FB_21,R$5,0))&IF(TYPE(VLOOKUP($A67,FB_22,R$5,0))=16,\"\",VLOOKUP($A67,FB_22,R$5,0))&IF(TYPE(VLOOKUP($A67,FB_23,R$5,0))=16,\"\",VLOOKUP($A67,FB_23,R$5,0))&IF(TYPE(VLOOKUP($A67,FB_24,R$5,0))=16,\"\",VLOOKUP($A67,FB_24,R$5,0))&IF(TYPE(VLOOKUP($A67,FB_25,R$5,0))=16,\"\",VLOOKUP($A67,FB_25,R$5,0))&IF(TYPE(VLOOKUP($A67,FB_26,R$5,0))=16,\"\",VLOOKUP($A67,FB_26,R$5,0))&IF(TYPE(VLOOKUP($A67,FB_27,R$5,0))=16,\"\",VLOOKUP($A67,FB_27,R$5,0))&IF(TYPE(VLOOKUP($A67,FB_28,R$5,0))=16,\"\",VLOOKUP($A67,FB_28,R$5,0))&IF(TYPE(VLOOKUP($A67,FB_29,R$5,0))=16,\"\",VLOOKUP($A67,FB_29,R$5,0))&IF(TYPE(VLOOKUP($A67,FB_30,R$5,0))=16,\"\",VLOOKUP($A67,FB_30,R$5,0))))","v":""},{"$f":"IF($B67=\"\",\"\",IF(TYPE(VLOOKUP($A67,FB_1,S$5,0))=16,\"\",VLOOKUP($A67,FB_1,S$5,0))&IF(TYPE(VLOOKUP($A67,FB_2,S$5,0))=16,\"\",VLOOKUP($A67,FB_2,S$5,0))&IF(TYPE(VLOOKUP($A67,FB_3,S$5,0))=16,\"\",VLOOKUP($A67,FB_3,S$5,0))&IF(TYPE(VLOOKUP($A67,FB_4,S$5,0))=16,\"\",VLOOKUP($A67,FB_4,S$5,0))&IF(TYPE(VLOOKUP($A67,FB_5,S$5,0))=16,\"\",VLOOKUP($A67,FB_5,S$5,0))&IF(TYPE(VLOOKUP($A67,FB_6,S$5,0))=16,\"\",VLOOKUP($A67,FB_6,S$5,0))&IF(TYPE(VLOOKUP($A67,FB_7,S$5,0))=16,\"\",VLOOKUP($A67,FB_7,S$5,0))&IF(TYPE(VLOOKUP($A67,FB_8,S$5,0))=16,\"\",VLOOKUP($A67,FB_8,S$5,0))&IF(TYPE(VLOOKUP($A67,FB_9,S$5,0))=16,\"\",VLOOKUP($A67,FB_9,S$5,0))&IF(TYPE(VLOOKUP($A67,FB_10,S$5,0))=16,\"\",VLOOKUP($A67,FB_10,S$5,0))&IF(TYPE(VLOOKUP($A67,FB_11,S$5,0))=16,\"\",VLOOKUP($A67,FB_11,S$5,0))&IF(TYPE(VLOOKUP($A67,FB_12,S$5,0))=16,\"\",VLOOKUP($A67,FB_12,S$5,0))&IF(TYPE(VLOOKUP($A67,FB_13,S$5,0))=16,\"\",VLOOKUP($A67,FB_13,S$5,0))&IF(TYPE(VLOOKUP($A67,FB_14,S$5,0))=16,\"\",VLOOKUP($A67,FB_14,S$5,0))&IF(TYPE(VLOOKUP($A67,FB_15,S$5,0))=16,\"\",VLOOKUP($A67,FB_15,S$5,0))&IF(TYPE(VLOOKUP($A67,FB_16,S$5,0))=16,\"\",VLOOKUP($A67,FB_16,S$5,0))&IF(TYPE(VLOOKUP($A67,FB_17,S$5,0))=16,\"\",VLOOKUP($A67,FB_17,S$5,0))&IF(TYPE(VLOOKUP($A67,FB_18,S$5,0))=16,\"\",VLOOKUP($A67,FB_18,S$5,0))&IF(TYPE(VLOOKUP($A67,FB_19,S$5,0))=16,\"\",VLOOKUP($A67,FB_19,S$5,0))&IF(TYPE(VLOOKUP($A67,FB_20,S$5,0))=16,\"\",VLOOKUP($A67,FB_20,S$5,0))&IF(TYPE(VLOOKUP($A67,FB_21,S$5,0))=16,\"\",VLOOKUP($A67,FB_21,S$5,0))&IF(TYPE(VLOOKUP($A67,FB_22,S$5,0))=16,\"\",VLOOKUP($A67,FB_22,S$5,0))&IF(TYPE(VLOOKUP($A67,FB_23,S$5,0))=16,\"\",VLOOKUP($A67,FB_23,S$5,0))&IF(TYPE(VLOOKUP($A67,FB_24,S$5,0))=16,\"\",VLOOKUP($A67,FB_24,S$5,0))&IF(TYPE(VLOOKUP($A67,FB_25,S$5,0))=16,\"\",VLOOKUP($A67,FB_25,S$5,0))&IF(TYPE(VLOOKUP($A67,FB_26,S$5,0))=16,\"\",VLOOKUP($A67,FB_26,S$5,0))&IF(TYPE(VLOOKUP($A67,FB_27,S$5,0))=16,\"\",VLOOKUP($A67,FB_27,S$5,0))&IF(TYPE(VLOOKUP($A67,FB_28,S$5,0))=16,\"\",VLOOKUP($A67,FB_28,S$5,0))&IF(TYPE(VLOOKUP($A67,FB_29,S$5,0))=16,\"\",VLOOKUP($A67,FB_29,S$5,0))&IF(TYPE(VLOOKUP($A67,FB_30,S$5,0))=16,\"\",VLOOKUP($A67,FB_30,S$5,0)))","v":""},null,null,null,null,null,null,null,null,null,null,null,null,null,null,null,null,"",":","","",""]
["39.",{"$f":"IF(TYPE(VLOOKUP($A68,FB_1,2,0))=16,\"\",VLOOKUP($A68,FB_1,2,0))&IF(TYPE(VLOOKUP($A68,FB_2,2,0))=16,\"\",VLOOKUP($A68,FB_2,2,0))&IF(TYPE(VLOOKUP($A68,FB_3,2,0))=16,\"\",VLOOKUP($A68,FB_3,2,0))&IF(TYPE(VLOOKUP($A68,FB_4,2,0))=16,\"\",VLOOKUP($A68,FB_4,2,0))&IF(TYPE(VLOOKUP($A68,FB_5,2,0))=16,\"\",VLOOKUP($A68,FB_5,2,0))&IF(TYPE(VLOOKUP($A68,FB_6,2,0))=16,\"\",VLOOKUP($A68,FB_6,2,0))&IF(TYPE(VLOOKUP($A68,FB_7,2,0))=16,\"\",VLOOKUP($A68,FB_7,2,0))&IF(TYPE(VLOOKUP($A68,FB_8,2,0))=16,\"\",VLOOKUP($A68,FB_8,2,0))&IF(TYPE(VLOOKUP($A68,FB_9,2,0))=16,\"\",VLOOKUP($A68,FB_9,2,0))&IF(TYPE(VLOOKUP($A68,FB_10,2,0))=16,\"\",VLOOKUP($A68,FB_10,2,0))&IF(TYPE(VLOOKUP($A68,FB_11,2,0))=16,\"\",VLOOKUP($A68,FB_11,2,0))&IF(TYPE(VLOOKUP($A68,FB_12,2,0))=16,\"\",VLOOKUP($A68,FB_12,2,0))&IF(TYPE(VLOOKUP($A68,FB_13,2,0))=16,\"\",VLOOKUP($A68,FB_13,2,0))&IF(TYPE(VLOOKUP($A68,FB_14,2,0))=16,\"\",VLOOKUP($A68,FB_14,2,0))&IF(TYPE(VLOOKUP($A68,FB_15,2,0))=16,\"\",VLOOKUP($A68,FB_15,2,0))&IF(TYPE(VLOOKUP($A68,FB_16,2,0))=16,\"\",VLOOKUP($A68,FB_16,2,0))&IF(TYPE(VLOOKUP($A68,FB_17,2,0))=16,\"\",VLOOKUP($A68,FB_17,2,0))&IF(TYPE(VLOOKUP($A68,FB_18,2,0))=16,\"\",VLOOKUP($A68,FB_18,2,0))&IF(TYPE(VLOOKUP($A68,FB_19,2,0))=16,\"\",VLOOKUP($A68,FB_19,2,0))&IF(TYPE(VLOOKUP($A68,FB_20,2,0))=16,\"\",VLOOKUP($A68,FB_20,2,0))&IF(TYPE(VLOOKUP($A68,FB_21,2,0))=16,\"\",VLOOKUP($A68,FB_21,2,0))&IF(TYPE(VLOOKUP($A68,FB_22,2,0))=16,\"\",VLOOKUP($A68,FB_22,2,0))&IF(TYPE(VLOOKUP($A68,FB_23,2,0))=16,\"\",VLOOKUP($A68,FB_23,2,0))&IF(TYPE(VLOOKUP($A68,FB_24,2,0))=16,\"\",VLOOKUP($A68,FB_24,2,0))&IF(TYPE(VLOOKUP($A68,FB_25,2,0))=16,\"\",VLOOKUP($A68,FB_25,2,0))&IF(TYPE(VLOOKUP($A68,FB_26,2,0))=16,\"\",VLOOKUP($A68,FB_26,2,0))&IF(TYPE(VLOOKUP($A68,FB_27,2,0))=16,\"\",VLOOKUP($A68,FB_27,2,0))&IF(TYPE(VLOOKUP($A68,FB_28,2,0))=16,\"\",VLOOKUP($A68,FB_28,2,0))&IF(TYPE(VLOOKUP($A68,FB_29,2,0))=16,\"\",VLOOKUP($A68,FB_29,2,0))&IF(TYPE(VLOOKUP($A68,FB_30,2,0))=16,\"\",VLOOKUP($A68,FB_30,2,0))","v":""},null,{"$f":"IF($B68=\"\",\"\",_xlfn.NUMBERVALUE(IF(TYPE(VLOOKUP($A68,FB_1,P$5,0))=16,\"\",VLOOKUP($A68,FB_1,P$5,0))&IF(TYPE(VLOOKUP($A68,FB_2,P$5,0))=16,\"\",VLOOKUP($A68,FB_2,P$5,0))&IF(TYPE(VLOOKUP($A68,FB_3,P$5,0))=16,\"\",VLOOKUP($A68,FB_3,P$5,0))&IF(TYPE(VLOOKUP($A68,FB_4,P$5,0))=16,\"\",VLOOKUP($A68,FB_4,P$5,0))&IF(TYPE(VLOOKUP($A68,FB_5,P$5,0))=16,\"\",VLOOKUP($A68,FB_5,P$5,0))&IF(TYPE(VLOOKUP($A68,FB_6,P$5,0))=16,\"\",VLOOKUP($A68,FB_6,P$5,0))&IF(TYPE(VLOOKUP($A68,FB_7,P$5,0))=16,\"\",VLOOKUP($A68,FB_7,P$5,0))&IF(TYPE(VLOOKUP($A68,FB_8,P$5,0))=16,\"\",VLOOKUP($A68,FB_8,P$5,0))&IF(TYPE(VLOOKUP($A68,FB_9,P$5,0))=16,\"\",VLOOKUP($A68,FB_9,P$5,0))&IF(TYPE(VLOOKUP($A68,FB_10,P$5,0))=16,\"\",VLOOKUP($A68,FB_10,P$5,0))&IF(TYPE(VLOOKUP($A68,FB_11,P$5,0))=16,\"\",VLOOKUP($A68,FB_11,P$5,0))&IF(TYPE(VLOOKUP($A68,FB_12,P$5,0))=16,\"\",VLOOKUP($A68,FB_12,P$5,0))&IF(TYPE(VLOOKUP($A68,FB_13,P$5,0))=16,\"\",VLOOKUP($A68,FB_13,P$5,0))&IF(TYPE(VLOOKUP($A68,FB_14,P$5,0))=16,\"\",VLOOKUP($A68,FB_14,P$5,0))&IF(TYPE(VLOOKUP($A68,FB_15,P$5,0))=16,\"\",VLOOKUP($A68,FB_15,P$5,0))&IF(TYPE(VLOOKUP($A68,FB_16,P$5,0))=16,\"\",VLOOKUP($A68,FB_16,P$5,0))&IF(TYPE(VLOOKUP($A68,FB_17,P$5,0))=16,\"\",VLOOKUP($A68,FB_17,P$5,0))&IF(TYPE(VLOOKUP($A68,FB_18,P$5,0))=16,\"\",VLOOKUP($A68,FB_18,P$5,0))&IF(TYPE(VLOOKUP($A68,FB_19,P$5,0))=16,\"\",VLOOKUP($A68,FB_19,P$5,0))&IF(TYPE(VLOOKUP($A68,FB_20,P$5,0))=16,\"\",VLOOKUP($A68,FB_20,P$5,0))&IF(TYPE(VLOOKUP($A68,FB_21,P$5,0))=16,\"\",VLOOKUP($A68,FB_21,P$5,0))&IF(TYPE(VLOOKUP($A68,FB_22,P$5,0))=16,\"\",VLOOKUP($A68,FB_22,P$5,0))&IF(TYPE(VLOOKUP($A68,FB_23,P$5,0))=16,\"\",VLOOKUP($A68,FB_23,P$5,0))&IF(TYPE(VLOOKUP($A68,FB_24,P$5,0))=16,\"\",VLOOKUP($A68,FB_24,P$5,0))&IF(TYPE(VLOOKUP($A68,FB_25,P$5,0))=16,\"\",VLOOKUP($A68,FB_25,P$5,0))&IF(TYPE(VLOOKUP($A68,FB_26,P$5,0))=16,\"\",VLOOKUP($A68,FB_26,P$5,0))&IF(TYPE(VLOOKUP($A68,FB_27,P$5,0))=16,\"\",VLOOKUP($A68,FB_27,P$5,0))&IF(TYPE(VLOOKUP($A68,FB_28,P$5,0))=16,\"\",VLOOKUP($A68,FB_28,P$5,0))&IF(TYPE(VLOOKUP($A68,FB_29,P$5,0))=16,\"\",VLOOKUP($A68,FB_29,P$5,0))&IF(TYPE(VLOOKUP($A68,FB_30,P$5,0))=16,\"\",VLOOKUP($A68,FB_30,P$5,0))))","v":""},"",{"$f":"IF($B68=\"\",\"\",_xlfn.NUMBERVALUE(IF(TYPE(VLOOKUP($A68,FB_1,R$5,0))=16,\"\",VLOOKUP($A68,FB_1,R$5,0))&IF(TYPE(VLOOKUP($A68,FB_2,R$5,0))=16,\"\",VLOOKUP($A68,FB_2,R$5,0))&IF(TYPE(VLOOKUP($A68,FB_3,R$5,0))=16,\"\",VLOOKUP($A68,FB_3,R$5,0))&IF(TYPE(VLOOKUP($A68,FB_4,R$5,0))=16,\"\",VLOOKUP($A68,FB_4,R$5,0))&IF(TYPE(VLOOKUP($A68,FB_5,R$5,0))=16,\"\",VLOOKUP($A68,FB_5,R$5,0))&IF(TYPE(VLOOKUP($A68,FB_6,R$5,0))=16,\"\",VLOOKUP($A68,FB_6,R$5,0))&IF(TYPE(VLOOKUP($A68,FB_7,R$5,0))=16,\"\",VLOOKUP($A68,FB_7,R$5,0))&IF(TYPE(VLOOKUP($A68,FB_8,R$5,0))=16,\"\",VLOOKUP($A68,FB_8,R$5,0))&IF(TYPE(VLOOKUP($A68,FB_9,R$5,0))=16,\"\",VLOOKUP($A68,FB_9,R$5,0))&IF(TYPE(VLOOKUP($A68,FB_10,R$5,0))=16,\"\",VLOOKUP($A68,FB_10,R$5,0))&IF(TYPE(VLOOKUP($A68,FB_11,R$5,0))=16,\"\",VLOOKUP($A68,FB_11,R$5,0))&IF(TYPE(VLOOKUP($A68,FB_12,R$5,0))=16,\"\",VLOOKUP($A68,FB_12,R$5,0))&IF(TYPE(VLOOKUP($A68,FB_13,R$5,0))=16,\"\",VLOOKUP($A68,FB_13,R$5,0))&IF(TYPE(VLOOKUP($A68,FB_14,R$5,0))=16,\"\",VLOOKUP($A68,FB_14,R$5,0))&IF(TYPE(VLOOKUP($A68,FB_15,R$5,0))=16,\"\",VLOOKUP($A68,FB_15,R$5,0))&IF(TYPE(VLOOKUP($A68,FB_16,R$5,0))=16,\"\",VLOOKUP($A68,FB_16,R$5,0))&IF(TYPE(VLOOKUP($A68,FB_17,R$5,0))=16,\"\",VLOOKUP($A68,FB_17,R$5,0))&IF(TYPE(VLOOKUP($A68,FB_18,R$5,0))=16,\"\",VLOOKUP($A68,FB_18,R$5,0))&IF(TYPE(VLOOKUP($A68,FB_19,R$5,0))=16,\"\",VLOOKUP($A68,FB_19,R$5,0))&IF(TYPE(VLOOKUP($A68,FB_20,R$5,0))=16,\"\",VLOOKUP($A68,FB_20,R$5,0))&IF(TYPE(VLOOKUP($A68,FB_21,R$5,0))=16,\"\",VLOOKUP($A68,FB_21,R$5,0))&IF(TYPE(VLOOKUP($A68,FB_22,R$5,0))=16,\"\",VLOOKUP($A68,FB_22,R$5,0))&IF(TYPE(VLOOKUP($A68,FB_23,R$5,0))=16,\"\",VLOOKUP($A68,FB_23,R$5,0))&IF(TYPE(VLOOKUP($A68,FB_24,R$5,0))=16,\"\",VLOOKUP($A68,FB_24,R$5,0))&IF(TYPE(VLOOKUP($A68,FB_25,R$5,0))=16,\"\",VLOOKUP($A68,FB_25,R$5,0))&IF(TYPE(VLOOKUP($A68,FB_26,R$5,0))=16,\"\",VLOOKUP($A68,FB_26,R$5,0))&IF(TYPE(VLOOKUP($A68,FB_27,R$5,0))=16,\"\",VLOOKUP($A68,FB_27,R$5,0))&IF(TYPE(VLOOKUP($A68,FB_28,R$5,0))=16,\"\",VLOOKUP($A68,FB_28,R$5,0))&IF(TYPE(VLOOKUP($A68,FB_29,R$5,0))=16,\"\",VLOOKUP($A68,FB_29,R$5,0))&IF(TYPE(VLOOKUP($A68,FB_30,R$5,0))=16,\"\",VLOOKUP($A68,FB_30,R$5,0))))","v":""},{"$f":"IF($B68=\"\",\"\",IF(TYPE(VLOOKUP($A68,FB_1,S$5,0))=16,\"\",VLOOKUP($A68,FB_1,S$5,0))&IF(TYPE(VLOOKUP($A68,FB_2,S$5,0))=16,\"\",VLOOKUP($A68,FB_2,S$5,0))&IF(TYPE(VLOOKUP($A68,FB_3,S$5,0))=16,\"\",VLOOKUP($A68,FB_3,S$5,0))&IF(TYPE(VLOOKUP($A68,FB_4,S$5,0))=16,\"\",VLOOKUP($A68,FB_4,S$5,0))&IF(TYPE(VLOOKUP($A68,FB_5,S$5,0))=16,\"\",VLOOKUP($A68,FB_5,S$5,0))&IF(TYPE(VLOOKUP($A68,FB_6,S$5,0))=16,\"\",VLOOKUP($A68,FB_6,S$5,0))&IF(TYPE(VLOOKUP($A68,FB_7,S$5,0))=16,\"\",VLOOKUP($A68,FB_7,S$5,0))&IF(TYPE(VLOOKUP($A68,FB_8,S$5,0))=16,\"\",VLOOKUP($A68,FB_8,S$5,0))&IF(TYPE(VLOOKUP($A68,FB_9,S$5,0))=16,\"\",VLOOKUP($A68,FB_9,S$5,0))&IF(TYPE(VLOOKUP($A68,FB_10,S$5,0))=16,\"\",VLOOKUP($A68,FB_10,S$5,0))&IF(TYPE(VLOOKUP($A68,FB_11,S$5,0))=16,\"\",VLOOKUP($A68,FB_11,S$5,0))&IF(TYPE(VLOOKUP($A68,FB_12,S$5,0))=16,\"\",VLOOKUP($A68,FB_12,S$5,0))&IF(TYPE(VLOOKUP($A68,FB_13,S$5,0))=16,\"\",VLOOKUP($A68,FB_13,S$5,0))&IF(TYPE(VLOOKUP($A68,FB_14,S$5,0))=16,\"\",VLOOKUP($A68,FB_14,S$5,0))&IF(TYPE(VLOOKUP($A68,FB_15,S$5,0))=16,\"\",VLOOKUP($A68,FB_15,S$5,0))&IF(TYPE(VLOOKUP($A68,FB_16,S$5,0))=16,\"\",VLOOKUP($A68,FB_16,S$5,0))&IF(TYPE(VLOOKUP($A68,FB_17,S$5,0))=16,\"\",VLOOKUP($A68,FB_17,S$5,0))&IF(TYPE(VLOOKUP($A68,FB_18,S$5,0))=16,\"\",VLOOKUP($A68,FB_18,S$5,0))&IF(TYPE(VLOOKUP($A68,FB_19,S$5,0))=16,\"\",VLOOKUP($A68,FB_19,S$5,0))&IF(TYPE(VLOOKUP($A68,FB_20,S$5,0))=16,\"\",VLOOKUP($A68,FB_20,S$5,0))&IF(TYPE(VLOOKUP($A68,FB_21,S$5,0))=16,\"\",VLOOKUP($A68,FB_21,S$5,0))&IF(TYPE(VLOOKUP($A68,FB_22,S$5,0))=16,\"\",VLOOKUP($A68,FB_22,S$5,0))&IF(TYPE(VLOOKUP($A68,FB_23,S$5,0))=16,\"\",VLOOKUP($A68,FB_23,S$5,0))&IF(TYPE(VLOOKUP($A68,FB_24,S$5,0))=16,\"\",VLOOKUP($A68,FB_24,S$5,0))&IF(TYPE(VLOOKUP($A68,FB_25,S$5,0))=16,\"\",VLOOKUP($A68,FB_25,S$5,0))&IF(TYPE(VLOOKUP($A68,FB_26,S$5,0))=16,\"\",VLOOKUP($A68,FB_26,S$5,0))&IF(TYPE(VLOOKUP($A68,FB_27,S$5,0))=16,\"\",VLOOKUP($A68,FB_27,S$5,0))&IF(TYPE(VLOOKUP($A68,FB_28,S$5,0))=16,\"\",VLOOKUP($A68,FB_28,S$5,0))&IF(TYPE(VLOOKUP($A68,FB_29,S$5,0))=16,\"\",VLOOKUP($A68,FB_29,S$5,0))&IF(TYPE(VLOOKUP($A68,FB_30,S$5,0))=16,\"\",VLOOKUP($A68,FB_30,S$5,0)))","v":""},null,null,null,null,null,null,null,null,null,null,null,null,null,null,null,null,"",":","","",""]
["40.",{"$f":"IF(TYPE(VLOOKUP($A69,FB_1,2,0))=16,\"\",VLOOKUP($A69,FB_1,2,0))&IF(TYPE(VLOOKUP($A69,FB_2,2,0))=16,\"\",VLOOKUP($A69,FB_2,2,0))&IF(TYPE(VLOOKUP($A69,FB_3,2,0))=16,\"\",VLOOKUP($A69,FB_3,2,0))&IF(TYPE(VLOOKUP($A69,FB_4,2,0))=16,\"\",VLOOKUP($A69,FB_4,2,0))&IF(TYPE(VLOOKUP($A69,FB_5,2,0))=16,\"\",VLOOKUP($A69,FB_5,2,0))&IF(TYPE(VLOOKUP($A69,FB_6,2,0))=16,\"\",VLOOKUP($A69,FB_6,2,0))&IF(TYPE(VLOOKUP($A69,FB_7,2,0))=16,\"\",VLOOKUP($A69,FB_7,2,0))&IF(TYPE(VLOOKUP($A69,FB_8,2,0))=16,\"\",VLOOKUP($A69,FB_8,2,0))&IF(TYPE(VLOOKUP($A69,FB_9,2,0))=16,\"\",VLOOKUP($A69,FB_9,2,0))&IF(TYPE(VLOOKUP($A69,FB_10,2,0))=16,\"\",VLOOKUP($A69,FB_10,2,0))&IF(TYPE(VLOOKUP($A69,FB_11,2,0))=16,\"\",VLOOKUP($A69,FB_11,2,0))&IF(TYPE(VLOOKUP($A69,FB_12,2,0))=16,\"\",VLOOKUP($A69,FB_12,2,0))&IF(TYPE(VLOOKUP($A69,FB_13,2,0))=16,\"\",VLOOKUP($A69,FB_13,2,0))&IF(TYPE(VLOOKUP($A69,FB_14,2,0))=16,\"\",VLOOKUP($A69,FB_14,2,0))&IF(TYPE(VLOOKUP($A69,FB_15,2,0))=16,\"\",VLOOKUP($A69,FB_15,2,0))&IF(TYPE(VLOOKUP($A69,FB_16,2,0))=16,\"\",VLOOKUP($A69,FB_16,2,0))&IF(TYPE(VLOOKUP($A69,FB_17,2,0))=16,\"\",VLOOKUP($A69,FB_17,2,0))&IF(TYPE(VLOOKUP($A69,FB_18,2,0))=16,\"\",VLOOKUP($A69,FB_18,2,0))&IF(TYPE(VLOOKUP($A69,FB_19,2,0))=16,\"\",VLOOKUP($A69,FB_19,2,0))&IF(TYPE(VLOOKUP($A69,FB_20,2,0))=16,\"\",VLOOKUP($A69,FB_20,2,0))&IF(TYPE(VLOOKUP($A69,FB_21,2,0))=16,\"\",VLOOKUP($A69,FB_21,2,0))&IF(TYPE(VLOOKUP($A69,FB_22,2,0))=16,\"\",VLOOKUP($A69,FB_22,2,0))&IF(TYPE(VLOOKUP($A69,FB_23,2,0))=16,\"\",VLOOKUP($A69,FB_23,2,0))&IF(TYPE(VLOOKUP($A69,FB_24,2,0))=16,\"\",VLOOKUP($A69,FB_24,2,0))&IF(TYPE(VLOOKUP($A69,FB_25,2,0))=16,\"\",VLOOKUP($A69,FB_25,2,0))&IF(TYPE(VLOOKUP($A69,FB_26,2,0))=16,\"\",VLOOKUP($A69,FB_26,2,0))&IF(TYPE(VLOOKUP($A69,FB_27,2,0))=16,\"\",VLOOKUP($A69,FB_27,2,0))&IF(TYPE(VLOOKUP($A69,FB_28,2,0))=16,\"\",VLOOKUP($A69,FB_28,2,0))&IF(TYPE(VLOOKUP($A69,FB_29,2,0))=16,\"\",VLOOKUP($A69,FB_29,2,0))&IF(TYPE(VLOOKUP($A69,FB_30,2,0))=16,\"\",VLOOKUP($A69,FB_30,2,0))","v":""},null,{"$f":"IF($B69=\"\",\"\",_xlfn.NUMBERVALUE(IF(TYPE(VLOOKUP($A69,FB_1,P$5,0))=16,\"\",VLOOKUP($A69,FB_1,P$5,0))&IF(TYPE(VLOOKUP($A69,FB_2,P$5,0))=16,\"\",VLOOKUP($A69,FB_2,P$5,0))&IF(TYPE(VLOOKUP($A69,FB_3,P$5,0))=16,\"\",VLOOKUP($A69,FB_3,P$5,0))&IF(TYPE(VLOOKUP($A69,FB_4,P$5,0))=16,\"\",VLOOKUP($A69,FB_4,P$5,0))&IF(TYPE(VLOOKUP($A69,FB_5,P$5,0))=16,\"\",VLOOKUP($A69,FB_5,P$5,0))&IF(TYPE(VLOOKUP($A69,FB_6,P$5,0))=16,\"\",VLOOKUP($A69,FB_6,P$5,0))&IF(TYPE(VLOOKUP($A69,FB_7,P$5,0))=16,\"\",VLOOKUP($A69,FB_7,P$5,0))&IF(TYPE(VLOOKUP($A69,FB_8,P$5,0))=16,\"\",VLOOKUP($A69,FB_8,P$5,0))&IF(TYPE(VLOOKUP($A69,FB_9,P$5,0))=16,\"\",VLOOKUP($A69,FB_9,P$5,0))&IF(TYPE(VLOOKUP($A69,FB_10,P$5,0))=16,\"\",VLOOKUP($A69,FB_10,P$5,0))&IF(TYPE(VLOOKUP($A69,FB_11,P$5,0))=16,\"\",VLOOKUP($A69,FB_11,P$5,0))&IF(TYPE(VLOOKUP($A69,FB_12,P$5,0))=16,\"\",VLOOKUP($A69,FB_12,P$5,0))&IF(TYPE(VLOOKUP($A69,FB_13,P$5,0))=16,\"\",VLOOKUP($A69,FB_13,P$5,0))&IF(TYPE(VLOOKUP($A69,FB_14,P$5,0))=16,\"\",VLOOKUP($A69,FB_14,P$5,0))&IF(TYPE(VLOOKUP($A69,FB_15,P$5,0))=16,\"\",VLOOKUP($A69,FB_15,P$5,0))&IF(TYPE(VLOOKUP($A69,FB_16,P$5,0))=16,\"\",VLOOKUP($A69,FB_16,P$5,0))&IF(TYPE(VLOOKUP($A69,FB_17,P$5,0))=16,\"\",VLOOKUP($A69,FB_17,P$5,0))&IF(TYPE(VLOOKUP($A69,FB_18,P$5,0))=16,\"\",VLOOKUP($A69,FB_18,P$5,0))&IF(TYPE(VLOOKUP($A69,FB_19,P$5,0))=16,\"\",VLOOKUP($A69,FB_19,P$5,0))&IF(TYPE(VLOOKUP($A69,FB_20,P$5,0))=16,\"\",VLOOKUP($A69,FB_20,P$5,0))&IF(TYPE(VLOOKUP($A69,FB_21,P$5,0))=16,\"\",VLOOKUP($A69,FB_21,P$5,0))&IF(TYPE(VLOOKUP($A69,FB_22,P$5,0))=16,\"\",VLOOKUP($A69,FB_22,P$5,0))&IF(TYPE(VLOOKUP($A69,FB_23,P$5,0))=16,\"\",VLOOKUP($A69,FB_23,P$5,0))&IF(TYPE(VLOOKUP($A69,FB_24,P$5,0))=16,\"\",VLOOKUP($A69,FB_24,P$5,0))&IF(TYPE(VLOOKUP($A69,FB_25,P$5,0))=16,\"\",VLOOKUP($A69,FB_25,P$5,0))&IF(TYPE(VLOOKUP($A69,FB_26,P$5,0))=16,\"\",VLOOKUP($A69,FB_26,P$5,0))&IF(TYPE(VLOOKUP($A69,FB_27,P$5,0))=16,\"\",VLOOKUP($A69,FB_27,P$5,0))&IF(TYPE(VLOOKUP($A69,FB_28,P$5,0))=16,\"\",VLOOKUP($A69,FB_28,P$5,0))&IF(TYPE(VLOOKUP($A69,FB_29,P$5,0))=16,\"\",VLOOKUP($A69,FB_29,P$5,0))&IF(TYPE(VLOOKUP($A69,FB_30,P$5,0))=16,\"\",VLOOKUP($A69,FB_30,P$5,0))))","v":""},"",{"$f":"IF($B69=\"\",\"\",_xlfn.NUMBERVALUE(IF(TYPE(VLOOKUP($A69,FB_1,R$5,0))=16,\"\",VLOOKUP($A69,FB_1,R$5,0))&IF(TYPE(VLOOKUP($A69,FB_2,R$5,0))=16,\"\",VLOOKUP($A69,FB_2,R$5,0))&IF(TYPE(VLOOKUP($A69,FB_3,R$5,0))=16,\"\",VLOOKUP($A69,FB_3,R$5,0))&IF(TYPE(VLOOKUP($A69,FB_4,R$5,0))=16,\"\",VLOOKUP($A69,FB_4,R$5,0))&IF(TYPE(VLOOKUP($A69,FB_5,R$5,0))=16,\"\",VLOOKUP($A69,FB_5,R$5,0))&IF(TYPE(VLOOKUP($A69,FB_6,R$5,0))=16,\"\",VLOOKUP($A69,FB_6,R$5,0))&IF(TYPE(VLOOKUP($A69,FB_7,R$5,0))=16,\"\",VLOOKUP($A69,FB_7,R$5,0))&IF(TYPE(VLOOKUP($A69,FB_8,R$5,0))=16,\"\",VLOOKUP($A69,FB_8,R$5,0))&IF(TYPE(VLOOKUP($A69,FB_9,R$5,0))=16,\"\",VLOOKUP($A69,FB_9,R$5,0))&IF(TYPE(VLOOKUP($A69,FB_10,R$5,0))=16,\"\",VLOOKUP($A69,FB_10,R$5,0))&IF(TYPE(VLOOKUP($A69,FB_11,R$5,0))=16,\"\",VLOOKUP($A69,FB_11,R$5,0))&IF(TYPE(VLOOKUP($A69,FB_12,R$5,0))=16,\"\",VLOOKUP($A69,FB_12,R$5,0))&IF(TYPE(VLOOKUP($A69,FB_13,R$5,0))=16,\"\",VLOOKUP($A69,FB_13,R$5,0))&IF(TYPE(VLOOKUP($A69,FB_14,R$5,0))=16,\"\",VLOOKUP($A69,FB_14,R$5,0))&IF(TYPE(VLOOKUP($A69,FB_15,R$5,0))=16,\"\",VLOOKUP($A69,FB_15,R$5,0))&IF(TYPE(VLOOKUP($A69,FB_16,R$5,0))=16,\"\",VLOOKUP($A69,FB_16,R$5,0))&IF(TYPE(VLOOKUP($A69,FB_17,R$5,0))=16,\"\",VLOOKUP($A69,FB_17,R$5,0))&IF(TYPE(VLOOKUP($A69,FB_18,R$5,0))=16,\"\",VLOOKUP($A69,FB_18,R$5,0))&IF(TYPE(VLOOKUP($A69,FB_19,R$5,0))=16,\"\",VLOOKUP($A69,FB_19,R$5,0))&IF(TYPE(VLOOKUP($A69,FB_20,R$5,0))=16,\"\",VLOOKUP($A69,FB_20,R$5,0))&IF(TYPE(VLOOKUP($A69,FB_21,R$5,0))=16,\"\",VLOOKUP($A69,FB_21,R$5,0))&IF(TYPE(VLOOKUP($A69,FB_22,R$5,0))=16,\"\",VLOOKUP($A69,FB_22,R$5,0))&IF(TYPE(VLOOKUP($A69,FB_23,R$5,0))=16,\"\",VLOOKUP($A69,FB_23,R$5,0))&IF(TYPE(VLOOKUP($A69,FB_24,R$5,0))=16,\"\",VLOOKUP($A69,FB_24,R$5,0))&IF(TYPE(VLOOKUP($A69,FB_25,R$5,0))=16,\"\",VLOOKUP($A69,FB_25,R$5,0))&IF(TYPE(VLOOKUP($A69,FB_26,R$5,0))=16,\"\",VLOOKUP($A69,FB_26,R$5,0))&IF(TYPE(VLOOKUP($A69,FB_27,R$5,0))=16,\"\",VLOOKUP($A69,FB_27,R$5,0))&IF(TYPE(VLOOKUP($A69,FB_28,R$5,0))=16,\"\",VLOOKUP($A69,FB_28,R$5,0))&IF(TYPE(VLOOKUP($A69,FB_29,R$5,0))=16,\"\",VLOOKUP($A69,FB_29,R$5,0))&IF(TYPE(VLOOKUP($A69,FB_30,R$5,0))=16,\"\",VLOOKUP($A69,FB_30,R$5,0))))","v":""},{"$f":"IF($B69=\"\",\"\",IF(TYPE(VLOOKUP($A69,FB_1,S$5,0))=16,\"\",VLOOKUP($A69,FB_1,S$5,0))&IF(TYPE(VLOOKUP($A69,FB_2,S$5,0))=16,\"\",VLOOKUP($A69,FB_2,S$5,0))&IF(TYPE(VLOOKUP($A69,FB_3,S$5,0))=16,\"\",VLOOKUP($A69,FB_3,S$5,0))&IF(TYPE(VLOOKUP($A69,FB_4,S$5,0))=16,\"\",VLOOKUP($A69,FB_4,S$5,0))&IF(TYPE(VLOOKUP($A69,FB_5,S$5,0))=16,\"\",VLOOKUP($A69,FB_5,S$5,0))&IF(TYPE(VLOOKUP($A69,FB_6,S$5,0))=16,\"\",VLOOKUP($A69,FB_6,S$5,0))&IF(TYPE(VLOOKUP($A69,FB_7,S$5,0))=16,\"\",VLOOKUP($A69,FB_7,S$5,0))&IF(TYPE(VLOOKUP($A69,FB_8,S$5,0))=16,\"\",VLOOKUP($A69,FB_8,S$5,0))&IF(TYPE(VLOOKUP($A69,FB_9,S$5,0))=16,\"\",VLOOKUP($A69,FB_9,S$5,0))&IF(TYPE(VLOOKUP($A69,FB_10,S$5,0))=16,\"\",VLOOKUP($A69,FB_10,S$5,0))&IF(TYPE(VLOOKUP($A69,FB_11,S$5,0))=16,\"\",VLOOKUP($A69,FB_11,S$5,0))&IF(TYPE(VLOOKUP($A69,FB_12,S$5,0))=16,\"\",VLOOKUP($A69,FB_12,S$5,0))&IF(TYPE(VLOOKUP($A69,FB_13,S$5,0))=16,\"\",VLOOKUP($A69,FB_13,S$5,0))&IF(TYPE(VLOOKUP($A69,FB_14,S$5,0))=16,\"\",VLOOKUP($A69,FB_14,S$5,0))&IF(TYPE(VLOOKUP($A69,FB_15,S$5,0))=16,\"\",VLOOKUP($A69,FB_15,S$5,0))&IF(TYPE(VLOOKUP($A69,FB_16,S$5,0))=16,\"\",VLOOKUP($A69,FB_16,S$5,0))&IF(TYPE(VLOOKUP($A69,FB_17,S$5,0))=16,\"\",VLOOKUP($A69,FB_17,S$5,0))&IF(TYPE(VLOOKUP($A69,FB_18,S$5,0))=16,\"\",VLOOKUP($A69,FB_18,S$5,0))&IF(TYPE(VLOOKUP($A69,FB_19,S$5,0))=16,\"\",VLOOKUP($A69,FB_19,S$5,0))&IF(TYPE(VLOOKUP($A69,FB_20,S$5,0))=16,\"\",VLOOKUP($A69,FB_20,S$5,0))&IF(TYPE(VLOOKUP($A69,FB_21,S$5,0))=16,\"\",VLOOKUP($A69,FB_21,S$5,0))&IF(TYPE(VLOOKUP($A69,FB_22,S$5,0))=16,\"\",VLOOKUP($A69,FB_22,S$5,0))&IF(TYPE(VLOOKUP($A69,FB_23,S$5,0))=16,\"\",VLOOKUP($A69,FB_23,S$5,0))&IF(TYPE(VLOOKUP($A69,FB_24,S$5,0))=16,\"\",VLOOKUP($A69,FB_24,S$5,0))&IF(TYPE(VLOOKUP($A69,FB_25,S$5,0))=16,\"\",VLOOKUP($A69,FB_25,S$5,0))&IF(TYPE(VLOOKUP($A69,FB_26,S$5,0))=16,\"\",VLOOKUP($A69,FB_26,S$5,0))&IF(TYPE(VLOOKUP($A69,FB_27,S$5,0))=16,\"\",VLOOKUP($A69,FB_27,S$5,0))&IF(TYPE(VLOOKUP($A69,FB_28,S$5,0))=16,\"\",VLOOKUP($A69,FB_28,S$5,0))&IF(TYPE(VLOOKUP($A69,FB_29,S$5,0))=16,\"\",VLOOKUP($A69,FB_29,S$5,0))&IF(TYPE(VLOOKUP($A69,FB_30,S$5,0))=16,\"\",VLOOKUP($A69,FB_30,S$5,0)))","v":""},null,null,null,null,null,null,null,null,null,null,null,null,null,null,null,null,{"$f":"IF(G69=\"\",\"\",G69)","v":""},":","","",""]
["Summe Gesamtpunkte",null,null,{"$f":"SUM(D30:D69)","v":0},{"$f":"IF(A70=\"\",\"\",\"/\")","v":"/"},{"$f":"SUM(F30:F69)","v":48},null,null,null,null,null,null,null,null,null,null,null,null,null,null,null,null,null,"Summe",":",{"$f":"SUM(Z30:Z69)","v":0},"/",{"$f":"SUM(AB30:AB69)","v":48}]
[]
["ACHTUNG:"]
[{"$f":"\"Da die Bearbeitung dieser Fragenliste im Rahmen eines Arbeitsauftrages durchgeführt wurde, werde ich \"&TEXT(P4,\"0%\")&\" der von dir erreichten Punkte (also \"&ROUND(D70*P4,1)&E70&ROUND(F70*P4,1)&\") als Ergebnis in die Notenliste eintragen.\"","v":"Da die Bearbeitung dieser Fragenliste im Rahmen eines Arbeitsauftrages durchgeführt wurde, werde ich 10% der von dir erreichten Punkte (also 0/4,8) als Ergebnis in die Notenliste eintragen."}]
[]
[]
["Unterschrift der/des Erziehungsberechtigten"]